^D:\PORTFOLIO\C++ - PERSONAL PROJECT\VISUAL STUDIO PROJECT - ECOSYSTEM 3.0\VISUAL STUDIO PROJECT - ECOSYSTEM 3.0\ALGAE.CPP
/c /ZI /JMC /nologo /W3 /WX- /diagnostics:classic /sdl /Od /Oy- /D _MBCS /Gm- /EHsc /RTC1 /MDd /GS /fp:precise /permissive- /Zc:wchar_t /Zc:forScope /Zc:inline /Fo"DEBUG\\" /Fd"DEBUG\VC141.PDB" /Gd /TP /analyze- /FC D:\PORTFOLIO\C++ - PERSONAL PROJECT\VISUAL STUDIO PROJECT - ECOSYSTEM 3.0\VISUAL STUDIO PROJECT - ECOSYSTEM 3.0\ALGAE.CPP
^D:\PORTFOLIO\C++ - PERSONAL PROJECT\VISUAL STUDIO PROJECT - ECOSYSTEM 3.0\VISUAL STUDIO PROJECT - ECOSYSTEM 3.0\AMOEBA.CPP
/c /ZI /JMC /nologo /W3 /WX- /diagnostics:classic /sdl /Od /Oy- /D _MBCS /Gm- /EHsc /RTC1 /MDd /GS /fp:precise /permissive- /Zc:wchar_t /Zc:forScope /Zc:inline /Fo"DEBUG\\" /Fd"DEBUG\VC141.PDB" /Gd /TP /analyze- /FC D:\PORTFOLIO\C++ - PERSONAL PROJECT\VISUAL STUDIO PROJECT - ECOSYSTEM 3.0\VISUAL STUDIO PROJECT - ECOSYSTEM 3.0\AMOEBA.CPP
^D:\PORTFOLIO\C++ - PERSONAL PROJECT\VISUAL STUDIO PROJECT - ECOSYSTEM 3.0\VISUAL STUDIO PROJECT - ECOSYSTEM 3.0\CELL.CPP
/c /ZI /JMC /nologo /W3 /WX- /diagnostics:classic /sdl /Od /Oy- /D _MBCS /Gm- /EHsc /RTC1 /MDd /GS /fp:precise /permissive- /Zc:wchar_t /Zc:forScope /Zc:inline /Fo"DEBUG\\" /Fd"DEBUG\VC141.PDB" /Gd /TP /analyze- /FC D:\PORTFOLIO\C++ - PERSONAL PROJECT\VISUAL STUDIO PROJECT - ECOSYSTEM 3.0\VISUAL STUDIO PROJECT - ECOSYSTEM 3.0\CELL.CPP
^D:\PORTFOLIO\C++ - PERSONAL PROJECT\VISUAL STUDIO PROJECT - ECOSYSTEM 3.0\VISUAL STUDIO PROJECT - ECOSYSTEM 3.0\DISPLAY.CPP
/c /ZI /JMC /nologo /W3 /WX- /diagnostics:classic /sdl /Od /Oy- /D _MBCS /Gm- /EHsc /RTC1 /MDd /GS /fp:precise /permissive- /Zc:wchar_t /Zc:forScope /Zc:inline /Fo"DEBUG\\" /Fd"DEBUG\VC141.PDB" /Gd /TP /analyze- /FC D:\PORTFOLIO\C++ - PERSONAL PROJECT\VISUAL STUDIO PROJECT - ECOSYSTEM 3.0\VISUAL STUDIO PROJECT - ECOSYSTEM 3.0\DISPLAY.CPP
^D:\PORTFOLIO\C++ - PERSONAL PROJECT\VISUAL STUDIO PROJECT - ECOSYSTEM 3.0\VISUAL STUDIO PROJECT - ECOSYSTEM 3.0\ENVIRONMENT.CPP
/c /ZI /JMC /nologo /W3 /WX- /diagnostics:classic /sdl /Od /Oy- /D _MBCS /Gm- /EHsc /RTC1 /MDd /GS /fp:precise /permissive- /Zc:wchar_t /Zc:forScope /Zc:inline /Fo"DEBUG\\" /Fd"DEBUG\VC141.PDB" /Gd /TP /analyze- /FC D:\PORTFOLIO\C++ - PERSONAL PROJECT\VISUAL STUDIO PROJECT - ECOSYSTEM 3.0\VISUAL STUDIO PROJECT - ECOSYSTEM 3.0\ENVIRONMENT.CPP
^D:\PORTFOLIO\C++ - PERSONAL PROJECT\VISUAL STUDIO PROJECT - ECOSYSTEM 3.0\VISUAL STUDIO PROJECT - ECOSYSTEM 3.0\GLOBALS.CPP
/c /ZI /JMC /nologo /W3 /WX- /diagnostics:classic /sdl /Od /Oy- /D _MBCS /Gm- /EHsc /RTC1 /MDd /GS /fp:precise /permissive- /Zc:wchar_t /Zc:forScope /Zc:inline /Fo"DEBUG\\" /Fd"DEBUG\VC141.PDB" /Gd /TP /analyze- /FC D:\PORTFOLIO\C++ - PERSONAL PROJECT\VISUAL STUDIO PROJECT - ECOSYSTEM 3.0\VISUAL STUDIO PROJECT - ECOSYSTEM 3.0\GLOBALS.CPP
^D:\PORTFOLIO\C++ - PERSONAL PROJECT\VISUAL STUDIO PROJECT - ECOSYSTEM 3.0\VISUAL STUDIO PROJECT - ECOSYSTEM 3.0\MAIN.CPP
/c /ZI /JMC /nologo /W3 /WX- /diagnostics:classic /sdl /Od /Oy- /D _MBCS /Gm- /EHsc /RTC1 /MDd /GS /fp:precise /permissive- /Zc:wchar_t /Zc:forScope /Zc:inline /Fo"DEBUG\\" /Fd"DEBUG\VC141.PDB" /Gd /TP /analyze- /FC D:\PORTFOLIO\C++ - PERSONAL PROJECT\VISUAL STUDIO PROJECT - ECOSYSTEM 3.0\VISUAL STUDIO PROJECT - ECOSYSTEM 3.0\MAIN.CPP
