%YAML 1.1
%TAG !u! tag:unity3d.com,2011:
--- !u!114 &11400000
MonoBehaviour:
  m_ObjectHideFlags: 0
  m_CorrespondingSourceObject: {fileID: 0}
  m_PrefabInstance: {fileID: 0}
  m_PrefabAsset: {fileID: 0}
  m_GameObject: {fileID: 0}
  m_Enabled: 1
  m_EditorHideFlags: 0
  m_Script: {fileID: 11500000, guid: f5c8458d6a452d945ae10337339d1f0e, type: 3}
  m_Name: A7
  m_EditorClassIdentifier: 
  storyText: "You peak through the bars and see a nastily armed alien who seems to
    be guarding your 'cell'. It's dark in your room and the big fella doesn't seem
    to see you, but from here you get a better view of it's uniform. The helmet is
    a strange but oddly familiar shape which has also been sprayed in red onto the
    guards chest plate. Strangely, written in the middle of the symbol is a human
    number 5.\r\n\r\n1. Wait for him to get distracted or something..\r\n2. Try the
    door  "
  nextStates:
  - {fileID: 11400000, guid: 85f0efd02a594524b81889ea8040a560, type: 2}
