%YAML 1.1
%TAG !u! tag:unity3d.com,2011:
--- !u!114 &11400000
MonoBehaviour:
  m_ObjectHideFlags: 0
  m_CorrespondingSourceObject: {fileID: 0}
  m_PrefabInstance: {fileID: 0}
  m_PrefabAsset: {fileID: 0}
  m_GameObject: {fileID: 0}
  m_Enabled: 1
  m_EditorHideFlags: 0
  m_Script: {fileID: 11500000, guid: f5c8458d6a452d945ae10337339d1f0e, type: 3}
  m_Name: S1
  m_EditorClassIdentifier: 
  storyText: "You slide under the legs of the leader as the ship is pulled down faster
    and faster by the gravity of the planet below. You hear a shout of anger from
    the the giant Goldboid you just outwitted but spare no time to look back, the
    Drive is there 10 feet away from you and as your slide runs out of momentum you
    jump to your feet and sprint towards it. As you draw close enough to bend down
    and grab the machine the galleon is hit by a huge wave of space turbulence and
    both you and the Portable Infinite Improbability Drive are thrown into the air.\r\nYou
    reach out, stretching your fingers as far as possible, but it's not enough you're
    not going to.. oh wait you got it. Now firmly in your hand you just have time
    to notice the ships windscreen coming up to meet you (or you it) but mostly you
    see the gentle golden glow of the jump button:\r\n\r\n1. Press the button..."
  nextStates:
  - {fileID: 11400000, guid: eb9e9b141e8160341be4e4231b9c0262, type: 2}
