%YAML 1.1
%TAG !u! tag:unity3d.com,2011:
--- !u!114 &11400000
MonoBehaviour:
  m_ObjectHideFlags: 0
  m_CorrespondingSourceObject: {fileID: 0}
  m_PrefabInstance: {fileID: 0}
  m_PrefabAsset: {fileID: 0}
  m_GameObject: {fileID: 0}
  m_Enabled: 1
  m_EditorHideFlags: 0
  m_Script: {fileID: 11500000, guid: f5c8458d6a452d945ae10337339d1f0e, type: 3}
  m_Name: A6
  m_EditorClassIdentifier: 
  storyText: "Cell with door with window and flashing lights. All your stuff has been
    taken.\r\n\r\n1. Check through window\r\n2. Try door\r\n"
  nextStates:
  - {fileID: 11400000, guid: 9a0b9d87cf2542140ad77cfffe329ea4, type: 2}
