%YAML 1.1
%TAG !u! tag:unity3d.com,2011:
--- !u!114 &11400000
MonoBehaviour:
  m_ObjectHideFlags: 0
  m_CorrespondingSourceObject: {fileID: 0}
  m_PrefabInstance: {fileID: 0}
  m_PrefabAsset: {fileID: 0}
  m_GameObject: {fileID: 0}
  m_Enabled: 1
  m_EditorHideFlags: 0
  m_Script: {fileID: 11500000, guid: f5c8458d6a452d945ae10337339d1f0e, type: 3}
  m_Name: X1
  m_EditorClassIdentifier: 
  storyText: "The door, amazingly, is unlocked! You saunter out of the makeshift cell
    and right into another Goldboid. This one doesn't waste a second before unholstering
    his blaster and vaporising you on the spot.\r\n\r\n1.Good Job.\r\n"
  nextStates:
  - {fileID: 11400000, guid: 9b61d52edd8a6c946a5f907950b6ce57, type: 2}
