%YAML 1.1
%TAG !u! tag:unity3d.com,2011:
--- !u!1045 &1
EditorBuildSettings:
  m_ObjectHideFlags: 0
  serializedVersion: 2
  m_Scenes:
  - enabled: 0
    path: 
    guid: 00000000000000000000000000000000
  - enabled: 1
    path: Assets/Scenes/Start Menu.unity
    guid: 0806bee7f46185a4da8b0137c1a97962
  - enabled: 1
    path: Assets/Scenes/Core Game.unity
    guid: f6618352ae68c7b4aa1b8e4e114eabdd
  - enabled: 1
    path: Assets/Scenes/Win Screen.unity
    guid: f96dc7c243c40f04dba1c513d3f44323
  m_configObjects: {}
