^C:\USERS\SAMHO\SOURCE\REPOS\ECHOSYSTEM\PROJECT3\DEBUG\ALGAE.OBJ|C:\USERS\SAMHO\SOURCE\REPOS\ECHOSYSTEM\PROJECT3\DEBUG\CELL.OBJ|C:\USERS\SAMHO\SOURCE\REPOS\ECHOSYSTEM\PROJECT3\DEBUG\ENVIRONMENT.OBJ|C:\USERS\SAMHO\SOURCE\REPOS\ECHOSYSTEM\PROJECT3\DEBUG\MAIN.OBJ|C:\USERS\SAMHO\SOURCE\REPOS\ECHOSYSTEM\PROJECT3\DEBUG\SUN.OBJ
C:\USERS\SAMHO\SOURCE\REPOS\ECHOSYSTEM\DEBUG\ECHOSYSTEM.EXE
C:\USERS\SAMHO\SOURCE\REPOS\ECHOSYSTEM\DEBUG\ECHOSYSTEM.ILK
C:\USERS\SAMHO\SOURCE\REPOS\ECHOSYSTEM\DEBUG\ECHOSYSTEM.PDB
