^D:\PORTFOLIO\C++ - PERSONAL PROJECT\VISUAL STUDIO PROJECT - ECOSYSTEM (NEW)\PROJECT3\ALGAE.CPP|D:\PORTFOLIO\C++ - PERSONAL PROJECT\VISUAL STUDIO PROJECT - ECOSYSTEM (NEW)\PROJECT3\CELL.CPP|D:\PORTFOLIO\C++ - PERSONAL PROJECT\VISUAL STUDIO PROJECT - ECOSYSTEM (NEW)\PROJECT3\DISPLAY.CPP|D:\PORTFOLIO\C++ - PERSONAL PROJECT\VISUAL STUDIO PROJECT - ECOSYSTEM (NEW)\PROJECT3\ENVIRONMENT.CPP|D:\PORTFOLIO\C++ - PERSONAL PROJECT\VISUAL STUDIO PROJECT - ECOSYSTEM (NEW)\PROJECT3\GLOBALS.CPP|D:\PORTFOLIO\C++ - PERSONAL PROJECT\VISUAL STUDIO PROJECT - ECOSYSTEM (NEW)\PROJECT3\MAIN.CPP|D:\PORTFOLIO\C++ - PERSONAL PROJECT\VISUAL STUDIO PROJECT - ECOSYSTEM (NEW)\PROJECT3\SUN.CPP
D:\PORTFOLIO\C++ - PERSONAL PROJECT\VISUAL STUDIO PROJECT - ECOSYSTEM (NEW)\PROJECT3\DEBUG\VC141.PDB
D:\PORTFOLIO\C++ - PERSONAL PROJECT\VISUAL STUDIO PROJECT - ECOSYSTEM (NEW)\PROJECT3\DEBUG\VC141.IDB
D:\PORTFOLIO\C++ - PERSONAL PROJECT\VISUAL STUDIO PROJECT - ECOSYSTEM (NEW)\PROJECT3\DEBUG\SUN.OBJ
D:\PORTFOLIO\C++ - PERSONAL PROJECT\VISUAL STUDIO PROJECT - ECOSYSTEM (NEW)\PROJECT3\DEBUG\MAIN.OBJ
D:\PORTFOLIO\C++ - PERSONAL PROJECT\VISUAL STUDIO PROJECT - ECOSYSTEM (NEW)\PROJECT3\DEBUG\GLOBALS.OBJ
D:\PORTFOLIO\C++ - PERSONAL PROJECT\VISUAL STUDIO PROJECT - ECOSYSTEM (NEW)\PROJECT3\DEBUG\ENVIRONMENT.OBJ
D:\PORTFOLIO\C++ - PERSONAL PROJECT\VISUAL STUDIO PROJECT - ECOSYSTEM (NEW)\PROJECT3\DEBUG\DISPLAY.OBJ
D:\PORTFOLIO\C++ - PERSONAL PROJECT\VISUAL STUDIO PROJECT - ECOSYSTEM (NEW)\PROJECT3\DEBUG\CELL.OBJ
D:\PORTFOLIO\C++ - PERSONAL PROJECT\VISUAL STUDIO PROJECT - ECOSYSTEM (NEW)\PROJECT3\DEBUG\ALGAE.OBJ
^D:\PORTFOLIO\C++ - PERSONAL PROJECT\VISUAL STUDIO PROJECT - ECOSYSTEM (NEW)\PROJECT3\SUN.CPP
D:\PORTFOLIO\C++ - PERSONAL PROJECT\VISUAL STUDIO PROJECT - ECOSYSTEM (NEW)\PROJECT3\DEBUG\VC141.PDB
^D:\PORTFOLIO\C++ - PERSONAL PROJECT\VISUAL STUDIO PROJECT - ECOSYSTEM (NEW)\PROJECT3\DISPLAY.CPP|D:\PORTFOLIO\C++ - PERSONAL PROJECT\VISUAL STUDIO PROJECT - ECOSYSTEM (NEW)\PROJECT3\MAIN.CPP
D:\PORTFOLIO\C++ - PERSONAL PROJECT\VISUAL STUDIO PROJECT - ECOSYSTEM (NEW)\PROJECT3\DEBUG\VC141.PDB
D:\PORTFOLIO\C++ - PERSONAL PROJECT\VISUAL STUDIO PROJECT - ECOSYSTEM (NEW)\PROJECT3\DEBUG\VC141.IDB
D:\PORTFOLIO\C++ - PERSONAL PROJECT\VISUAL STUDIO PROJECT - ECOSYSTEM (NEW)\PROJECT3\DEBUG\MAIN.OBJ
D:\PORTFOLIO\C++ - PERSONAL PROJECT\VISUAL STUDIO PROJECT - ECOSYSTEM (NEW)\PROJECT3\DEBUG\DISPLAY.OBJ
^D:\PORTFOLIO\C++ - PERSONAL PROJECT\VISUAL STUDIO PROJECT - ECOSYSTEM (NEW)\PROJECT3\ALGAE.CPP|D:\PORTFOLIO\C++ - PERSONAL PROJECT\VISUAL STUDIO PROJECT - ECOSYSTEM (NEW)\PROJECT3\CELL.CPP|D:\PORTFOLIO\C++ - PERSONAL PROJECT\VISUAL STUDIO PROJECT - ECOSYSTEM (NEW)\PROJECT3\DISPLAY.CPP|D:\PORTFOLIO\C++ - PERSONAL PROJECT\VISUAL STUDIO PROJECT - ECOSYSTEM (NEW)\PROJECT3\ENVIRONMENT.CPP|D:\PORTFOLIO\C++ - PERSONAL PROJECT\VISUAL STUDIO PROJECT - ECOSYSTEM (NEW)\PROJECT3\GLOBALS.CPP|D:\PORTFOLIO\C++ - PERSONAL PROJECT\VISUAL STUDIO PROJECT - ECOSYSTEM (NEW)\PROJECT3\MAIN.CPP
D:\PORTFOLIO\C++ - PERSONAL PROJECT\VISUAL STUDIO PROJECT - ECOSYSTEM (NEW)\PROJECT3\DEBUG\VC141.PDB
D:\PORTFOLIO\C++ - PERSONAL PROJECT\VISUAL STUDIO PROJECT - ECOSYSTEM (NEW)\PROJECT3\DEBUG\VC141.IDB
D:\PORTFOLIO\C++ - PERSONAL PROJECT\VISUAL STUDIO PROJECT - ECOSYSTEM (NEW)\PROJECT3\DEBUG\MAIN.OBJ
D:\PORTFOLIO\C++ - PERSONAL PROJECT\VISUAL STUDIO PROJECT - ECOSYSTEM (NEW)\PROJECT3\DEBUG\GLOBALS.OBJ
D:\PORTFOLIO\C++ - PERSONAL PROJECT\VISUAL STUDIO PROJECT - ECOSYSTEM (NEW)\PROJECT3\DEBUG\ENVIRONMENT.OBJ
D:\PORTFOLIO\C++ - PERSONAL PROJECT\VISUAL STUDIO PROJECT - ECOSYSTEM (NEW)\PROJECT3\DEBUG\DISPLAY.OBJ
D:\PORTFOLIO\C++ - PERSONAL PROJECT\VISUAL STUDIO PROJECT - ECOSYSTEM (NEW)\PROJECT3\DEBUG\CELL.OBJ
D:\PORTFOLIO\C++ - PERSONAL PROJECT\VISUAL STUDIO PROJECT - ECOSYSTEM (NEW)\PROJECT3\DEBUG\ALGAE.OBJ
^D:\PORTFOLIO\C++ - PERSONAL PROJECT\VISUAL STUDIO PROJECT - ECOSYSTEM (NEW)\PROJECT3\AMOEBA.CPP|D:\PORTFOLIO\C++ - PERSONAL PROJECT\VISUAL STUDIO PROJECT - ECOSYSTEM (NEW)\PROJECT3\DISPLAY.CPP|D:\PORTFOLIO\C++ - PERSONAL PROJECT\VISUAL STUDIO PROJECT - ECOSYSTEM (NEW)\PROJECT3\ENVIRONMENT.CPP|D:\PORTFOLIO\C++ - PERSONAL PROJECT\VISUAL STUDIO PROJECT - ECOSYSTEM (NEW)\PROJECT3\MAIN.CPP
D:\PORTFOLIO\C++ - PERSONAL PROJECT\VISUAL STUDIO PROJECT - ECOSYSTEM (NEW)\PROJECT3\DEBUG\VC141.PDB
D:\PORTFOLIO\C++ - PERSONAL PROJECT\VISUAL STUDIO PROJECT - ECOSYSTEM (NEW)\PROJECT3\DEBUG\VC141.IDB
D:\PORTFOLIO\C++ - PERSONAL PROJECT\VISUAL STUDIO PROJECT - ECOSYSTEM (NEW)\PROJECT3\DEBUG\MAIN.OBJ
D:\PORTFOLIO\C++ - PERSONAL PROJECT\VISUAL STUDIO PROJECT - ECOSYSTEM (NEW)\PROJECT3\DEBUG\ENVIRONMENT.OBJ
D:\PORTFOLIO\C++ - PERSONAL PROJECT\VISUAL STUDIO PROJECT - ECOSYSTEM (NEW)\PROJECT3\DEBUG\DISPLAY.OBJ
^D:\PORTFOLIO\C++ - PERSONAL PROJECT\VISUAL STUDIO PROJECT - ECOSYSTEM (NEW)\PROJECT3\ALGAE.CPP|D:\PORTFOLIO\C++ - PERSONAL PROJECT\VISUAL STUDIO PROJECT - ECOSYSTEM (NEW)\PROJECT3\AMOEBA.CPP|D:\PORTFOLIO\C++ - PERSONAL PROJECT\VISUAL STUDIO PROJECT - ECOSYSTEM (NEW)\PROJECT3\DISPLAY.CPP|D:\PORTFOLIO\C++ - PERSONAL PROJECT\VISUAL STUDIO PROJECT - ECOSYSTEM (NEW)\PROJECT3\ENVIRONMENT.CPP|D:\PORTFOLIO\C++ - PERSONAL PROJECT\VISUAL STUDIO PROJECT - ECOSYSTEM (NEW)\PROJECT3\MAIN.CPP
D:\PORTFOLIO\C++ - PERSONAL PROJECT\VISUAL STUDIO PROJECT - ECOSYSTEM (NEW)\PROJECT3\DEBUG\VC141.PDB
D:\PORTFOLIO\C++ - PERSONAL PROJECT\VISUAL STUDIO PROJECT - ECOSYSTEM (NEW)\PROJECT3\DEBUG\VC141.IDB
D:\PORTFOLIO\C++ - PERSONAL PROJECT\VISUAL STUDIO PROJECT - ECOSYSTEM (NEW)\PROJECT3\DEBUG\AMOEBA.OBJ
D:\PORTFOLIO\C++ - PERSONAL PROJECT\VISUAL STUDIO PROJECT - ECOSYSTEM (NEW)\PROJECT3\DEBUG\ALGAE.OBJ
^D:\PORTFOLIO\C++ - PERSONAL PROJECT\VISUAL STUDIO PROJECT - ECOSYSTEM (NEW)\PROJECT3\DISPLAY.CPP|D:\PORTFOLIO\C++ - PERSONAL PROJECT\VISUAL STUDIO PROJECT - ECOSYSTEM (NEW)\PROJECT3\ENVIRONMENT.CPP|D:\PORTFOLIO\C++ - PERSONAL PROJECT\VISUAL STUDIO PROJECT - ECOSYSTEM (NEW)\PROJECT3\MAIN.CPP
D:\PORTFOLIO\C++ - PERSONAL PROJECT\VISUAL STUDIO PROJECT - ECOSYSTEM (NEW)\PROJECT3\DEBUG\VC141.PDB
D:\PORTFOLIO\C++ - PERSONAL PROJECT\VISUAL STUDIO PROJECT - ECOSYSTEM (NEW)\PROJECT3\DEBUG\VC141.IDB
D:\PORTFOLIO\C++ - PERSONAL PROJECT\VISUAL STUDIO PROJECT - ECOSYSTEM (NEW)\PROJECT3\DEBUG\MAIN.OBJ
D:\PORTFOLIO\C++ - PERSONAL PROJECT\VISUAL STUDIO PROJECT - ECOSYSTEM (NEW)\PROJECT3\DEBUG\ENVIRONMENT.OBJ
D:\PORTFOLIO\C++ - PERSONAL PROJECT\VISUAL STUDIO PROJECT - ECOSYSTEM (NEW)\PROJECT3\DEBUG\DISPLAY.OBJ
^D:\PORTFOLIO\C++ - PERSONAL PROJECT\VISUAL STUDIO PROJECT - ECOSYSTEM (NEW)\PROJECT3\ALGAE.CPP|D:\PORTFOLIO\C++ - PERSONAL PROJECT\VISUAL STUDIO PROJECT - ECOSYSTEM (NEW)\PROJECT3\CELL.CPP|D:\PORTFOLIO\C++ - PERSONAL PROJECT\VISUAL STUDIO PROJECT - ECOSYSTEM (NEW)\PROJECT3\DISPLAY.CPP|D:\PORTFOLIO\C++ - PERSONAL PROJECT\VISUAL STUDIO PROJECT - ECOSYSTEM (NEW)\PROJECT3\ENVIRONMENT.CPP|D:\PORTFOLIO\C++ - PERSONAL PROJECT\VISUAL STUDIO PROJECT - ECOSYSTEM (NEW)\PROJECT3\MAIN.CPP
D:\PORTFOLIO\C++ - PERSONAL PROJECT\VISUAL STUDIO PROJECT - ECOSYSTEM (NEW)\PROJECT3\DEBUG\VC141.PDB
D:\PORTFOLIO\C++ - PERSONAL PROJECT\VISUAL STUDIO PROJECT - ECOSYSTEM (NEW)\PROJECT3\DEBUG\VC141.IDB
D:\PORTFOLIO\C++ - PERSONAL PROJECT\VISUAL STUDIO PROJECT - ECOSYSTEM (NEW)\PROJECT3\DEBUG\MAIN.OBJ
D:\PORTFOLIO\C++ - PERSONAL PROJECT\VISUAL STUDIO PROJECT - ECOSYSTEM (NEW)\PROJECT3\DEBUG\ENVIRONMENT.OBJ
D:\PORTFOLIO\C++ - PERSONAL PROJECT\VISUAL STUDIO PROJECT - ECOSYSTEM (NEW)\PROJECT3\DEBUG\DISPLAY.OBJ
D:\PORTFOLIO\C++ - PERSONAL PROJECT\VISUAL STUDIO PROJECT - ECOSYSTEM (NEW)\PROJECT3\DEBUG\CELL.OBJ
D:\PORTFOLIO\C++ - PERSONAL PROJECT\VISUAL STUDIO PROJECT - ECOSYSTEM (NEW)\PROJECT3\DEBUG\ALGAE.OBJ
^D:\PORTFOLIO\C++ - PERSONAL PROJECT\VISUAL STUDIO PROJECT - ECOSYSTEM (NEW)\PROJECT3\AMOEBA.CPP|D:\PORTFOLIO\C++ - PERSONAL PROJECT\VISUAL STUDIO PROJECT - ECOSYSTEM (NEW)\PROJECT3\CELL.CPP|D:\PORTFOLIO\C++ - PERSONAL PROJECT\VISUAL STUDIO PROJECT - ECOSYSTEM (NEW)\PROJECT3\DISPLAY.CPP|D:\PORTFOLIO\C++ - PERSONAL PROJECT\VISUAL STUDIO PROJECT - ECOSYSTEM (NEW)\PROJECT3\ENVIRONMENT.CPP|D:\PORTFOLIO\C++ - PERSONAL PROJECT\VISUAL STUDIO PROJECT - ECOSYSTEM (NEW)\PROJECT3\MAIN.CPP
D:\PORTFOLIO\C++ - PERSONAL PROJECT\VISUAL STUDIO PROJECT - ECOSYSTEM (NEW)\PROJECT3\DEBUG\VC141.PDB
D:\PORTFOLIO\C++ - PERSONAL PROJECT\VISUAL STUDIO PROJECT - ECOSYSTEM (NEW)\PROJECT3\DEBUG\VC141.IDB
D:\PORTFOLIO\C++ - PERSONAL PROJECT\VISUAL STUDIO PROJECT - ECOSYSTEM (NEW)\PROJECT3\DEBUG\MAIN.OBJ
D:\PORTFOLIO\C++ - PERSONAL PROJECT\VISUAL STUDIO PROJECT - ECOSYSTEM (NEW)\PROJECT3\DEBUG\ENVIRONMENT.OBJ
D:\PORTFOLIO\C++ - PERSONAL PROJECT\VISUAL STUDIO PROJECT - ECOSYSTEM (NEW)\PROJECT3\DEBUG\DISPLAY.OBJ
D:\PORTFOLIO\C++ - PERSONAL PROJECT\VISUAL STUDIO PROJECT - ECOSYSTEM (NEW)\PROJECT3\DEBUG\CELL.OBJ
D:\PORTFOLIO\C++ - PERSONAL PROJECT\VISUAL STUDIO PROJECT - ECOSYSTEM (NEW)\PROJECT3\DEBUG\AMOEBA.OBJ
^D:\PORTFOLIO\C++ - PERSONAL PROJECT\VISUAL STUDIO PROJECT - ECOSYSTEM (NEW)\PROJECT3\ALGAE.CPP|D:\PORTFOLIO\C++ - PERSONAL PROJECT\VISUAL STUDIO PROJECT - ECOSYSTEM (NEW)\PROJECT3\AMOEBA.CPP
D:\PORTFOLIO\C++ - PERSONAL PROJECT\VISUAL STUDIO PROJECT - ECOSYSTEM (NEW)\PROJECT3\DEBUG\VC141.PDB
D:\PORTFOLIO\C++ - PERSONAL PROJECT\VISUAL STUDIO PROJECT - ECOSYSTEM (NEW)\PROJECT3\DEBUG\VC141.IDB
D:\PORTFOLIO\C++ - PERSONAL PROJECT\VISUAL STUDIO PROJECT - ECOSYSTEM (NEW)\PROJECT3\DEBUG\AMOEBA.OBJ
D:\PORTFOLIO\C++ - PERSONAL PROJECT\VISUAL STUDIO PROJECT - ECOSYSTEM (NEW)\PROJECT3\DEBUG\ALGAE.OBJ
^D:\PORTFOLIO\C++ - PERSONAL PROJECT\VISUAL STUDIO PROJECT - ECOSYSTEM (NEW)\PROJECT3\ALGAE.CPP|D:\PORTFOLIO\C++ - PERSONAL PROJECT\VISUAL STUDIO PROJECT - ECOSYSTEM (NEW)\PROJECT3\AMOEBA.CPP|D:\PORTFOLIO\C++ - PERSONAL PROJECT\VISUAL STUDIO PROJECT - ECOSYSTEM (NEW)\PROJECT3\CELL.CPP|D:\PORTFOLIO\C++ - PERSONAL PROJECT\VISUAL STUDIO PROJECT - ECOSYSTEM (NEW)\PROJECT3\DISPLAY.CPP|D:\PORTFOLIO\C++ - PERSONAL PROJECT\VISUAL STUDIO PROJECT - ECOSYSTEM (NEW)\PROJECT3\ENVIRONMENT.CPP|D:\PORTFOLIO\C++ - PERSONAL PROJECT\VISUAL STUDIO PROJECT - ECOSYSTEM (NEW)\PROJECT3\GLOBALS.CPP|D:\PORTFOLIO\C++ - PERSONAL PROJECT\VISUAL STUDIO PROJECT - ECOSYSTEM (NEW)\PROJECT3\MAIN.CPP
D:\PORTFOLIO\C++ - PERSONAL PROJECT\VISUAL STUDIO PROJECT - ECOSYSTEM (NEW)\PROJECT3\DEBUG\VC141.PDB
D:\PORTFOLIO\C++ - PERSONAL PROJECT\VISUAL STUDIO PROJECT - ECOSYSTEM (NEW)\PROJECT3\DEBUG\VC141.IDB
D:\PORTFOLIO\C++ - PERSONAL PROJECT\VISUAL STUDIO PROJECT - ECOSYSTEM (NEW)\PROJECT3\DEBUG\MAIN.OBJ
D:\PORTFOLIO\C++ - PERSONAL PROJECT\VISUAL STUDIO PROJECT - ECOSYSTEM (NEW)\PROJECT3\DEBUG\GLOBALS.OBJ
D:\PORTFOLIO\C++ - PERSONAL PROJECT\VISUAL STUDIO PROJECT - ECOSYSTEM (NEW)\PROJECT3\DEBUG\ENVIRONMENT.OBJ
D:\PORTFOLIO\C++ - PERSONAL PROJECT\VISUAL STUDIO PROJECT - ECOSYSTEM (NEW)\PROJECT3\DEBUG\DISPLAY.OBJ
D:\PORTFOLIO\C++ - PERSONAL PROJECT\VISUAL STUDIO PROJECT - ECOSYSTEM (NEW)\PROJECT3\DEBUG\CELL.OBJ
D:\PORTFOLIO\C++ - PERSONAL PROJECT\VISUAL STUDIO PROJECT - ECOSYSTEM (NEW)\PROJECT3\DEBUG\ALGAE.OBJ
^D:\PORTFOLIO\C++ - PERSONAL PROJECT\VISUAL STUDIO PROJECT - ECOSYSTEM (NEW)\PROJECT3\GLOBALS.CPP
D:\PORTFOLIO\C++ - PERSONAL PROJECT\VISUAL STUDIO PROJECT - ECOSYSTEM (NEW)\PROJECT3\DEBUG\GLOBALS.OBJ
^D:\PORTFOLIO\C++ - PERSONAL PROJECT\VISUAL STUDIO PROJECT - ECOSYSTEM (NEW)\PROJECT3\ALGAE.CPP|D:\PORTFOLIO\C++ - PERSONAL PROJECT\VISUAL STUDIO PROJECT - ECOSYSTEM (NEW)\PROJECT3\AMOEBA.CPP|D:\PORTFOLIO\C++ - PERSONAL PROJECT\VISUAL STUDIO PROJECT - ECOSYSTEM (NEW)\PROJECT3\CELL.CPP|D:\PORTFOLIO\C++ - PERSONAL PROJECT\VISUAL STUDIO PROJECT - ECOSYSTEM (NEW)\PROJECT3\DISPLAY.CPP|D:\PORTFOLIO\C++ - PERSONAL PROJECT\VISUAL STUDIO PROJECT - ECOSYSTEM (NEW)\PROJECT3\ENVIRONMENT.CPP|D:\PORTFOLIO\C++ - PERSONAL PROJECT\VISUAL STUDIO PROJECT - ECOSYSTEM (NEW)\PROJECT3\MAIN.CPP
D:\PORTFOLIO\C++ - PERSONAL PROJECT\VISUAL STUDIO PROJECT - ECOSYSTEM (NEW)\PROJECT3\DEBUG\VC141.PDB
D:\PORTFOLIO\C++ - PERSONAL PROJECT\VISUAL STUDIO PROJECT - ECOSYSTEM (NEW)\PROJECT3\DEBUG\VC141.IDB
D:\PORTFOLIO\C++ - PERSONAL PROJECT\VISUAL STUDIO PROJECT - ECOSYSTEM (NEW)\PROJECT3\DEBUG\MAIN.OBJ
D:\PORTFOLIO\C++ - PERSONAL PROJECT\VISUAL STUDIO PROJECT - ECOSYSTEM (NEW)\PROJECT3\DEBUG\ENVIRONMENT.OBJ
D:\PORTFOLIO\C++ - PERSONAL PROJECT\VISUAL STUDIO PROJECT - ECOSYSTEM (NEW)\PROJECT3\DEBUG\DISPLAY.OBJ
D:\PORTFOLIO\C++ - PERSONAL PROJECT\VISUAL STUDIO PROJECT - ECOSYSTEM (NEW)\PROJECT3\DEBUG\CELL.OBJ
D:\PORTFOLIO\C++ - PERSONAL PROJECT\VISUAL STUDIO PROJECT - ECOSYSTEM (NEW)\PROJECT3\DEBUG\ALGAE.OBJ
^D:\PORTFOLIO\C++ - PERSONAL PROJECT\VISUAL STUDIO PROJECT - ECOSYSTEM (NEW)\PROJECT3\ALGAE.CPP
D:\PORTFOLIO\C++ - PERSONAL PROJECT\VISUAL STUDIO PROJECT - ECOSYSTEM (NEW)\PROJECT3\DEBUG\ALGAE.OBJ
^D:\PORTFOLIO\C++ - PERSONAL PROJECT\VISUAL STUDIO PROJECT - ECOSYSTEM (NEW)\PROJECT3\DISPLAY.CPP
D:\PORTFOLIO\C++ - PERSONAL PROJECT\VISUAL STUDIO PROJECT - ECOSYSTEM (NEW)\PROJECT3\DEBUG\DISPLAY.OBJ
^D:\PORTFOLIO\C++ - PERSONAL PROJECT\VISUAL STUDIO PROJECT - ECOSYSTEM (NEW)\PROJECT3\ENVIRONMENT.CPP
D:\PORTFOLIO\C++ - PERSONAL PROJECT\VISUAL STUDIO PROJECT - ECOSYSTEM (NEW)\PROJECT3\DEBUG\ENVIRONMENT.OBJ
^D:\PORTFOLIO\C++ - PERSONAL PROJECT\VISUAL STUDIO PROJECT - ECOSYSTEM (NEW)\PROJECT3\MAIN.CPP
D:\PORTFOLIO\C++ - PERSONAL PROJECT\VISUAL STUDIO PROJECT - ECOSYSTEM (NEW)\PROJECT3\DEBUG\MAIN.OBJ
^D:\PORTFOLIO\C++ - PERSONAL PROJECT\VISUAL STUDIO PROJECT - ECOSYSTEM (NEW)\PROJECT3\AMOEBA.CPP
D:\PORTFOLIO\C++ - PERSONAL PROJECT\VISUAL STUDIO PROJECT - ECOSYSTEM (NEW)\PROJECT3\DEBUG\VC141.PDB
D:\PORTFOLIO\C++ - PERSONAL PROJECT\VISUAL STUDIO PROJECT - ECOSYSTEM (NEW)\PROJECT3\DEBUG\VC141.IDB
D:\PORTFOLIO\C++ - PERSONAL PROJECT\VISUAL STUDIO PROJECT - ECOSYSTEM (NEW)\PROJECT3\DEBUG\AMOEBA.OBJ
^D:\PORTFOLIO\C++ - PERSONAL PROJECT\VISUAL STUDIO PROJECT - ECOSYSTEM (NEW)\PROJECT3\CELL.CPP
D:\PORTFOLIO\C++ - PERSONAL PROJECT\VISUAL STUDIO PROJECT - ECOSYSTEM (NEW)\PROJECT3\DEBUG\VC141.PDB
D:\PORTFOLIO\C++ - PERSONAL PROJECT\VISUAL STUDIO PROJECT - ECOSYSTEM (NEW)\PROJECT3\DEBUG\VC141.IDB
D:\PORTFOLIO\C++ - PERSONAL PROJECT\VISUAL STUDIO PROJECT - ECOSYSTEM (NEW)\PROJECT3\DEBUG\CELL.OBJ
