{
	"hawcons": 
	{
		"name": "Hawcons",
		"path": "assets/images/Hawcons/Font",
		"json": "api/registry/hawcons.json",
		"css": "assets/images/Hawcons/Font/Filled/style.css"
	},

	"bootstrap-glyphicons": 
	{
		"name": "Bootstrap Glyphicons",
		"path": "assets/js/bootstrap/dist",
		"json": "api/registry/bootstrap-glyphicons.json",
		"css": "assets/js/bootstrap/dist/css/bootstrap.min.css",
		"js": "assets/js/bootstrap/dist/js/bootstrap.min.js"
	},

	"ionicons": 
	{
		"name": "Ionicons",
		"path": "assets/js/ionicons",
		"json": "api/registry/ionicons.json",
		"css": "assets/js/ionicons/css/ionicons.min.css"
	},

	"socjs": 
	{
		"name": "SocJS",
		"path": "assets/js/socjs",
		"json": "api/registry/socjs.json",
		"css": "assets/js/socjs/soc.min.css",
		"js": "assets/js/socjs/soc.min.js"
	}
}