{
    "plugins": ["feed", "gitlab", "sitemap-general"],
    "pluginsConfig": {
        "ga": {
            "token": "UA-54302492-20"
        },
        "sharing": {
            "facebook": true,
            "twitter": true,
            "google": true,
            "weibo": false,
            "instapaper": false,
            "vk": false,
            "all": [
                "facebook", "google", "twitter",
                "weibo", "instapaper"
            ]
        },
        "feed": {
            "hostname": "https://notes.saiashirwad.org",
            "title": "Sai Ashirwad Informatia Notes",
            "author": "Sai Ashirwad Informatia Team"
        },
        "gitlab": {
            "url": "https://gitlab.com/SaiLabs/Notes"
        },
        "sitemap-general": {
            "prefix": "https://notes.saiashirwad.org/"
        }
    }
}