<?xml version="1.0" encoding="UTF-8"?>
<svg width="18px" height="10px" viewBox="0 0 18 10" version="1.1" xmlns="http://www.w3.org/2000/svg" xmlns:xlink="http://www.w3.org/1999/xlink">
    <!-- Generator: Sketch 42 (36781) - http://www.bohemiancoding.com/sketch -->
    <title>list</title>
    <desc>Created with Sketch.</desc>
    <defs></defs>
    <g id="Page-1" stroke="none" stroke-width="1" fill="none" fill-rule="evenodd">
        <g id="Dashboard-tab-1" transform="translate(-1283.000000, -853.000000)" fill="#000000">
            <g id="article-list" transform="translate(480.000000, 72.000000)">
                <g id="article-5" transform="translate(0.000000, 768.000000)">
                    <g id="icon-set" transform="translate(760.000000, 0.000000)">
                        <g id="list" transform="translate(43.000000, 13.000000)">
                            <path d="M0,6 L2,6 L2,4 L0,4 L0,6 L0,6 Z M0,10 L2,10 L2,8 L0,8 L0,10 L0,10 Z M0,2 L2,2 L2,0 L0,0 L0,2 L0,2 Z M4,6 L18,6 L18,4 L4,4 L4,6 L4,6 Z M4,10 L18,10 L18,8 L4,8 L4,10 L4,10 Z M4,0 L4,2 L18,2 L18,0 L4,0 L4,0 Z" id="Shape"></path>
                        </g>
                    </g>
                </g>
            </g>
        </g>
    </g>
</svg>