<?xml version="1.0" encoding="UTF-8"?>
<svg width="10px" height="5px" viewBox="0 0 10 5" version="1.1" xmlns="http://www.w3.org/2000/svg" xmlns:xlink="http://www.w3.org/1999/xlink">
    <!-- Generator: Sketch 42 (36781) - http://www.bohemiancoding.com/sketch -->
    <title>arrow-drop-down</title>
    <desc>Created with Sketch.</desc>
    <defs></defs>
    <g id="Page-1" stroke="none" stroke-width="1" fill="none" fill-rule="evenodd">
        <g id="Dashboard-tab-1" transform="translate(-48.000000, -897.000000)" fill="#000000">
            <g id="overview-tabs" transform="translate(24.000000, 336.000000)">
                <g id="list-4" transform="translate(24.000000, 551.000000)">
                    <g id="arrow-drop-down" transform="translate(0.000000, 10.000000)">
                        <polygon id="Shape" points="0 0 5 5 10 0"></polygon>
                    </g>
                </g>
            </g>
        </g>
    </g>
</svg>