{
  "multipleFieldsAllowed":{
    "author":true,
    "editor":true,
    "collection-editor":true,
    "translator":true,
    "director":true,
    "container-author":true
  },
  "kriyaRefTypeToCslType":{
    "journal":"article-journal",
    "book":"book",
    "proceeding":"paper-conference",
    "patent":"patent",
    "website":"webpage"
  },
  "cslRefType": {
    "article": {
      "name": "Article"
    },
    "article-journal": {
      "name": "Journal"
    },
    "article-magazine": {
      "name": "Magazine"
    },
    "article-newspaper": {
      "name": "Newspaper"
    },
    "bill": {
      "name": "Bill"
    },
    "book": {
      "name": "Book"
    },
    "broadcast": {
      "name": "Broadcast"
    },
    "chapter": {
      "name": "Chapter"
    },
    "dataset": {
      "name": "Dataset"
    },
    "entry": {
      "name": "Entry"
    },
    "entry-dictionary": {
      "name": "Entry Dictionary"
    },
    "entry-encyclopedia": {
      "name": "Entry Encyclopedia"
    },
    "figure": {
      "name": "Figure"
    },
    "graphic": {
      "name": "Graphic"
    },
    "interview": {
      "name": "Interview"
    },
    "legal_case": {
      "name": "Legal Case"
    },
    "legislation": {
      "name": "Legislation"
    },
    "manuscript": {
      "name": "Manuscript"
    },
    "map": {
      "name": "Map"
    },
    "motion_picture": {
      "name": "Motion Picture"
    },
    "musical_score": {
      "name": "Musical Score"
    },
    "pamphlet": {
      "name": "Pamphlet"
    },
    "paper-conference": {
      "name": "Proceeding"
    },
    "patent": {
      "name": "Patent"
    },
    "personal_communication": {
      "name": "Personal Communication"
    },
    "post": {
      "name": "Post"
    },
    "post-weblog": {
      "name": "Post Weblog"
    },
    "report": {
      "name": "Report"
    },
    "review": {
      "name": "Review"
    },
    "review-book": {
      "name": "Review Book"
    },
    "song": {
      "name": "Song"
    },
    "speech": {
      "name": "Speech"
    },
    "thesis": {
      "name": "Thesis"
    },
    "treaty": {
      "name": "Treaty"
    },
    "webpage": {
      "name": "Website"
    }
  },
  "cslFieldsMapping": {
    "article": {
      "title": {
        "name": "Title",
        "required": true
      },
      "container-title": {
        "name": "Article Name",
        "required": true
      },
      "volume": {
        "name": "Volume Number"
      },
      "page": {
        "name": "Pages",
        "required": true
      },
      "issue": {
        "name": "Issue Number"
      },
      "ISSN": {
        "name": "ISSN"
      },
      "URL": {
        "name": "URL"
      },
      "issued": {
        "name": "Date Issued",
        "required": true
      },
      "accessed": {
        "name": "Date Accessed"
      },
      "author": {
        "name": "Author"
      },
      "etal": {
        "name": "et al"
      },
      "editor": {
        "name": "Editor"
      },
      "annote": {
        "name": "Annote"
      },
      "collection-title": {
        "name": "Collection Title"
      },
      "note": {
        "name": "Note"
      },
      "event-date": {
        "name": "Event Date"
      },
      "event-place": {
        "name": "Event Place"
      },
      "event": {
        "name": "Event"
      },
      "publisher": {
        "name": "Publisher"
      },
      "container-author": {
        "name": "Container Author"
      },
      "DOI": {
        "name": "Doi"
      },
      "edition": {
        "name": "Edition"
      },
      "page-first": {
        "name": "Page First"
      },
      "page-last": {
        "name": "Page Last"
      },
      "version": {
        "name": "Version"
      },
      "publisher-place": {
        "name": "Publisher Place"
      },
      "submitted": {
        "name": "Submitted"
      },
      "PMCID": {
        "name": "PMCID"
      },
      "PMID": {
        "name": "PMID"
      },
      "number": {
        "name": "Number"
      },
      "citation-number": {
        "name": "Citation Number"
      },
      "reviewed-title": {
        "name": "Reviewed Title"
      },
      "ISBN": {
        "name": "ISBN"
      },
      "number-of-pages": {
        "name": "Number Of Pages"
      },
      "medium": {
        "name": "Medium"
      },
      "section": {
        "name": "Section"
      },
      "recipient": {
        "name": "Recipient"
      },
      "original-date": {
        "name": "Original Date"
      },
      "RefYear": {
        "name": "Year"
      }
    },
    "article-magazine": {
      "title": {
        "name": "Title",
        "required": true
      },
      "container-title": {
        "name": "Magazine Name",
        "required": true
      },
      "volume": {
        "name": "Volume Number"
      },
      "page": {
        "name": "Pages",
        "required": true
      },
      "issue": {
        "name": "Issue Number"
      },
      "ISSN": {
        "name": "ISSN"
      },
      "URL": {
        "name": "URL"
      },
      "issued": {
        "name": "Date Issued",
        "required": true
      },
      "accessed": {
        "name": "Date Accessed"
      },
      "author": {
        "name": "Author"
      },
      "etal": {
        "name": "et al"
      },
      "editor": {
        "name": "Editor"
      },
      "annote": {
        "name": "Annote"
      },
      "collection-title": {
        "name": "Collection Title"
      },
      "note": {
        "name": "Note"
      },
      "event-date": {
        "name": "Event Date"
      },
      "event-place": {
        "name": "Event Place"
      },
      "event": {
        "name": "Event"
      },
      "publisher": {
        "name": "Publisher"
      },
      "container-author": {
        "name": "Container Author"
      },
      "DOI": {
        "name": "Doi"
      },
      "edition": {
        "name": "Edition"
      },
      "page-first": {
        "name": "Page First"
      },
      "page-last": {
        "name": "Page Last"
      },
      "version": {
        "name": "Version"
      },
      "publisher-place": {
        "name": "Publisher Place"
      },
      "submitted": {
        "name": "Submitted"
      },
      "PMCID": {
        "name": "PMCID"
      },
      "PMID": {
        "name": "PMID"
      },
      "number": {
        "name": "Number"
      },
      "citation-number": {
        "name": "Citation Number"
      },
      "reviewed-title": {
        "name": "Reviewed Title"
      },
      "ISBN": {
        "name": "ISBN"
      },
      "number-of-pages": {
        "name": "Number Of Pages"
      },
      "medium": {
        "name": "Medium"
      },
      "section": {
        "name": "Section"
      },
      "recipient": {
        "name": "Recipient"
      },
      "original-date": {
        "name": "Original Date"
      },
      "RefYear": {
        "name": "Year"
      }
    },
    "article-newspaper": {
      "title": {
        "name": "Title of Article",
        "required": true
      },
      "container-title": {
        "name": "Name of Newspaper",
        "required": true
      },
      "section": {
        "name": "Section Name"
      },
      "page": {
        "name": "Pages",
        "required": true
      },
      "issue": {
        "name": "Issue Number"
      },
      "URL": {
        "name": "URL"
      },
      "issued": {
        "name": "Date Issued",
        "required": true
      },
      "accessed": {
        "name": "Date Accessed"
      },
      "author": {
        "name": "Author"
      },
      "etal": {
        "name": "et al"
      },
      "editor": {
        "name": "Editor"
      },
      "annote": {
        "name": "Annote"
      },
      "collection-title": {
        "name": "Collection Title"
      },
      "note": {
        "name": "Note"
      },
      "event-date": {
        "name": "Event Date"
      },
      "event-place": {
        "name": "Event Place"
      },
      "event": {
        "name": "Event"
      },
      "publisher": {
        "name": "Publisher"
      },
      "container-author": {
        "name": "Container Author"
      },
      "DOI": {
        "name": "Doi"
      },
      "edition": {
        "name": "Edition"
      },
      "page-first": {
        "name": "Page First"
      },
      "page-last": {
        "name": "Page Last"
      },
      "version": {
        "name": "Version"
      },
      "publisher-place": {
        "name": "Publisher Place"
      },
      "submitted": {
        "name": "Submitted"
      },
      "PMCID": {
        "name": "PMCID"
      },
      "PMID": {
        "name": "PMID"
      },
      "number": {
        "name": "Number"
      },
      "citation-number": {
        "name": "Citation Number"
      },
      "reviewed-title": {
        "name": "Reviewed Title"
      },
      "volume": {
        "name": "Volume"
      },
      "ISBN": {
        "name": "ISBN"
      },
      "number-of-pages": {
        "name": "Number Of Pages"
      },
      "medium": {
        "name": "Medium"
      },
      "recipient": {
        "name": "Recipient"
      },
      "original-date": {
        "name": "Original Date"
      },
      "RefYear": {
        "name": "Year"
      }
    },
    "article-journal": {
      "title": {
        "name": "Title",
        "required": true
      },
      "container-title": {
        "name": "Journal",
        "required": true
      },
      "journalAbbreviation": {
        "name": "Journal Abbreviation"
      },
      "volume": {
        "name": "Volume Number"
      },
      "issue": {
        "name": "Issue Number"
      },
      "page": {
        "name": "Pages",
        "required": true
      },
      "DOI": {
        "name": "DOI"
      },
      "URL": {
        "name": "URL"
      },
      "issued": {
        "name": "Date of publication",
        "required": true
      },
      "author": {
        "name": "Author"
      },
      "etal": {
        "name": "et al"
      },
      "editor": {
        "name": "Editor"
      },
      "annote": {
        "name": "Annote"
      },
      "collection-title": {
        "name": "Collection Title"
      },
      "note": {
        "name": "Note"
      },
      "event-date": {
        "name": "Event Date"
      },
      "event-place": {
        "name": "Event Place"
      },
      "event": {
        "name": "Event"
      },
      "publisher": {
        "name": "Publisher"
      },
      "container-author": {
        "name": "Container Author"
      },
      "edition": {
        "name": "Edition"
      },
      "page-first": {
        "name": "Page First"
      },
      "page-last": {
        "name": "Page Last"
      },
      "version": {
        "name": "Version"
      },
      "publisher-place": {
        "name": "Publisher Place"
      },
      "submitted": {
        "name": "Submitted"
      },
      "accessed": {
        "name": "Accessed"
      },
      "PMCID": {
        "name": "PMCID"
      },
      "PMID": {
        "name": "PMID"
      },
      "number": {
        "name": "Number"
      },
      "citation-number": {
        "name": "Citation Number"
      },
      "reviewed-title": {
        "name": "Reviewed Title"
      },
      "ISBN": {
        "name": "ISBN"
      },
      "number-of-pages": {
        "name": "Number Of Pages"
      },
      "medium": {
        "name": "Medium"
      },
      "section": {
        "name": "Section"
      },
      "recipient": {
        "name": "Recipient"
      },
      "original-date": {
        "name": "Original Date"
      },
      "RefYear": {
        "name": "Year"
      }
    },
    "bill": {
      "title": {
        "name": "Bill-title",
        "required": true
      },
      "number": {
        "name": "Bill-number"
      },
      "page": {
        "name": "Code-pages"
      },
      "volume": {
        "name": "Code-volume"
      },
      "section": {
        "name": "Section"
      },
      "publisher": {
        "name": "Legislative-body"
      },
      "issued": {
        "name": "Date",
        "required": true
      },
      "accessed": {
        "name": "Date-accessed"
      },
      "author": {
        "name": "Sponsor"
      },
      "annote": {
        "name": "Annote"
      },
      "collection-title": {
        "name": "Collection Title"
      },
      "container-title": {
        "name": "Container Title"
      },
      "note": {
        "name": "Note"
      },
      "event-date": {
        "name": "Event Date"
      },
      "event-place": {
        "name": "Event Place"
      },
      "event": {
        "name": "Event"
      },
      "container-author": {
        "name": "Container Author"
      },
      "DOI": {
        "name": "Doi"
      },
      "editor": {
        "name": "Editor"
      },
      "edition": {
        "name": "Edition"
      },
      "page-first": {
        "name": "Page First"
      },
      "page-last": {
        "name": "Page Last"
      },
      "issue": {
        "name": "Issue"
      },
      "version": {
        "name": "Version"
      },
      "publisher-place": {
        "name": "Publisher Place"
      },
      "submitted": {
        "name": "Submitted"
      },
      "PMCID": {
        "name": "PMCID"
      },
      "PMID": {
        "name": "PMID"
      },
      "citation-number": {
        "name": "Citation Number"
      },
      "reviewed-title": {
        "name": "Reviewed Title"
      },
      "URL": {
        "name": "URL"
      },
      "ISBN": {
        "name": "ISBN"
      },
      "number-of-pages": {
        "name": "Number Of Pages"
      },
      "medium": {
        "name": "Medium"
      },
      "recipient": {
        "name": "Recipient"
      },
      "original-date": {
        "name": "Original Date"
      },
      "RefYear": {
        "name": "Year"
      }
    },
    "book": {
      "title": {
        "name": "Book title",
        "required": true
      },
      "collection-title": {
        "name": "Series title"
      },
      "collection-number": {
        "name": "Series number"
      },
      "number-of-pages": {
        "name": "Number of pages"
      },
      "volume": {
        "name": "Volume number"
      },
      "edition": {
        "name": "Edition number"
      },
      "publisher": {
        "name": "Publisher",
        "required": true
      },
      "publisher-place": {
        "name": "Publisher location"
      },
      "issued": {
        "name": "Date of publication",
        "required": true
      },
      "accessed": {
        "name": "Access date"
      },
      "author": {
        "name": "Author"
      },
      "etal": {
        "name": "et al"
      },
      "editor": {
        "name": "Editor"
      },
      "collection-editor": {
        "name": "Series Editor"
      },
      "translator": {
        "name": "Translator"
      },
      "annote": {
        "name": "Annote"
      },
      "container-title": {
        "name": "Container Title"
      },
      "note": {
        "name": "Note"
      },
      "event-date": {
        "name": "Event Date"
      },
      "event-place": {
        "name": "Event Place"
      },
      "event": {
        "name": "Event"
      },
      "container-author": {
        "name": "Container Author"
      },
      "DOI": {
        "name": "Doi"
      },
      "page": {
        "name": "Page"
      },
      "page-first": {
        "name": "Page First"
      },
      "page-last": {
        "name": "Page Last"
      },
      "issue": {
        "name": "Issue"
      },
      "version": {
        "name": "Version"
      },
      "submitted": {
        "name": "Submitted"
      },
      "PMCID": {
        "name": "PMCID"
      },
      "PMID": {
        "name": "PMID"
      },
      "number": {
        "name": "Number"
      },
      "citation-number": {
        "name": "Citation Number"
      },
      "reviewed-title": {
        "name": "Reviewed Title"
      },
      "URL": {
        "name": "URL"
      },
      "ISBN": {
        "name": "ISBN"
      },
      "medium": {
        "name": "Medium"
      },
      "section": {
        "name": "Section"
      },
      "recipient": {
        "name": "Recipient"
      },
      "original-date": {
        "name": "Original Date"
      },
      "RefYear": {
        "name": "Year"
      }
    },
    "thesis": {
      "title": {
        "name": "Title ",
        "required": true
      },
      "number-of-pages": {
        "name": "Number of pages"
      },
      "publisher": {
        "name": "University ",
        "required": true
      },
      "publisher-place": {
        "name": "University location"
      },
      "issued": {
        "name": "Date ",
        "required": true
      },
      "accessed": {
        "name": "Date accessed"
      },
      "author": {
        "name": "Author"
      },
      "etal": {
        "name": "et al"
      },
      "annote": {
        "name": "Annote"
      },
      "collection-title": {
        "name": "Collection Title"
      },
      "container-title": {
        "name": "Container Title"
      },
      "note": {
        "name": "Note"
      },
      "event-date": {
        "name": "Event Date"
      },
      "event-place": {
        "name": "Event Place"
      },
      "event": {
        "name": "Event"
      },
      "container-author": {
        "name": "Container Author"
      },
      "DOI": {
        "name": "Doi"
      },
      "editor": {
        "name": "Editor"
      },
      "edition": {
        "name": "Edition"
      },
      "page": {
        "name": "Page"
      },
      "page-first": {
        "name": "Page First"
      },
      "page-last": {
        "name": "Page Last"
      },
      "issue": {
        "name": "Issue"
      },
      "version": {
        "name": "Version"
      },
      "submitted": {
        "name": "Submitted"
      },
      "PMCID": {
        "name": "PMCID"
      },
      "PMID": {
        "name": "PMID"
      },
      "number": {
        "name": "Number"
      },
      "citation-number": {
        "name": "Citation Number"
      },
      "reviewed-title": {
        "name": "Reviewed Title"
      },
      "URL": {
        "name": "URL"
      },
      "volume": {
        "name": "Volume"
      },
      "ISBN": {
        "name": "ISBN"
      },
      "medium": {
        "name": "Medium"
      },
      "section": {
        "name": "Section"
      },
      "recipient": {
        "name": "Recipient"
      },
      "original-date": {
        "name": "Original Date"
      },
      "RefYear": {
        "name": "Year"
      }
    },
    "webpage": {
      "title": {
        "name": "Content title",
        "required": true
      },
      "container-title": {
        "name": "Website title",
        "required": true
      },
      "URL": {
        "name": "URL",
        "required": true
      },
      "issued": {
        "name": "Date published",
        "required": true
      },
      "accessed": {
        "name": "Date accessed"
      },
      "author": {
        "name": "Author"
      },
      "etal": {
        "name": "et al"
      },
      "annote": {
        "name": "Annote"
      },
      "collection-title": {
        "name": "Collection Title"
      },
      "note": {
        "name": "Note"
      },
      "event-date": {
        "name": "Event Date"
      },
      "event-place": {
        "name": "Event Place"
      },
      "event": {
        "name": "Event"
      },
      "publisher": {
        "name": "Publisher"
      },
      "container-author": {
        "name": "Container Author"
      },
      "DOI": {
        "name": "Doi"
      },
      "editor": {
        "name": "Editor"
      },
      "edition": {
        "name": "Edition"
      },
      "page": {
        "name": "Page"
      },
      "page-first": {
        "name": "Page First"
      },
      "page-last": {
        "name": "Page Last"
      },
      "issue": {
        "name": "Issue"
      },
      "version": {
        "name": "Version"
      },
      "publisher-place": {
        "name": "Publisher Place"
      },
      "submitted": {
        "name": "Submitted"
      },
      "PMCID": {
        "name": "PMCID"
      },
      "PMID": {
        "name": "PMID"
      },
      "number": {
        "name": "Number"
      },
      "citation-number": {
        "name": "Citation Number"
      },
      "reviewed-title": {
        "name": "Reviewed Title"
      },
      "volume": {
        "name": "Volume"
      },
      "ISBN": {
        "name": "ISBN"
      },
      "number-of-pages": {
        "name": "Number Of Pages"
      },
      "medium": {
        "name": "Medium"
      },
      "section": {
        "name": "Section"
      },
      "recipient": {
        "name": "Recipient"
      },
      "original-date": {
        "name": "Original Date"
      },
      "RefYear": {
        "name": "Year"
      }
    },
    "broadcast": {
      "title": {
        "name": "Title"
      },
      "container-title": {
        "name": "Program title",
        "required": true
      },
      "number": {
        "name": "Episode number"
      },
      "medium": {
        "name": "Broadcast format"
      },
      "publisher": {
        "name": "Network",
        "required": true
      },
      "issued": {
        "name": "Date of broadcast",
        "required": true
      },
      "accessed": {
        "name": "Date accessed"
      },
      "author": {
        "name": "Producer"
      },
      "director": {
        "name": "Director"
      },
      "annote": {
        "name": "Annote"
      },
      "collection-title": {
        "name": "Collection Title"
      },
      "note": {
        "name": "Note"
      },
      "event-date": {
        "name": "Event Date"
      },
      "event-place": {
        "name": "Event Place"
      },
      "event": {
        "name": "Event"
      },
      "container-author": {
        "name": "Container Author"
      },
      "DOI": {
        "name": "Doi"
      },
      "editor": {
        "name": "Editor"
      },
      "edition": {
        "name": "Edition"
      },
      "page": {
        "name": "Page"
      },
      "page-first": {
        "name": "Page First"
      },
      "page-last": {
        "name": "Page Last"
      },
      "issue": {
        "name": "Issue"
      },
      "version": {
        "name": "Version"
      },
      "publisher-place": {
        "name": "Publisher Place"
      },
      "submitted": {
        "name": "Submitted"
      },
      "PMCID": {
        "name": "PMCID"
      },
      "PMID": {
        "name": "PMID"
      },
      "citation-number": {
        "name": "Citation Number"
      },
      "reviewed-title": {
        "name": "Reviewed Title"
      },
      "URL": {
        "name": "URL"
      },
      "volume": {
        "name": "Volume"
      },
      "ISBN": {
        "name": "ISBN"
      },
      "number-of-pages": {
        "name": "Number Of Pages"
      },
      "section": {
        "name": "Section"
      },
      "recipient": {
        "name": "Recipient"
      },
      "original-date": {
        "name": "Original Date"
      },
      "RefYear": {
        "name": "Year"
      }
    },
    "chapter": {
      "title": {
        "name": "Chapter Title",
        "required": true
      },
      "container-title": {
        "name": "Book title",
        "required": true
      },
      "chapter-number": {
        "name": "Chapter Number"
      },
      "collection-title": {
        "name": "Series title"
      },
      "collection-number": {
        "name": "Series number"
      },
      "volume": {
        "name": "Volume number"
      },
      "number-of-volumes": {
        "name": "Number of volumes"
      },
      "edition": {
        "name": "Edition number"
      },
      "publisher": {
        "name": "Publisher",
        "required": true
      },
      "publisher-place": {
        "name": "Publisher location"
      },
      "page": {
        "name": "Pages",
        "required": true
      },
      "ISBN": {
        "name": "ISBN"
      },
      "issued": {
        "name": "Date of Publication",
        "required": true
      },
      "accessed": {
        "name": "Date Accessed"
      },
      "author": {
        "name": "Chapter Author"
      },
      "container-author": {
        "name": "Book Author"
      },
      "editor": {
        "name": "Editor"
      },
      "collection-editor": {
        "name": "Series Editor"
      },
      "translator": {
        "name": "Translator"
      },
      "annote": {
        "name": "Annote"
      },
      "note": {
        "name": "Note"
      },
      "event-date": {
        "name": "Event Date"
      },
      "event-place": {
        "name": "Event Place"
      },
      "event": {
        "name": "Event"
      },
      "DOI": {
        "name": "Doi"
      },
      "page-first": {
        "name": "Page First"
      },
      "page-last": {
        "name": "Page Last"
      },
      "issue": {
        "name": "Issue"
      },
      "version": {
        "name": "Version"
      },
      "submitted": {
        "name": "Submitted"
      },
      "PMCID": {
        "name": "PMCID"
      },
      "PMID": {
        "name": "PMID"
      },
      "number": {
        "name": "Number"
      },
      "citation-number": {
        "name": "Citation Number"
      },
      "reviewed-title": {
        "name": "Reviewed Title"
      },
      "URL": {
        "name": "URL"
      },
      "number-of-pages": {
        "name": "Number Of Pages"
      },
      "medium": {
        "name": "Medium"
      },
      "section": {
        "name": "Section"
      },
      "recipient": {
        "name": "Recipient"
      },
      "original-date": {
        "name": "Original Date"
      },
      "RefYear": {
        "name": "Year"
      }
    },
    "entry-encyclopedia": {
      "title": {
        "name": "Entry title",
        "required": true
      },
      "container-title": {
        "name": "Encyclopedia title",
        "required": true
      },
      "collection-title": {
        "name": "Series"
      },
      "collection-number": {
        "name": "Series Number"
      },
      "volume": {
        "name": "Volume Number"
      },
      "number-of-volumes": {
        "name": "Number of Volumes"
      },
      "edition": {
        "name": "Edition Number"
      },
      "publisher": {
        "name": "Publisher"
      },
      "publisher-place": {
        "name": "Publisher Location"
      },
      "page": {
        "name": "Pages",
        "required": true
      },
      "issued": {
        "name": "Date of Entry",
        "required": true
      },
      "accessed": {
        "name": "Date Accessed"
      },
      "author": {
        "name": "Author"
      },
      "etal": {
        "name": "et al"
      },
      "editor": {
        "name": "Editor"
      },
      "collection-editor": {
        "name": "Series Editor"
      },
      "translator": {
        "name": "Translator"
      },
      "annote": {
        "name": "Annote"
      },
      "note": {
        "name": "Note"
      },
      "event-date": {
        "name": "Event Date"
      },
      "event-place": {
        "name": "Event Place"
      },
      "event": {
        "name": "Event"
      },
      "container-author": {
        "name": "Container Author"
      },
      "DOI": {
        "name": "Doi"
      },
      "page-first": {
        "name": "Page First"
      },
      "page-last": {
        "name": "Page Last"
      },
      "issue": {
        "name": "Issue"
      },
      "version": {
        "name": "Version"
      },
      "submitted": {
        "name": "Submitted"
      },
      "PMCID": {
        "name": "PMCID"
      },
      "PMID": {
        "name": "PMID"
      },
      "number": {
        "name": "Number"
      },
      "citation-number": {
        "name": "Citation Number"
      },
      "reviewed-title": {
        "name": "Reviewed Title"
      },
      "URL": {
        "name": "URL"
      },
      "ISBN": {
        "name": "ISBN"
      },
      "number-of-pages": {
        "name": "Number Of Pages"
      },
      "medium": {
        "name": "Medium"
      },
      "section": {
        "name": "Section"
      },
      "recipient": {
        "name": "Recipient"
      },
      "original-date": {
        "name": "Original Date"
      },
      "RefYear": {
        "name": "Year"
      }
    },
    "legislation": {
      "title": {
        "name": "Title",
        "required": true
      },
      "number": {
        "name": "Statute number"
      },
      "section": {
        "name": "Section number"
      },
      "page": {
        "name": "Pages",
        "required": true
      },
      "issued": {
        "name": "Date",
        "required": true
      },
      "accessed": {
        "name": "Date accessed"
      },
      "author": {
        "name": "Author"
      },
      "etal": {
        "name": "et al"
      },
      "annote": {
        "name": "Annote"
      },
      "collection-title": {
        "name": "Collection Title"
      },
      "container-title": {
        "name": "Container Title"
      },
      "note": {
        "name": "Note"
      },
      "event-date": {
        "name": "Event Date"
      },
      "event-place": {
        "name": "Event Place"
      },
      "event": {
        "name": "Event"
      },
      "publisher": {
        "name": "Publisher"
      },
      "container-author": {
        "name": "Container Author"
      },
      "DOI": {
        "name": "Doi"
      },
      "editor": {
        "name": "Editor"
      },
      "edition": {
        "name": "Edition"
      },
      "page-first": {
        "name": "Page First"
      },
      "page-last": {
        "name": "Page Last"
      },
      "issue": {
        "name": "Issue"
      },
      "version": {
        "name": "Version"
      },
      "publisher-place": {
        "name": "Publisher Place"
      },
      "submitted": {
        "name": "Submitted"
      },
      "PMCID": {
        "name": "PMCID"
      },
      "PMID": {
        "name": "PMID"
      },
      "citation-number": {
        "name": "Citation Number"
      },
      "reviewed-title": {
        "name": "Reviewed Title"
      },
      "URL": {
        "name": "URL"
      },
      "volume": {
        "name": "Volume"
      },
      "ISBN": {
        "name": "ISBN"
      },
      "number-of-pages": {
        "name": "Number Of Pages"
      },
      "medium": {
        "name": "Medium"
      },
      "recipient": {
        "name": "Recipient"
      },
      "original-date": {
        "name": "Original Date"
      },
      "RefYear": {
        "name": "Year"
      }
    },
    "legal_case": {
      "title": {
        "name": "Case name",
        "required": true
      },
      "authority": {
        "name": "Court",
        "required": true
      },
      "number": {
        "name": "Docket number"
      },
      "issued": {
        "name": "Date of case",
        "required": true
      },
      "accessed": {
        "name": "Date accessed"
      },
      "author": {
        "name": "Author"
      },
      "etal": {
        "name": "et al"
      },
      "annote": {
        "name": "Annote"
      },
      "collection-title": {
        "name": "Collection Title"
      },
      "container-title": {
        "name": "Container Title"
      },
      "note": {
        "name": "Note"
      },
      "event-date": {
        "name": "Event Date"
      },
      "event-place": {
        "name": "Event Place"
      },
      "event": {
        "name": "Event"
      },
      "publisher": {
        "name": "Publisher"
      },
      "container-author": {
        "name": "Container Author"
      },
      "DOI": {
        "name": "Doi"
      },
      "editor": {
        "name": "Editor"
      },
      "edition": {
        "name": "Edition"
      },
      "page": {
        "name": "Page"
      },
      "page-first": {
        "name": "Page First"
      },
      "page-last": {
        "name": "Page Last"
      },
      "issue": {
        "name": "Issue"
      },
      "version": {
        "name": "Version"
      },
      "publisher-place": {
        "name": "Publisher Place"
      },
      "submitted": {
        "name": "Submitted"
      },
      "PMCID": {
        "name": "PMCID"
      },
      "PMID": {
        "name": "PMID"
      },
      "citation-number": {
        "name": "Citation Number"
      },
      "reviewed-title": {
        "name": "Reviewed Title"
      },
      "URL": {
        "name": "URL"
      },
      "volume": {
        "name": "Volume"
      },
      "ISBN": {
        "name": "ISBN"
      },
      "number-of-pages": {
        "name": "Number Of Pages"
      },
      "medium": {
        "name": "Medium"
      },
      "section": {
        "name": "Section"
      },
      "recipient": {
        "name": "Recipient"
      },
      "original-date": {
        "name": "Original Date"
      },
      "RefYear": {
        "name": "Year"
      }
    },
    "motion_picture": {
      "title": {
        "name": "Title of film",
        "required": true
      },
      "publisher": {
        "name": "Distributor"
      },
      "genre": {
        "name": "Genre"
      },
      "language": {
        "name": "Language"
      },
      "format": {
        "name": "Format"
      },
      "issued": {
        "name": "Date of film",
        "required": true
      },
      "accessed": {
        "name": "Date accessed"
      },
      "author": {
        "name": "Scriptwriter"
      },
      "director": {
        "name": "Director"
      },
      "editor": {
        "name": "Producer"
      },
      "annote": {
        "name": "Annote"
      },
      "collection-title": {
        "name": "Collection Title"
      },
      "container-title": {
        "name": "Container Title"
      },
      "note": {
        "name": "Note"
      },
      "event-date": {
        "name": "Event Date"
      },
      "event-place": {
        "name": "Event Place"
      },
      "event": {
        "name": "Event"
      },
      "container-author": {
        "name": "Container Author"
      },
      "DOI": {
        "name": "Doi"
      },
      "edition": {
        "name": "Edition"
      },
      "page": {
        "name": "Page"
      },
      "page-first": {
        "name": "Page First"
      },
      "page-last": {
        "name": "Page Last"
      },
      "issue": {
        "name": "Issue"
      },
      "version": {
        "name": "Version"
      },
      "publisher-place": {
        "name": "Publisher Place"
      },
      "submitted": {
        "name": "Submitted"
      },
      "PMCID": {
        "name": "PMCID"
      },
      "PMID": {
        "name": "PMID"
      },
      "number": {
        "name": "Number"
      },
      "citation-number": {
        "name": "Citation Number"
      },
      "reviewed-title": {
        "name": "Reviewed Title"
      },
      "URL": {
        "name": "URL"
      },
      "volume": {
        "name": "Volume"
      },
      "ISBN": {
        "name": "ISBN"
      },
      "number-of-pages": {
        "name": "Number Of Pages"
      },
      "medium": {
        "name": "Medium"
      },
      "section": {
        "name": "Section"
      },
      "recipient": {
        "name": "Recipient"
      },
      "original-date": {
        "name": "Original Date"
      },
      "RefYear": {
        "name": "Year"
      }
    },
    "paper-conference": {
      "title": {
        "name": "Title",
        "required": true
      },
      "event": {
        "name": "Conference name",
        "required": true
      },
      "publisher-place": {
        "name": "Conference location",
        "required": true
      },
      "issued": {
        "name": "Date of conference",
        "required": true
      },
      "author": {
        "name": "Author"
      },
      "etal": {
        "name": "et al"
      },
      "editor": {
        "name": "Editor"
      },
      "collection-editor": {
        "name": "Series Editor"
      },
      "translator": {
        "name": "Translator"
      },
      "annote": {
        "name": "Annote"
      },
      "collection-title": {
        "name": "Collection Title"
      },
      "container-title": {
        "name": "Container Title"
      },
      "note": {
        "name": "Note"
      },
      "event-date": {
        "name": "Event Date"
      },
      "event-place": {
        "name": "Event Place"
      },
      "publisher": {
        "name": "Publisher"
      },
      "container-author": {
        "name": "Container Author"
      },
      "DOI": {
        "name": "Doi"
      },
      "edition": {
        "name": "Edition"
      },
      "page": {
        "name": "Page"
      },
      "page-first": {
        "name": "Page First"
      },
      "page-last": {
        "name": "Page Last"
      },
      "issue": {
        "name": "Issue"
      },
      "version": {
        "name": "Version"
      },
      "submitted": {
        "name": "Submitted"
      },
      "accessed": {
        "name": "Accessed"
      },
      "PMCID": {
        "name": "PMCID"
      },
      "PMID": {
        "name": "PMID"
      },
      "number": {
        "name": "Number"
      },
      "citation-number": {
        "name": "Citation Number"
      },
      "reviewed-title": {
        "name": "Reviewed Title"
      },
      "URL": {
        "name": "URL"
      },
      "volume": {
        "name": "Volume"
      },
      "ISBN": {
        "name": "ISBN"
      },
      "number-of-pages": {
        "name": "Number Of Pages"
      },
      "medium": {
        "name": "Medium"
      },
      "section": {
        "name": "Section"
      },
      "recipient": {
        "name": "Recipient"
      },
      "original-date": {
        "name": "Original Date"
      },
      "RefYear": {
        "name": "Year"
      }
    },
    "patent": {
      "title": {
        "name": "Title",
        "required": true
      },
      "number": {
        "name": "Patent number",
        "required": true
      },
      "jurisdiction": {
        "name": "Jurisdiction",
        "required": true
      },
      "page": {
        "name": "Pages",
        "required": true
      },
      "publisher": {
        "name": "Issuer",
        "required": true
      },
      "issued": {
        "name": "Date issued",
        "required": true
      },
      "accessed": {
        "name": "Date accessed"
      },
      "author": {
        "name": "Inventor"
      },
      "annote": {
        "name": "Annote"
      },
      "collection-title": {
        "name": "Collection Title"
      },
      "container-title": {
        "name": "Container Title"
      },
      "note": {
        "name": "Note"
      },
      "event-date": {
        "name": "Event Date"
      },
      "event-place": {
        "name": "Event Place"
      },
      "event": {
        "name": "Event"
      },
      "container-author": {
        "name": "Container Author"
      },
      "DOI": {
        "name": "Doi"
      },
      "editor": {
        "name": "Editor"
      },
      "edition": {
        "name": "Edition"
      },
      "page-first": {
        "name": "Page First"
      },
      "page-last": {
        "name": "Page Last"
      },
      "issue": {
        "name": "Issue"
      },
      "version": {
        "name": "Version"
      },
      "publisher-place": {
        "name": "Publisher Place"
      },
      "submitted": {
        "name": "Submitted"
      },
      "PMCID": {
        "name": "PMCID"
      },
      "PMID": {
        "name": "PMID"
      },
      "citation-number": {
        "name": "Citation Number"
      },
      "reviewed-title": {
        "name": "Reviewed Title"
      },
      "URL": {
        "name": "URL"
      },
      "volume": {
        "name": "Volume"
      },
      "ISBN": {
        "name": "ISBN"
      },
      "number-of-pages": {
        "name": "Number Of Pages"
      },
      "medium": {
        "name": "Medium"
      },
      "section": {
        "name": "Section"
      },
      "recipient": {
        "name": "Recipient"
      },
      "original-date": {
        "name": "Original Date"
      },
      "RefYear": {
        "name": "Year"
      }
    },
    "report": {
      "title": {
        "name": "Title",
        "required": true
      },
      "number": {
        "name": "Report number"
      },
      "collection-title": {
        "name": "Series"
      },
      "container-title": {
        "name": "Publication"
      },
      "publisher": {
        "name": "Publisher",
        "required": true
      },
      "page": {
        "name": "Pages",
        "required": true
      },
      "URL": {
        "name": "URL"
      },
      "issued": {
        "name": "Date published",
        "required": true
      },
      "accessed": {
        "name": "Date accessed"
      },
      "author": {
        "name": "Author"
      },
      "etal": {
        "name": "et al"
      },
      "collection-editor": {
        "name": "Series editor"
      },
      "translator": {
        "name": "Translator"
      },
      "annote": {
        "name": "Annote"
      },
      "note": {
        "name": "Note"
      },
      "event-date": {
        "name": "Event Date"
      },
      "event-place": {
        "name": "Event Place"
      },
      "event": {
        "name": "Event"
      },
      "container-author": {
        "name": "Container Author"
      },
      "DOI": {
        "name": "Doi"
      },
      "editor": {
        "name": "Editor"
      },
      "edition": {
        "name": "Edition"
      },
      "page-first": {
        "name": "Page First"
      },
      "page-last": {
        "name": "Page Last"
      },
      "issue": {
        "name": "Issue"
      },
      "version": {
        "name": "Version"
      },
      "publisher-place": {
        "name": "Publisher Place"
      },
      "submitted": {
        "name": "Submitted"
      },
      "PMCID": {
        "name": "PMCID"
      },
      "PMID": {
        "name": "PMID"
      },
      "citation-number": {
        "name": "Citation Number"
      },
      "reviewed-title": {
        "name": "Reviewed Title"
      },
      "volume": {
        "name": "Volume"
      },
      "ISBN": {
        "name": "ISBN"
      },
      "number-of-pages": {
        "name": "Number Of Pages"
      },
      "medium": {
        "name": "Medium"
      },
      "section": {
        "name": "Section"
      },
      "recipient": {
        "name": "Recipient"
      },
      "original-date": {
        "name": "Original Date"
      },
      "RefYear": {
        "name": "Year"
      }
    },
    "speech": {
      "title": {
        "name": "Title",
        "required": true
      },
      "event": {
        "name": "Event name",
        "required": true
      },
      "event-place": {
        "name": "Event location"
      },
      "language": {
        "name": "Language"
      },
      "issued": {
        "name": "Date",
        "required": true
      },
      "author": {
        "name": "Presenter"
      },
      "annote": {
        "name": "Annote"
      },
      "collection-title": {
        "name": "Collection Title"
      },
      "container-title": {
        "name": "Container Title"
      },
      "note": {
        "name": "Note"
      },
      "event-date": {
        "name": "Event Date"
      },
      "publisher": {
        "name": "Publisher"
      },
      "container-author": {
        "name": "Container Author"
      },
      "DOI": {
        "name": "Doi"
      },
      "editor": {
        "name": "Editor"
      },
      "edition": {
        "name": "Edition"
      },
      "page": {
        "name": "Page"
      },
      "page-first": {
        "name": "Page First"
      },
      "page-last": {
        "name": "Page Last"
      },
      "issue": {
        "name": "Issue"
      },
      "version": {
        "name": "Version"
      },
      "publisher-place": {
        "name": "Publisher Place"
      },
      "submitted": {
        "name": "Submitted"
      },
      "accessed": {
        "name": "Accessed"
      },
      "PMCID": {
        "name": "PMCID"
      },
      "PMID": {
        "name": "PMID"
      },
      "number": {
        "name": "Number"
      },
      "citation-number": {
        "name": "Citation Number"
      },
      "reviewed-title": {
        "name": "Reviewed Title"
      },
      "URL": {
        "name": "URL"
      },
      "volume": {
        "name": "Volume"
      },
      "ISBN": {
        "name": "ISBN"
      },
      "number-of-pages": {
        "name": "Number Of Pages"
      },
      "medium": {
        "name": "Medium"
      },
      "section": {
        "name": "Section"
      },
      "recipient": {
        "name": "Recipient"
      },
      "original-date": {
        "name": "Original Date"
      },
      "RefYear": {
        "name": "Year"
      }
    }
  },
  "kriyaClassToUi": {
    "article": {
      "RefArticleTitle": "title",
      "RefAuthor": "author",
      "RefEtal": "etal",
      "RefBookSeries": "collection-title",
      "RefBookTitle": "container-title",
      "RefComments": "note",
      "RefConfDate": "event-date",
      "RefConfLoc": "event-place",
      "RefConfName": "event",
      "RefConfSponsor": "publisher",
      "RefCollaboration": "container-author",
      "RefDate": "issued",
      "RefDOI": "DOI",
      "RefEditor": "editor",
      "RefEdition": "edition",
      "RefELocation": "page",
      "RefFPage": "page-first",
      "RefLPage": "page-last",
      "RefIssue": "issue",
      "RefJournalTitle": "container-title",
      "RefSoftTitle": "title",
      "RefSoftVer": "version",
      "RefSubmittedDate": "submitted",
      "RefLAD": "accessed",
      "RefPubDate": "issued",
      "RefPublisherLoc": "publisher-place",
      "RefPMCID": "PMCID",
      "RefPMID": "PMID",
      "RefPublisherName": "publisher",
      "RefPatent": "number",
      "RefSlNo": "citation-number",
      "RefTransTitle": "reviewed-title",
      "RefWebSite": "URL",
      "RefVolume": "volume",
      "RefISBN": "ISBN",
      "RefNPages": "number-of-pages",
      "RefMedium": "medium",
      "RefAnnote": "annote",
      "RefSection": "section",
      "RefRecipient": "recipient",
      "RefOriginalDate": "original-date",
      "RefYear": "RefYear"
    },
    "article-magazine": {
      "RefArticleTitle": "title",
      "RefAuthor": "author",
      "RefEtal": "etal",
      "RefBookSeries": "collection-title",
      "RefBookTitle": "container-title",
      "RefComments": "note",
      "RefConfDate": "event-date",
      "RefConfLoc": "event-place",
      "RefConfName": "event",
      "RefConfSponsor": "publisher",
      "RefCollaboration": "container-author",
      "RefDate": "issued",
      "RefDOI": "DOI",
      "RefEditor": "editor",
      "RefEdition": "edition",
      "RefELocation": "page",
      "RefFPage": "page-first",
      "RefLPage": "page-last",
      "RefIssue": "issue",
      "RefJournalTitle": "container-title",
      "RefSoftTitle": "title",
      "RefSoftVer": "version",
      "RefSubmittedDate": "submitted",
      "RefLAD": "accessed",
      "RefPubDate": "issued",
      "RefPublisherLoc": "publisher-place",
      "RefPMCID": "PMCID",
      "RefPMID": "PMID",
      "RefPublisherName": "publisher",
      "RefPatent": "number",
      "RefSlNo": "citation-number",
      "RefTransTitle": "reviewed-title",
      "RefWebSite": "URL",
      "RefVolume": "volume",
      "RefISBN": "ISBN",
      "RefNPages": "number-of-pages",
      "RefMedium": "medium",
      "RefAnnote": "annote",
      "RefSection": "section",
      "RefRecipient": "recipient",
      "RefOriginalDate": "original-date",
      "RefYear": "RefYear"
    },
    "article-newspaper": {
      "RefArticleTitle": "title",
      "RefAuthor": "author",
      "RefEtal": "etal",
      "RefBookSeries": "collection-title",
      "RefBookTitle": "container-title",
      "RefComments": "note",
      "RefConfDate": "event-date",
      "RefConfLoc": "event-place",
      "RefConfName": "event",
      "RefConfSponsor": "publisher",
      "RefCollaboration": "container-author",
      "RefDate": "issued",
      "RefDOI": "DOI",
      "RefEditor": "editor",
      "RefEdition": "edition",
      "RefELocation": "page",
      "RefFPage": "page-first",
      "RefLPage": "page-last",
      "RefInPress": "annote",
      "RefIssue": "issue",
      "RefJournalTitle": "container-title",
      "RefSoftVer": "version",
      "RefSubmittedDate": "submitted",
      "RefLAD": "accessed",
      "RefPubDate": "issued",
      "RefPublisherLoc": "publisher-place",
      "RefPMCID": "PMCID",
      "RefPMID": "PMID",
      "RefPublisherName": "publisher",
      "RefPatent": "number",
      "RefSlNo": "citation-number",
      "RefTransTitle": "reviewed-title",
      "RefWebSite": "URL",
      "RefVolume": "volume",
      "RefISBN": "ISBN",
      "RefNPages": "number-of-pages",
      "RefMedium": "medium",
      "RefAnnote": "annote",
      "RefSection": "section",
      "RefRecipient": "recipient",
      "RefOriginalDate": "original-date",
      "RefYear": "RefYear"
    },
    "article-journal": {
      "RefArticleTitle": "title",
      "RefAuthor": "author",
      "RefEtal": "etal",
      "RefBookSeries": "collection-title",
      "RefComments": "note",
      "RefConfDate": "event-date",
      "RefConfLoc": "event-place",
      "RefConfName": "event",
      "RefConfSponsor": "publisher",
      "RefCollaboration": "container-author",
      "RefDate": "issued",
      "RefDOI": "DOI",
      "RefEditor": "editor",
      "RefEdition": "edition",
      "RefELocation": "page",
      "RefFPage": "page-first",
      "RefLPage": "page-last",
      "RefIssue": "issue",
      "RefJournalTitle": "container-title",
      "RefSoftVer": "version",
      "RefSoftManName": "publisher",
      "RefSubmittedDate": "submitted",
      "RefLAD": "accessed",
      "RefPublisherLoc": "publisher-place",
      "RefPMCID": "PMCID",
      "RefPMID": "PMID",
      "RefPublisherName": "publisher",
      "RefPatent": "number",
      "RefSlNo": "citation-number",
      "RefTransTitle": "reviewed-title",
      "RefWebSite": "URL",
      "RefVolume": "volume",
      "RefISBN": "ISBN",
      "RefNPages": "number-of-pages",
      "RefMedium": "medium",
      "RefAnnote": "annote",
      "RefSection": "section",
      "RefRecipient": "recipient",
      "RefOriginalDate": "original-date",
      "RefYear": "RefYear"
    },
    "bill": {
      "RefArticleTitle": "title",
      "RefAuthor": "author",
      "RefEtal": "etal",
      "RefBookSeries": "collection-title",
      "RefComments": "note",
      "RefConfDate": "event-date",
      "RefConfLoc": "event-place",
      "RefConfName": "event",
      "RefConfSponsor": "publisher",
      "RefCollaboration": "container-author",
      "RefDate": "issued",
      "RefDOI": "DOI",
      "RefEditor": "editor",
      "RefEdition": "edition",
      "RefELocation": "page",
      "RefFPage": "page-first",
      "RefLPage": "page-last",
      "RefInPress": "annote",
      "RefIssue": "issue",
      "RefJournalTitle": "container-title",
      "RefSoftVer": "version",
      "RefSubmittedDate": "submitted",
      "RefLAD": "accessed",
      "RefPubDate": "issued",
      "RefPublisherLoc": "publisher-place",
      "RefPMCID": "PMCID",
      "RefPMID": "PMID",
      "RefPublisherName": "publisher",
      "RefPatent": "number",
      "RefSlNo": "citation-number",
      "RefThesis": "title",
      "RefTransTitle": "reviewed-title",
      "RefWebSite": "URL",
      "RefVolume": "volume",
      "RefISBN": "ISBN",
      "RefNPages": "number-of-pages",
      "RefMedium": "medium",
      "RefAnnote": "annote",
      "RefSection": "section",
      "RefRecipient": "recipient",
      "RefOriginalDate": "original-date",
      "RefYear": "RefYear"
    },
    "book": {
      "RefAuthor": "author",
      "RefEtal": "etal",
      "RefBookSeries": "collection-title",
      "RefBookTitle": "title",
      "RefComments": "note",
      "RefConfDate": "event-date",
      "RefConfLoc": "event-place",
      "RefConfName": "event",
      "RefConfSponsor": "publisher",
      "RefCollaboration": "container-author",
      "RefJournalTitle": "container-title",
      "RefDate": "issued",
      "RefDOI": "DOI",
      "RefEditor": "editor",
      "RefEdition": "edition",
      "RefELocation": "page",
      "RefFPage": "page-first",
      "RefLPage": "page-last",
      "RefIssue": "issue",
      "RefSoftVer": "version",
      "RefSubmittedDate": "submitted",
      "RefLAD": "accessed",
      "RefPubDate": "issued",
      "RefPublisherLoc": "publisher-place",
      "RefPMCID": "PMCID",
      "RefPMID": "PMID",
      "RefPublisherName": "publisher",
      "RefPatent": "number",
      "RefSlNo": "citation-number",
      "RefTransTitle": "reviewed-title",
      "RefWebSite": "URL",
      "RefVolume": "volume",
      "RefISBN": "ISBN",
      "RefNPages": "number-of-pages",
      "RefMedium": "medium",
      "RefAnnote": "annote",
      "RefSection": "section",
      "RefRecipient": "recipient",
      "RefOriginalDate": "original-date",
      "RefYear": "RefYear"
    },
    "thesis": {
      "RefAuthor": "author",
      "RefEtal": "etal",
      "RefBookSeries": "collection-title",
      "RefComments": "note",
      "RefConfDate": "event-date",
      "RefConfLoc": "event-place",
      "RefConfName": "event",
      "RefConfSponsor": "publisher",
      "RefCollaboration": "container-author",
      "RefDate": "issued",
      "RefDOI": "DOI",
      "RefEditor": "editor",
      "RefEdition": "edition",
      "RefELocation": "page",
      "RefFPage": "page-first",
      "RefLPage": "page-last",
      "RefIssue": "issue",
      "RefSoftVer": "version",
      "RefSoftManName": "publisher",
      "RefSubmittedDate": "submitted",
      "RefLAD": "accessed",
      "RefPubDate": "issued",
      "RefPublisherLoc": "publisher-place",
      "RefPMCID": "PMCID",
      "RefPMID": "PMID",
      "RefPublisherName": "publisher",
      "RefPatent": "number",
      "RefSlNo": "citation-number",
      "RefThesis": "title",
      "RefTransTitle": "reviewed-title",
      "RefWebSite": "URL",
      "RefVolume": "volume",
      "RefISBN": "ISBN",
      "RefNPages": "number-of-pages",
      "RefMedium": "medium",
      "RefAnnote": "annote",
      "RefSection": "section",
      "RefRecipient": "recipient",
      "RefOriginalDate": "original-date",
      "RefYear": "RefYear"
    },
    "webpage": {
      "RefAuthor": "author",
      "RefEtal": "etal",
      "RefBookSeries": "collection-title",
      "RefComments": "note",
      "RefConfDate": "event-date",
      "RefConfLoc": "event-place",
      "RefConfName": "event",
      "RefConfSponsor": "publisher",
      "RefCollaboration": "container-author",
      "RefDate": "issued",
      "RefDOI": "DOI",
      "RefEditor": "editor",
      "RefEdition": "edition",
      "RefELocation": "page",
      "RefFPage": "page-first",
      "RefLPage": "page-last",
      "RefInPress": "annote",
      "RefIssue": "issue",
      "RefJournalTitle": "container-title",
      "RefSoftTitle": "title",
      "RefSoftVer": "version",
      "RefSoftManName": "publisher",
      "RefSoftManLoc": "publisher-place",
      "RefSubmittedDate": "submitted",
      "RefLAD": "accessed",
      "RefPubDate": "issued",
      "RefPMCID": "PMCID",
      "RefPMID": "PMID",
      "RefPatent": "number",
      "RefSlNo": "citation-number",
      "RefTransTitle": "reviewed-title",
      "RefWebSite": "URL",
      "RefVolume": "volume",
      "RefISBN": "ISBN",
      "RefNPages": "number-of-pages",
      "RefMedium": "medium",
      "RefAnnote": "annote",
      "RefSection": "section",
      "RefRecipient": "recipient",
      "RefOriginalDate": "original-date",
      "RefYear": "RefYear"
    },
    "broadcast": {
      "RefAuthor": "author",
      "RefEtal": "etal",
      "RefBookSeries": "collection-title",
      "RefBookTitle": "container-title",
      "RefComments": "note",
      "RefConfDate": "event-date",
      "RefConfLoc": "event-place",
      "RefConfName": "event",
      "RefConfSponsor": "publisher",
      "RefCollaboration": "container-author",
      "RefDate": "issued",
      "RefDOI": "DOI",
      "RefEditor": "editor",
      "RefEdition": "edition",
      "RefELocation": "page",
      "RefFPage": "page-first",
      "RefLPage": "page-last",
      "RefIssue": "issue",
      "RefJournalTitle": "container-title",
      "RefSoftTitle": "title",
      "RefSoftVer": "version",
      "RefSoftManName": "publisher",
      "RefSoftManLoc": "publisher-place",
      "RefSubmittedDate": "submitted",
      "RefLAD": "accessed",
      "RefPubDate": "issued",
      "RefPMCID": "PMCID",
      "RefPMID": "PMID",
      "RefPatent": "number",
      "RefSlNo": "citation-number",
      "RefTransTitle": "reviewed-title",
      "RefWebSite": "URL",
      "RefVolume": "volume",
      "RefISBN": "ISBN",
      "RefNPages": "number-of-pages",
      "RefMedium": "medium",
      "RefAnnote": "annote",
      "RefSection": "section",
      "RefRecipient": "recipient",
      "RefOriginalDate": "original-date",
      "RefYear": "RefYear"
    },
    "chapter": {
      "RefAuthor": "author",
      "RefEtal": "etal",
      "RefBookSeries": "collection-title",
      "RefBookTitle": "container-title",
      "RefComments": "note",
      "RefConfDate": "event-date",
      "RefConfLoc": "event-place",
      "RefConfName": "event",
      "RefConfSponsor": "publisher",
      "RefCollaboration": "container-author",
      "RefChapterTitle": "title",
      "RefDate": "issued",
      "RefDOI": "DOI",
      "RefEditor": "editor",
      "RefEdition": "edition",
      "RefELocation": "page",
      "RefFPage": "page-first",
      "RefLPage": "page-last",
      "RefInPress": "annote",
      "RefIssue": "issue",
      "RefSubmittedDate": "submitted",
      "RefLAD": "accessed",
      "RefPubDate": "issued",
      "RefPublisherLoc": "publisher-place",
      "RefPMCID": "PMCID",
      "RefPMID": "PMID",
      "RefPublisherName": "publisher",
      "RefPatent": "number",
      "RefSlNo": "citation-number",
      "RefTransTitle": "reviewed-title",
      "RefWebSite": "URL",
      "RefVolume": "volume",
      "RefISBN": "ISBN",
      "RefNPages": "number-of-pages",
      "RefMedium": "medium",
      "RefAnnote": "annote",
      "RefSection": "section",
      "RefRecipient": "recipient",
      "RefOriginalDate": "original-date",
      "RefYear": "RefYear"
    },
    "entry-encyclopedia": {
      "RefAnnotation": "annote",
      "RefArticleTitle": "title",
      "RefAuthor": "author",
      "RefEtal": "etal",
      "RefBookSeries": "collection-title",
      "RefBookTitle": "container-title",
      "RefComments": "note",
      "RefConfDate": "event-date",
      "RefConfLoc": "event-place",
      "RefConfName": "event",
      "RefConfSponsor": "publisher",
      "RefConfTitle": "title",
      "RefCollaboration": "container-author",
      "RefChapterTitle": "title",
      "RefDate": "issued",
      "RefDOI": "DOI",
      "RefEditor": "editor",
      "RefEdition": "edition",
      "RefELocation": "page",
      "RefFPage": "page-first",
      "RefLPage": "page-last",
      "RefInPress": "annote",
      "RefIssue": "issue",
      "RefJournalTitle": "container-title",
      "RefSoftTitle": "title",
      "RefSoftVer": "version",
      "RefSoftManName": "publisher",
      "RefSoftManLoc": "publisher-place",
      "RefSubmittedDate": "submitted",
      "RefLAD": "accessed",
      "RefPubDate": "issued",
      "RefPublisherLoc": "publisher-place",
      "RefPMCID": "PMCID",
      "RefPMID": "PMID",
      "RefPublisherName": "publisher",
      "RefPatent": "number",
      "RefSlNo": "citation-number",
      "RefThesis": "title",
      "RefTransTitle": "reviewed-title",
      "RefWebSite": "URL",
      "RefVolume": "volume",
      "RefISBN": "ISBN",
      "RefNPages": "number-of-pages",
      "RefMedium": "medium",
      "RefAnnote": "annote",
      "RefSection": "section",
      "RefRecipient": "recipient",
      "RefOriginalDate": "original-date",
      "RefYear": "RefYear"
    },
    "legislation": {
      "RefAuthor": "author",
      "RefEtal": "etal",
      "RefBookSeries": "collection-title",
      "RefBookTitle": "container-title",
      "RefComments": "note",
      "RefConfDate": "event-date",
      "RefConfLoc": "event-place",
      "RefConfName": "event",
      "RefConfSponsor": "publisher",
      "RefCollaboration": "container-author",
      "RefChapterTitle": "title",
      "RefDate": "issued",
      "RefDOI": "DOI",
      "RefEditor": "editor",
      "RefEdition": "edition",
      "RefELocation": "page",
      "RefFPage": "page-first",
      "RefLPage": "page-last",
      "RefInPress": "annote",
      "RefIssue": "issue",
      "RefJournalTitle": "container-title",
      "RefSubmittedDate": "submitted",
      "RefLAD": "accessed",
      "RefPubDate": "issued",
      "RefPublisherLoc": "publisher-place",
      "RefPMCID": "PMCID",
      "RefPMID": "PMID",
      "RefPublisherName": "publisher",
      "RefPatent": "number",
      "RefSlNo": "citation-number",
      "RefThesis": "title",
      "RefTransTitle": "reviewed-title",
      "RefWebSite": "URL",
      "RefVolume": "volume",
      "RefISBN": "ISBN",
      "RefNPages": "number-of-pages",
      "RefMedium": "medium",
      "RefAnnote": "annote",
      "RefSection": "section",
      "RefRecipient": "recipient",
      "RefOriginalDate": "original-date",
      "RefYear": "RefYear"
    },
    "legal_case": {
      "RefAuthor": "author",
      "RefEtal": "etal",
      "RefBookSeries": "collection-title",
      "RefComments": "note",
      "RefConfDate": "event-date",
      "RefConfLoc": "event-place",
      "RefConfName": "event",
      "RefConfSponsor": "publisher",
      "RefCollaboration": "container-author",
      "RefChapterTitle": "title",
      "RefDate": "issued",
      "RefDOI": "DOI",
      "RefEditor": "editor",
      "RefEdition": "edition",
      "RefELocation": "page",
      "RefFPage": "page-first",
      "RefLPage": "page-last",
      "RefInPress": "annote",
      "RefIssue": "issue",
      "RefJournalTitle": "container-title",
      "RefSubmittedDate": "submitted",
      "RefLAD": "accessed",
      "RefPubDate": "issued",
      "RefPublisherLoc": "publisher-place",
      "RefPMCID": "PMCID",
      "RefPMID": "PMID",
      "RefPublisherName": "publisher",
      "RefPatent": "number",
      "RefSlNo": "citation-number",
      "RefTransTitle": "reviewed-title",
      "RefWebSite": "URL",
      "RefVolume": "volume",
      "RefISBN": "ISBN",
      "RefNPages": "number-of-pages",
      "RefMedium": "medium",
      "RefSection": "section",
      "RefRecipient": "recipient",
      "RefOriginalDate": "original-date",
      "RefYear": "RefYear"
    },
    "motion_picture": {
      "RefAuthor": "author",
      "RefEtal": "etal",
      "RefBookSeries": "collection-title",
      "RefComments": "note",
      "RefConfDate": "event-date",
      "RefConfLoc": "event-place",
      "RefConfName": "event",
      "RefConfSponsor": "publisher",
      "RefConfTitle": "title",
      "RefCollaboration": "container-author",
      "RefDate": "issued",
      "RefDOI": "DOI",
      "RefEditor": "editor",
      "RefEdition": "edition",
      "RefELocation": "page",
      "RefFPage": "page-first",
      "RefLPage": "page-last",
      "RefInPress": "annote",
      "RefIssue": "issue",
      "RefJournalTitle": "container-title",
      "RefSubmittedDate": "submitted",
      "RefLAD": "accessed",
      "RefPubDate": "issued",
      "RefPublisherLoc": "publisher-place",
      "RefPMCID": "PMCID",
      "RefPMID": "PMID",
      "RefPublisherName": "publisher",
      "RefPatent": "number",
      "RefSlNo": "citation-number",
      "RefTransTitle": "reviewed-title",
      "RefWebSite": "URL",
      "RefVolume": "volume",
      "RefISBN": "ISBN",
      "RefNPages": "number-of-pages",
      "RefMedium": "medium",
      "RefAnnote": "annote",
      "RefSection": "section",
      "RefRecipient": "recipient",
      "RefOriginalDate": "original-date",
      "RefYear": "RefYear"
    },
    "paper-conference": {
      "RefAuthor": "author",
      "RefEtal": "etal",
      "RefBookSeries": "collection-title",
      "RefBookTitle": "container-title",
      "RefComments": "note",
      "RefConfDate": "event-date",
      "RefConfLoc": "event-place",
      "RefConfName": "event",
      "RefConfSponsor": "publisher",
      "RefConfTitle": "title",
      "RefCollaboration": "container-author",
      "RefDate": "issued",
      "RefDOI": "DOI",
      "RefEditor": "editor",
      "RefEdition": "edition",
      "RefELocation": "page",
      "RefFPage": "page-first",
      "RefLPage": "page-last",
      "RefInPress": "annote",
      "RefIssue": "issue",
      "RefJournalTitle": "container-title",
      "RefSubmittedDate": "submitted",
      "RefLAD": "accessed",
      "RefPubDate": "issued",
      "RefPublisherLoc": "publisher-place",
      "RefPMCID": "PMCID",
      "RefPMID": "PMID",
      "RefPublisherName": "publisher",
      "RefPatent": "number",
      "RefSlNo": "citation-number",
      "RefTransTitle": "reviewed-title",
      "RefWebSite": "URL",
      "RefVolume": "volume",
      "RefISBN": "ISBN",
      "RefNPages": "number-of-pages",
      "RefMedium": "medium",
      "RefSection": "section",
      "RefRecipient": "recipient",
      "RefOriginalDate": "original-date",
      "RefYear": "RefYear"
    },
    "patent": {
      "RefAuthor": "author",
      "RefEtal": "etal",
      "RefBookSeries": "collection-title",
      "RefBookTitle": "container-title",
      "RefComments": "note",
      "RefConfDate": "event-date",
      "RefConfLoc": "event-place",
      "RefConfName": "event",
      "RefConfSponsor": "publisher",
      "RefCollaboration": "container-author",
      "RefDate": "issued",
      "RefDOI": "DOI",
      "RefEditor": "editor",
      "RefEdition": "edition",
      "RefELocation": "page",
      "RefFPage": "page-first",
      "RefLPage": "page-last",
      "RefInPress": "annote",
      "RefIssue": "issue",
      "RefJournalTitle": "container-title",
      "RefSoftTitle": "title",
      "RefSoftVer": "version",
      "RefSoftManName": "publisher",
      "RefSoftManLoc": "publisher-place",
      "RefSubmittedDate": "submitted",
      "RefLAD": "accessed",
      "RefPubDate": "issued",
      "RefPublisherLoc": "publisher-place",
      "RefPMCID": "PMCID",
      "RefPMID": "PMID",
      "RefPatent": "number",
      "RefSlNo": "citation-number",
      "RefTransTitle": "reviewed-title",
      "RefWebSite": "URL",
      "RefVolume": "volume",
      "RefISBN": "ISBN",
      "RefNPages": "number-of-pages",
      "RefMedium": "medium",
      "RefAnnote": "annote",
      "RefSection": "section",
      "RefRecipient": "recipient",
      "RefOriginalDate": "original-date",
      "RefYear": "RefYear"
    },
    "report": {
      "RefAuthor": "author",
      "RefEtal": "etal",
      "RefBookSeries": "collection-title",
      "RefComments": "note",
      "RefConfDate": "event-date",
      "RefConfLoc": "event-place",
      "RefConfName": "event",
      "RefConfSponsor": "publisher",
      "RefConfTitle": "title",
      "RefCollaboration": "container-author",
      "RefChapterTitle": "title",
      "RefDate": "issued",
      "RefDOI": "DOI",
      "RefEditor": "editor",
      "RefEdition": "edition",
      "RefELocation": "page",
      "RefFPage": "page-first",
      "RefLPage": "page-last",
      "RefInPress": "annote",
      "RefIssue": "issue",
      "RefJournalTitle": "container-title",
      "RefSubmittedDate": "submitted",
      "RefLAD": "accessed",
      "RefPubDate": "issued",
      "RefPublisherLoc": "publisher-place",
      "RefPMCID": "PMCID",
      "RefPMID": "PMID",
      "RefPublisherName": "publisher",
      "RefPatent": "number",
      "RefSlNo": "citation-number",
      "RefThesis": "title",
      "RefTransTitle": "reviewed-title",
      "RefWebSite": "URL",
      "RefVolume": "volume",
      "RefISBN": "ISBN",
      "RefNPages": "number-of-pages",
      "RefMedium": "medium",
      "RefSection": "section",
      "RefRecipient": "recipient",
      "RefOriginalDate": "original-date",
      "RefYear": "RefYear"
    },
    "speech": {
      "RefAuthor": "author",
      "RefEtal": "etal",
      "RefBookSeries": "collection-title",
      "RefBookTitle": "container-title",
      "RefComments": "note",
      "RefConfDate": "event-date",
      "RefConfLoc": "event-place",
      "RefConfName": "event",
      "RefConfSponsor": "publisher",
      "RefConfTitle": "title",
      "RefCollaboration": "container-author",
      "RefDate": "issued",
      "RefDOI": "DOI",
      "RefEditor": "editor",
      "RefEdition": "edition",
      "RefELocation": "page",
      "RefFPage": "page-first",
      "RefLPage": "page-last",
      "RefIssue": "issue",
      "RefJournalTitle": "container-title",
      "RefSoftVer": "version",
      "RefSubmittedDate": "submitted",
      "RefLAD": "accessed",
      "RefPubDate": "issued",
      "RefPublisherLoc": "publisher-place",
      "RefPMCID": "PMCID",
      "RefPMID": "PMID",
      "RefPublisherName": "publisher",
      "RefPatent": "number",
      "RefSlNo": "citation-number",
      "RefTransTitle": "reviewed-title",
      "RefWebSite": "URL",
      "RefVolume": "volume",
      "RefISBN": "ISBN",
      "RefNPages": "number-of-pages",
      "RefMedium": "medium",
      "RefAnnote": "annote",
      "RefSection": "section",
      "RefRecipient": "recipient",
      "RefOriginalDate": "original-date",
      "RefYear": "RefYear"
    }
  }
}