1.8587863445281982 1
1.8587863445281982 0
1.8706881999969482 0
1.8706881999969482 1
1.8787031173706055 1
1.8787031173706055 0
1.8791534900665283 0
1.8791534900665283 1
1.8792572021484375 1
1.8792572021484375 0
1.8794293403625488 0
1.8794293403625488 1
1.881218671798706 1
1.881218671798706 0
1.8813786506652832 0
1.8813786506652832 1
1.8814327716827393 1
1.8814327716827393 0
1.881469964981079 0
1.881469964981079 1
1.8815054893493652 1
1.8815054893493652 0
1.8815410137176514 0
1.8815410137176514 1
1.8815767765045166 1
1.8815767765045166 0
1.8816111087799072 0
1.8816111087799072 1
1.8816461563110352 1
1.8816461563110352 0
1.8816802501678467 0
1.8816802501678467 1
1.8817150592803955 1
1.8817150592803955 0
1.8817486763000488 0
1.8817486763000488 1
1.8817830085754395 1
1.8817830085754395 0
1.8818168640136719 0
1.8818168640136719 1
1.8818507194519043 1
1.8818507194519043 0
1.8818838596343994 0
1.8818838596343994 1
1.886669397354126 1
1.886669397354126 0
1.886944055557251 0
1.886944055557251 1
1.8869917392730713 1
1.8869917392730713 0
1.8870291709899902 0
1.8870291709899902 1
1.8870673179626465 1
1.8870673179626465 0
1.887101650238037 0
1.887101650238037 1
1.887136697769165 1
1.887136697769165 0
1.8871722221374512 0
1.8871722221374512 1
1.8872075080871582 1
1.8872075080871582 0
1.887242078781128 0
1.887242078781128 1
1.8873121738433838 1
1.8873121738433838 0
1.8873488903045654 0
1.8873488903045654 1
1.887430191040039 1
1.887430191040039 0
1.8874647617340088 0
1.8874647617340088 1
1.8875179290771484 1
1.8875179290771484 0
1.88755464553833 0
1.88755464553833 1
1.902557373046875 1
1.902557373046875 0
1.9028542041778564 0
1.9028542041778564 1
1.9363021850585938 1
1.9363021850585938 0
1.9365222454071045 0
1.9365222454071045 1
1.936582326889038 1
1.936582326889038 0
1.9366350173950195 0
1.9366350173950195 1
1.936687707901001 1
1.936687707901001 0
1.936737298965454 0
1.936737298965454 1
1.9687919616699219 1
1.9687919616699219 0
1.9696850776672363 0
1.9696850776672363 1
1.9752211570739746 1
1.9752211570739746 0
1.9987783432006836 0
1.9987783432006836 1
2.0006392002105713 1
2.0006392002105713 0
2.001516342163086 0
2.001516342163086 1
2.0028700828552246 1
2.0028700828552246 0
2.0030248165130615 0
2.0030248165130615 1
2.0032687187194824 1
2.0032687187194824 0
2.004410743713379 0
2.004410743713379 1
2.004603624343872 1
2.004603624343872 0
2.004807472229004 0
2.004807472229004 1
2.0051157474517822 1
2.0051157474517822 0
2.00640606880188 0
2.00640606880188 1
2.0066497325897217 1
2.0066497325897217 0
2.0067319869995117 0
2.0067319869995117 1
2.006791830062866 1
2.006791830062866 0
2.006850481033325 0
2.006850481033325 1
2.0069870948791504 1
2.0069870948791504 0
2.007053852081299 0
2.007053852081299 1
2.007115602493286 1
2.007115602493286 0
2.0071752071380615 0
2.0071752071380615 1
2.0072367191314697 1
2.0072367191314697 0
2.0072920322418213 0
2.0072920322418213 1
