<svg width="48" height="48" viewBox="0 0 48 48" fill="none" xmlns="http://www.w3.org/2000/svg">
    <path d="M35.805 42.3515H12.195C11.4184 42.3515 10.7888 41.7219 10.7888 40.9453C10.7888 38.9759 12.8254 36.9172 17.3923 34.2702C20.3759 32.5409 23.3086 31.2411 23.432 31.1867C23.7938 31.0268 24.2062 31.0268 24.568 31.1867C24.6914 31.2411 27.6242 32.5408 30.6078 34.2702C35.1747 36.9172 37.2114 38.9759 37.2114 40.9453C37.2113 41.7219 36.5816 42.3515 35.805 42.3515Z" fill="#20D152"/>
    <path d="M14.5309 12.7031H33.4688L23.9998 24L14.5309 12.7031Z" fill="#20D152"/>
    <path d="M26.075 24.0007C28.12 22.0663 32.4125 17.7641 35.0173 13.4272C36.476 10.9989 37.2142 8.85113 37.2112 7.04391C37.21 6.27141 36.5774 5.64844 35.8049 5.64844H12.195C11.4225 5.64844 10.7901 6.27141 10.7888 7.04391C10.7859 8.85113 11.524 10.9989 12.9826 13.4272C15.5875 17.7641 19.8801 22.0663 21.925 24.0007C20.7762 25.0886 18.914 26.9284 17.0327 29.1094C12.8896 33.9126 10.7888 37.8948 10.7888 40.9453V40.9476C10.7888 41.5803 11.2084 42.1463 11.8211 42.3041C12.7526 42.544 13.5898 41.8544 13.6012 40.9649C13.6013 40.9588 13.6013 40.9526 13.6013 40.9464C13.6031 40.9213 13.7465 36.8727 18.8425 33.9254C20.1373 33.1765 21.4389 32.5045 22.4731 31.9944C23.4361 31.5195 24.564 31.5195 25.527 31.9944C26.5613 32.5045 27.8628 33.1764 29.1577 33.9254C34.2535 36.8727 34.397 40.9213 34.3988 40.9464C34.3994 41.7363 35.0511 42.3736 35.8461 42.351C36.6115 42.3292 37.2153 41.6754 37.2112 40.9098C37.195 37.8638 35.0944 33.894 30.9673 29.1094C29.086 26.9284 27.2238 25.0886 26.075 24.0007ZM16.8141 14.1094H31.1857C28.7354 17.4765 25.5509 20.6246 23.9998 22.088C22.4486 20.6253 19.2655 17.4794 16.8141 14.1094Z" fill="#FDF5EC"/>
    <path d="M36.5194 8.46094H11.4806C9.74681 8.46094 8.33624 7.05037 8.33624 5.31656V3.14438C8.33624 1.41056 9.74681 0 11.4806 0H36.5194C38.2532 0 39.6637 1.41056 39.6637 3.14438V5.31656C39.6637 7.05037 38.2532 8.46094 36.5194 8.46094Z" fill="#0F8831"/>
    <path d="M36.5194 48H11.4806C9.74681 48 8.33624 46.5894 8.33624 44.8556V42.6834C8.33624 40.9496 9.74681 39.5391 11.4806 39.5391H36.5194C38.2532 39.5391 39.6637 40.9496 39.6637 42.6834V44.8556C39.6637 46.5894 38.2532 48 36.5194 48Z" fill="#0F8831"/>
</svg>
