<svg width="26" height="12" viewBox="0 0 26 12" fill="none" xmlns="http://www.w3.org/2000/svg">
<path d="M25.5303 6.53033C25.8232 6.23744 25.8232 5.76257 25.5303 5.46967L20.7574 0.696701C20.4645 0.403808 19.9896 0.403807 19.6967 0.696701C19.4038 0.989594 19.4038 1.46447 19.6967 1.75736L23.9393 6L19.6967 10.2426C19.4038 10.5355 19.4038 11.0104 19.6967 11.3033C19.9896 11.5962 20.4645 11.5962 20.7574 11.3033L25.5303 6.53033ZM-6.55671e-08 6.75L25 6.75L25 5.25L6.55671e-08 5.25L-6.55671e-08 6.75Z" fill="#0F8831"/>
</svg>
