<svg xmlns="http://www.w3.org/2000/svg" x="0px" y="0px"
     width="23" height="23"
     viewBox="0 0 172 172"
     style=" fill:#000000;"><defs><linearGradient x1="86" y1="23.59983" x2="86" y2="148.40017" gradientUnits="userSpaceOnUse" id="color-1_08CBfcuIknqm_gr1"><stop offset="0" stop-color="#f1c40f"></stop><stop offset="1" stop-color="#000000"></stop></linearGradient></defs><g fill="none" fill-rule="nonzero" stroke="none" stroke-width="1" stroke-linecap="butt" stroke-linejoin="miter" stroke-miterlimit="10" stroke-dasharray="" stroke-dashoffset="0" font-family="none" font-weight="none" font-size="none" text-anchor="none" style="mix-blend-mode: normal"><path d="M0,172v-172h172v172z" fill="none"></path><g fill="url(#color-1_08CBfcuIknqm_gr1)"><path d="M147.35025,122.0125l-33.47908,-33.47908c-1.39887,-1.39929 -1.39887,-3.66754 0,-5.06683l33.46475,-33.46475c1.39887,-1.39929 1.39887,-3.66754 0,-5.06683l-20.27092,-20.27092c-1.39929,-1.39887 -3.66754,-1.39887 -5.06683,0l-33.46475,33.46475c-1.39929,1.39887 -3.66754,1.39887 -5.06683,0l-33.47908,-33.47908c-0.67212,-0.67287 -1.58416,-1.05094 -2.53521,-1.05094c-0.95105,0 -1.86309,0.37808 -2.53521,1.05094l-20.26733,20.26733c-0.67287,0.67212 -1.05094,1.58416 -1.05094,2.53521c0,0.95105 0.37808,1.86309 1.05094,2.53521l33.47908,33.47908c1.39887,1.39929 1.39887,3.66754 0,5.06683l-33.4755,33.4755c-0.67287,0.67212 -1.05094,1.58416 -1.05094,2.53521c0,0.95105 0.37808,1.86309 1.05094,2.53521l20.27092,20.26733c1.39929,1.39887 3.66754,1.39887 5.06683,0l33.4755,-33.4755c1.39929,-1.39887 3.66754,-1.39887 5.06683,0l33.47908,33.48267c0.67212,0.67287 1.58416,1.05094 2.53521,1.05094c0.95105,0 1.86309,-0.37808 2.53521,-1.05094l20.26733,-20.27092c0.67287,-0.67212 1.05094,-1.58416 1.05094,-2.53521c0,-0.95105 -0.37808,-1.86309 -1.05094,-2.53521z"></path></g></g></svg>
