<svg width="260" height="40" viewBox="0 0 260 40" fill="none" xmlns="http://www.w3.org/2000/svg">
<path fill-rule="evenodd" clip-rule="evenodd" d="M96.4436 13.8709V9.2431H114.214V13.8709H107.828V30.7162H102.923V13.8709H96.4436ZM157.438 24.8851C155.957 25.9958 154.291 26.4586 152.81 26.4586C148.923 26.4586 146.331 23.7744 146.331 19.9796C146.331 15.722 149.016 13.5007 152.348 13.5007C154.384 13.5007 155.587 14.1486 156.698 14.7965L158.827 11.0942C157.531 9.79844 155.124 8.87288 152.255 8.87288C144.851 8.87288 141.056 13.7784 141.056 19.9796C141.056 26.6437 145.684 31.0864 152.255 31.0864C155.124 31.0864 157.901 30.0683 159.197 28.5874L157.438 24.8851ZM162.621 30.7162H175.672V26.0883H167.527V22.201H174.376V17.5732H167.527V13.8709H175.302V9.2431H162.621V30.7162ZM14.2537 24.2372C14.2537 28.7725 10.7365 30.8087 6.10871 30.8087C4.07247 30.8087 1.20323 30.7162 0 30.6236V9.33566C1.20323 9.2431 4.16503 9.15055 6.47894 9.15055C11.5695 9.15055 13.6983 11.4645 13.6983 14.5188C13.6983 16.7402 12.8653 18.2211 11.2919 19.3317V19.4243C12.7728 19.8871 14.2537 21.4605 14.2537 24.2372ZM4.90548 17.7583H6.47894C7.77472 17.7583 8.70029 17.2029 8.70029 15.722C8.70029 14.4263 7.49706 13.7784 6.38638 13.7784C5.73849 13.7784 5.36826 13.8709 4.81292 13.8709V17.7583H4.90548ZM9.44074 23.9595C9.44074 22.5712 8.42262 22.0159 6.84916 22.0159H4.99804V25.9958C5.36826 26.0883 5.73849 26.1809 6.66405 26.1809C8.42262 26.1809 9.44074 25.4404 9.44074 23.9595ZM68.3065 9.2431L77.1919 30.6236H71.9162L70.1576 26.0883H61.6425L59.8839 30.6236H54.9784L63.9564 9.2431H68.3065ZM68.3991 21.6456L65.9926 15.6295L63.5861 21.6456H68.3991ZM94.3148 24.2372C94.3148 28.7725 90.7977 30.8087 86.1699 30.8087C84.1336 30.8087 81.2644 30.7162 80.0611 30.6236V9.33566C81.2644 9.2431 84.2262 9.15055 86.5401 9.15055C91.6307 9.15055 93.7595 11.4645 93.7595 14.5188C93.7595 16.7402 92.9265 18.2211 91.353 19.3317V19.4243C92.7413 19.8871 94.3148 21.4605 94.3148 24.2372ZM84.8741 17.7583H86.5401C87.8359 17.7583 88.7614 17.2029 88.7614 15.722C88.7614 14.4263 87.5582 13.7784 86.4475 13.7784C85.7996 13.7784 85.4294 13.8709 84.8741 13.8709V17.7583ZM89.4093 23.9595C89.4093 22.5712 88.3912 22.0159 86.8178 22.0159H84.9666V25.9958C85.3369 26.0883 85.7071 26.1809 86.6326 26.1809C88.3912 26.1809 89.4093 25.4404 89.4093 23.9595ZM137.539 19.9796C137.539 26.4586 132.633 31.0864 126.154 31.0864C119.675 31.0864 114.77 26.8288 114.77 19.9796C114.77 13.7784 119.305 8.87288 126.154 8.87288C132.726 8.87288 137.539 13.1305 137.539 19.9796ZM132.355 19.9796C132.355 16.0923 129.671 13.5007 126.154 13.5007C122.637 13.5007 119.953 16.0923 119.953 19.9796C119.953 23.6819 122.73 26.4586 126.154 26.4586C130.227 26.4586 132.355 23.5893 132.355 19.9796ZM195.479 16.2774C195.479 20.0722 192.517 23.4968 187.519 23.4968C187.056 23.4968 185.853 23.4968 185.112 23.4042V30.7162H180.207V9.2431C181.41 9.2431 185.112 9.15055 186.778 9.15055C193.257 9.2431 195.479 12.5751 195.479 16.2774ZM190.203 16.2774C190.203 14.4263 189 13.7784 187.241 13.7784C186.593 13.7784 186.131 13.7784 185.112 13.8709V18.7764C185.853 18.869 186.686 18.9615 187.334 18.9615C188.63 18.869 190.203 18.3136 190.203 16.2774ZM213.712 24.2372C213.712 28.7725 210.195 30.8087 205.567 30.8087C203.531 30.8087 200.662 30.7162 199.459 30.6236V9.33566C200.662 9.2431 203.624 9.15055 205.938 9.15055C211.028 9.15055 213.157 11.4645 213.157 14.5188C213.157 16.7402 212.324 18.2211 210.751 19.3317V19.4243C212.231 19.8871 213.712 21.4605 213.712 24.2372ZM204.364 17.7583H206.03C207.326 17.7583 208.252 17.2029 208.252 15.722C208.252 14.4263 207.048 13.7784 205.938 13.7784C205.29 13.7784 204.92 13.8709 204.364 13.8709V17.7583ZM208.807 23.9595C208.807 22.5712 207.789 22.0159 206.215 22.0159H204.364V25.9958C204.734 26.0883 205.105 26.1809 206.03 26.1809C207.881 26.1809 208.807 25.4404 208.807 23.9595ZM222.598 30.7162L232.038 17.3881V30.7162H236.944V9.2431H232.686L223.246 22.5712V9.2431H218.34V30.6236H222.598V30.7162ZM257.306 24.8851C255.825 25.9958 254.159 26.4586 252.679 26.4586C248.791 26.4586 246.2 23.7744 246.2 19.9796C246.2 15.722 248.884 13.5007 252.216 13.5007C254.252 13.5007 255.455 14.1486 256.566 14.7965L258.695 11.0942C257.399 9.79844 254.992 8.87288 252.123 8.87288C244.719 8.87288 240.924 13.7784 240.924 19.9796C240.924 26.6437 245.552 31.0864 252.123 31.0864C254.992 31.0864 257.769 30.0683 259.065 28.5874L257.306 24.8851Z" fill="#3A3A3A"/>
<path fill-rule="evenodd" clip-rule="evenodd" d="M54.0529 7.57709C52.4795 6.09619 49.5177 1.37582 45.5377 7.29942C44.5196 8.87288 43.7792 10.9091 43.2238 13.1305L31.6543 5.44829L20.455 12.8528C20.8252 10.724 21.3806 8.59521 22.2136 6.74408C25.8233 -1.67854 29.8032 0.172589 40.262 0.172589C42.9462 0.172589 49.7028 -0.290192 51.739 0.63537C53.5901 1.46838 55.9966 4.70784 56.5519 7.57709H54.0529ZM42.5759 19.6094L31.6543 12.39L19.8997 20.1647C19.8997 21.6456 19.9922 23.2191 20.2699 24.7L31.6543 17.1104L42.8536 24.5149C42.6685 22.9414 42.5759 21.2754 42.5759 19.6094ZM31.6543 24.0521L21.5657 30.7161C22.2136 32.6598 22.954 34.511 23.8796 36.2695C26.7488 40.1569 29.9883 40.0643 36.0044 39.9718H46.0931C48.7772 39.9718 51.0911 40.342 53.2199 38.3058C54.9785 36.7323 56.3668 34.2333 56.5519 32.197H54.0529C53.0348 33.5854 52.3869 35.1588 50.1655 35.6216C48.3144 35.9919 46.741 34.9737 45.5377 33.2152L31.6543 24.0521Z" fill="#4A80C6"/>
</svg>
