<svg width="22" height="16" viewBox="0 0 22 16" fill="none" xmlns="http://www.w3.org/2000/svg">
<path opacity="0.2" d="M19.8758 0H13.3168H11.6273H9.83851H8.14907H1.59006C0.695651 0 0 0.695652 0 1.59006V14.4099C0 15.3043 0.695651 16 1.59006 16H19.8758C20.7702 16 21.4658 15.3043 21.4658 14.4099V1.49068C21.4658 0.695652 20.7702 0 19.8758 0ZM15.1056 12.4224C15.1056 12.9193 14.7081 13.2174 14.3106 13.2174H3.47826C2.98137 13.2174 2.68323 12.8199 2.68323 12.4224V3.37888C2.68323 2.88199 3.08075 2.58385 3.47826 2.58385H14.3106C14.8075 2.58385 15.1056 2.98137 15.1056 3.37888V12.4224ZM18.1863 12.2236C17.3913 12.2236 16.6957 11.528 16.6957 10.7329C16.6957 9.93789 17.3913 9.24224 18.1863 9.24224C18.9814 9.24224 19.677 9.93789 19.677 10.7329C19.677 11.528 18.9814 12.2236 18.1863 12.2236ZM18.1863 6.55901C17.3913 6.55901 16.6957 5.86335 16.6957 5.06832C16.6957 4.27329 17.3913 3.57764 18.1863 3.57764C18.9814 3.57764 19.677 4.27329 19.677 5.06832C19.677 5.86335 18.9814 6.55901 18.1863 6.55901Z" fill="black"/>
</svg>
