<svg width="96" height="122" viewBox="0 0 96 122" fill="none" xmlns="http://www.w3.org/2000/svg">
    <path d="M35.6659 70.2987L59.4019 46.4324C60.2424 45.586 61.6066 45.586 62.447 46.4324C63.2874 47.2787 63.2874 48.6488 62.447 49.4952L36.601 75.4862C36.1956 75.9005 35.6392 76.1195 35.077 76.1195C34.9586 76.1195 34.8491 76.1106 34.7307 76.0958C34.0501 75.9775 33.4612 75.5454 33.1505 74.9269L28.8418 66.2623C28.3121 65.1881 28.7412 63.886 29.8006 63.3533C30.8689 62.8207 32.1651 63.2527 32.6948 64.318L35.6659 70.2987ZM76.0003 60.9593C76.0003 76.4835 63.4384 89.1165 48 89.1165C32.5616 89.1165 19.9996 76.4835 19.9996 60.9593C19.9996 45.4351 32.5616 32.8021 48 32.8021C63.4384 32.8021 76.0003 45.4351 76.0003 60.9593ZM15.691 60.9593C15.691 78.8775 30.1883 93.4459 48 93.4459C65.8205 93.4459 80.309 78.8775 80.309 60.9593C80.309 43.0411 65.8205 28.4698 48 28.4698C30.1883 28.4698 15.691 43.0411 15.691 60.9593ZM91.0777 67.4578C91.0777 94.6473 63.3229 113.092 48 117.203C32.68 113.092 4.92228 94.6473 4.92228 67.4578V26.2622C22.1687 25.6526 39.1666 17.7011 48 6.23697C56.8333 17.7011 73.8312 25.6526 91.0777 26.2622V67.4578ZM93.232 21.9742C75.3878 21.9742 57.5258 13.4782 49.817 1.31279C49.4234 0.694305 48.7398 0.315521 48 0.315521C47.269 0.315521 46.5795 0.694305 46.183 1.31279C38.4683 13.4782 20.6122 21.9742 2.76795 21.9742C1.58129 21.9742 0.613617 22.9449 0.613617 24.1404V67.4578C0.613617 96.3134 28.5814 116.788 47.4792 121.535C47.6478 121.576 47.8224 121.603 48 121.603C48.1775 121.603 48.3551 121.576 48.5208 121.535C67.4185 116.788 95.3863 96.3134 95.3863 67.4578V24.1404C95.3863 22.9449 94.4187 21.9742 93.232 21.9742Z" fill="#C3AD8F"/>
</svg>
