<svg width="37" height="39" viewBox="0 0 37 39" fill="none" xmlns="http://www.w3.org/2000/svg">
    <path d="M28.1301 25.6346C26.9213 24.4044 25.4122 24.4044 24.2111 25.6346C23.2948 26.5712 22.3786 27.5077 21.4777 28.4601C21.2313 28.722 21.0234 28.7776 20.7232 28.603C20.1303 28.2696 19.4989 27.9998 18.9292 27.6347C16.2728 25.9124 14.0477 23.6981 12.0766 21.206C11.0987 19.9678 10.2287 18.6424 9.62044 17.1503C9.49724 16.8487 9.52034 16.6503 9.75903 16.4043C10.6753 15.4915 11.5684 14.555 12.4693 13.6185C13.7243 12.3169 13.7243 10.793 12.4616 9.48346C11.7455 8.73741 11.0295 8.00724 10.3134 7.26119C9.57424 6.49927 8.84278 5.72941 8.09593 4.97542C6.8871 3.76111 5.37799 3.76111 4.17686 4.98336C3.25292 5.91989 2.36747 6.88023 1.42813 7.80088C0.558083 8.65011 0.119209 9.68982 0.0268146 10.9041C-0.119477 12.8804 0.350195 14.7455 1.01236 16.563C2.36747 20.325 4.43095 23.6663 6.9333 26.7299C10.3134 30.8729 14.348 34.1507 19.0678 36.5158C21.1928 37.5794 23.3949 38.3968 25.7895 38.5318C27.4372 38.627 28.8693 38.1984 30.0165 36.873C30.8019 35.9682 31.6873 35.1428 32.5189 34.2777C33.7508 32.992 33.7585 31.4364 32.5343 30.1665C31.0713 28.6506 29.6007 27.1426 28.1301 25.6346Z" fill="#DBDBDB"/>
    <path d="M26.6597 19.3089L29.5009 18.8089C29.0543 16.1184 27.8224 13.6818 25.9514 11.7453C23.9726 9.70553 21.4703 8.41978 18.7139 8.02295L18.3135 10.9675C20.4462 11.277 22.3865 12.2691 23.9187 13.8485C25.3662 15.3406 26.3133 17.2295 26.6597 19.3089Z" fill="#DBDBDB"/>
    <path d="M31.1021 6.57856C27.8221 3.19753 23.672 1.06255 19.0908 0.403809L18.6904 3.34832C22.648 3.91976 26.236 5.76902 29.0694 8.68178C31.7565 11.4517 33.5197 14.9518 34.1588 18.8011L36.9999 18.3011C36.253 13.8406 34.2127 9.79292 31.1021 6.57856Z" fill="#DBDBDB"/>
</svg>
