<svg width="125" height="141" viewBox="0 0 125 141" fill="none" xmlns="http://www.w3.org/2000/svg">
    <g filter="url(#filter0_d)">
        <path d="M120.793 32.8512C120.682 31.7247 120.287 30.6449 119.644 29.7128C119.002 28.7808 118.133 28.027 117.12 27.5221L63.4962 0.708653C62.565 0.242631 61.538 0 60.4967 0C59.4553 0 58.4283 0.242631 57.4971 0.708653L3.87313 27.5221C2.86281 28.0299 1.99705 28.7846 1.3561 29.7162C0.715151 30.6478 0.319766 31.7261 0.206597 32.8512C0.132864 33.5685 -6.23498 105.026 57.7786 133.495C58.6339 133.881 59.5616 134.081 60.5 134.081C61.4384 134.081 62.3661 133.881 63.2214 133.495C127.235 105.026 120.867 33.5752 120.793 32.8512ZM60.5 119.975C15.1275 98.0413 12.9825 51.2318 13.3512 37.7782L60.5 14.2025L107.615 37.7648C107.863 51.0978 105.417 98.2156 60.5 119.975Z" fill="white"/>
    </g>
    <g filter="url(#filter1_d)">
        <path d="M53.2544 71.7499L38.5182 57.0073L29.431 66.0985L53.2544 89.9323L89.931 53.2396L80.8438 44.1485L53.2544 71.7499Z" fill="white"/>
    </g>
    <defs>
        <filter id="filter0_d" x="0" y="0" width="125" height="140.081" filterUnits="userSpaceOnUse" color-interpolation-filters="sRGB">
            <feFlood flood-opacity="0" result="BackgroundImageFix"/>
            <feColorMatrix in="SourceAlpha" type="matrix" values="0 0 0 0 0 0 0 0 0 0 0 0 0 0 0 0 0 0 127 0"/>
            <feOffset dx="2" dy="4"/>
            <feGaussianBlur stdDeviation="1"/>
            <feColorMatrix type="matrix" values="0 0 0 0 0 0 0 0 0 0 0 0 0 0 0 0 0 0 0.25 0"/>
            <feBlend mode="normal" in2="BackgroundImageFix" result="effect1_dropShadow"/>
            <feBlend mode="normal" in="SourceGraphic" in2="effect1_dropShadow" result="shape"/>
        </filter>
        <filter id="filter1_d" x="29.431" y="44.1485" width="64.5" height="51.7838" filterUnits="userSpaceOnUse" color-interpolation-filters="sRGB">
            <feFlood flood-opacity="0" result="BackgroundImageFix"/>
            <feColorMatrix in="SourceAlpha" type="matrix" values="0 0 0 0 0 0 0 0 0 0 0 0 0 0 0 0 0 0 127 0"/>
            <feOffset dx="2" dy="4"/>
            <feGaussianBlur stdDeviation="1"/>
            <feColorMatrix type="matrix" values="0 0 0 0 0 0 0 0 0 0 0 0 0 0 0 0 0 0 0.25 0"/>
            <feBlend mode="normal" in2="BackgroundImageFix" result="effect1_dropShadow"/>
            <feBlend mode="normal" in="SourceGraphic" in2="effect1_dropShadow" result="shape"/>
        </filter>
    </defs>
</svg>
