<svg width="136" height="138" viewBox="0 0 136 138" fill="none" xmlns="http://www.w3.org/2000/svg">
    <g filter="url(#filter0_d)">
        <path d="M47.1429 0C28.9693 0 14.1429 14.8264 14.1429 33C14.1429 44.3614 19.9414 54.45 28.7289 60.4041C11.913 67.617 0 84.3056 0 103.714H9.42857C9.42857 82.83 26.2586 66 47.1429 66C53.625 66 59.664 67.6971 64.9676 70.5681C59.5389 77.2812 56.5755 85.6523 56.5714 94.2857C56.5714 115.057 73.5146 132 94.2857 132C115.057 132 132 115.057 132 94.2857C132 73.5146 115.057 56.5714 94.2857 56.5714C86.3408 56.5783 78.6028 59.1053 72.1851 63.789C70.0672 62.4885 67.8511 61.3552 65.5569 60.3994C70.0418 57.3718 73.7164 53.2912 76.2592 48.5147C78.802 43.7381 80.1354 38.4112 80.1429 33C80.1429 14.8264 65.3164 0 47.1429 0ZM47.1429 9.42857C60.2156 9.42857 70.7143 19.9273 70.7143 33C70.7143 46.0727 60.2156 56.5714 47.1429 56.5714C34.0701 56.5714 23.5714 46.0727 23.5714 33C23.5714 19.9273 34.0701 9.42857 47.1429 9.42857ZM94.2857 66C109.956 66 122.571 78.6154 122.571 94.2857C122.571 109.956 109.956 122.571 94.2857 122.571C78.6154 122.571 66 109.956 66 94.2857C66 78.6154 78.6154 66 94.2857 66ZM109.753 81.4676L94.2857 96.9399L83.5324 86.1819L76.7533 92.961L90.8961 107.104L94.2857 110.343L97.6753 107.104L116.532 88.2467L109.753 81.4676Z" fill="white"/>
    </g>
    <defs>
        <filter id="filter0_d" x="0" y="0" width="136" height="138" filterUnits="userSpaceOnUse" color-interpolation-filters="sRGB">
            <feFlood flood-opacity="0" result="BackgroundImageFix"/>
            <feColorMatrix in="SourceAlpha" type="matrix" values="0 0 0 0 0 0 0 0 0 0 0 0 0 0 0 0 0 0 127 0"/>
            <feOffset dx="2" dy="4"/>
            <feGaussianBlur stdDeviation="1"/>
            <feColorMatrix type="matrix" values="0 0 0 0 0 0 0 0 0 0 0 0 0 0 0 0 0 0 0.25 0"/>
            <feBlend mode="normal" in2="BackgroundImageFix" result="effect1_dropShadow"/>
            <feBlend mode="normal" in="SourceGraphic" in2="effect1_dropShadow" result="shape"/>
        </filter>
    </defs>
</svg>
