<svg width="380" height="512" viewBox="0 0 380 512" fill="none" xmlns="http://www.w3.org/2000/svg">
    <g opacity="0.2" clip-path="url(#clip0)">
        <path d="M128 34.2975C6.22815 104.603 -36.0075 262.228 34.2975 384C104.602 505.772 262.228 548.007 384 477.702C505.772 407.398 548.007 249.772 477.702 128C407.397 6.22817 249.772 -36.0075 128 34.2975ZM158 86.259C234.588 42.041 330.315 56.3261 391.339 114.436C388.426 112.114 384.68 110.817 380.68 111.182C335.315 115.283 267.044 128.38 203.5 165.067C139.956 201.754 94.4783 254.33 68.244 291.567C65.9281 294.85 65.1783 298.741 65.7327 302.425C45.9196 220.522 81.4122 130.477 158 86.259ZM108.926 385.51C113.045 389.64 119.38 391.154 125.135 388.844L158.85 375.164C201.87 357.888 251.934 371.302 280.552 407.774L302.911 436.479C306.227 440.704 311.355 442.544 316.328 442.005C242.852 465.727 160.088 443.525 108.926 385.51ZM278.5 294.971C257.01 307.378 229.436 299.99 217.029 278.5C204.622 257.01 212.01 229.436 233.5 217.029C254.99 204.622 282.564 212.01 294.971 233.5C307.378 254.99 299.99 282.564 278.5 294.971ZM386.921 401.247C389.873 397.21 390.845 391.85 388.844 386.865L375.163 353.149C357.887 310.129 371.302 260.065 407.773 231.447L436.479 209.089C441.356 205.26 443.212 199.017 441.696 193.384C466.357 266.7 444.203 349.477 386.921 401.247Z" fill="#20D152"/>
        <path d="M248.5 243.01C241.333 247.148 238.872 256.333 243.01 263.5C247.148 270.667 256.333 273.128 263.5 268.99C270.667 264.852 273.128 255.667 268.99 248.5C264.852 241.333 255.667 238.872 248.5 243.01Z" fill="#20D152"/>
    </g>
    <defs>
        <clipPath id="clip0">
            <rect width="512" height="512" fill="white"/>
        </clipPath>
    </defs>
</svg>
