<svg width="21" height="13" viewBox="0 0 21 13" fill="none" xmlns="http://www.w3.org/2000/svg">
<path d="M0.469669 5.96967C0.176777 6.26256 0.176777 6.73744 0.469669 7.03033L5.24264 11.8033C5.53553 12.0962 6.01041 12.0962 6.3033 11.8033C6.59619 11.5104 6.59619 11.0355 6.3033 10.7426L2.06066 6.5L6.3033 2.25736C6.59619 1.96446 6.59619 1.48959 6.3033 1.1967C6.01041 0.903804 5.53553 0.903804 5.24264 1.1967L0.469669 5.96967ZM21 5.75L1 5.75L1 7.25L21 7.25L21 5.75Z" fill="#5E4A7E"/>
</svg>
