<svg width="8" height="12" viewBox="0 0 8 12" fill="none" xmlns="http://www.w3.org/2000/svg">
<path d="M7.5 6.77491L0.5 11.5V8.11684L3.66076 5.9811L0.5 3.71306V0.5L7.5 5.33849V6.77491Z" fill="#3ECF31"/>
</svg>
