<svg width="11" height="18" viewBox="0 0 11 18" fill="none" xmlns="http://www.w3.org/2000/svg">
<path opacity="0.4" d="M1 17.0001L9 9.00012L1 1.00012" stroke="white" stroke-width="1.5" stroke-linecap="round"/>
</svg>
