<svg width="24" height="24" viewBox="0 0 24 24" fill="none" xmlns="http://www.w3.org/2000/svg">
<path d="M12 24C18.6274 24 24 18.6274 24 12C24 5.37258 18.6274 0 12 0C5.37258 0 0 5.37258 0 12C0 18.6274 5.37258 24 12 24Z" fill="#50ABF1"/>
<path d="M4.5 16.7344C5.85938 17.5969 7.47188 18.0938 9.19688 18.0938C14.0484 18.0938 17.9813 14.1609 17.9813 9.30938C17.9813 9.1875 17.9766 9.07031 17.9766 8.94844C18.1547 8.8125 19.2375 7.94062 19.5047 7.38281C19.5047 7.38281 18.6234 7.74844 17.7609 7.83281C17.7563 7.83281 17.7563 7.83281 17.7563 7.83281C17.7563 7.83281 17.7609 7.83281 17.7609 7.82812C17.8406 7.77656 18.9516 7.02187 19.1016 6.11719C19.1016 6.11719 18.4781 6.45 17.6063 6.74063C17.4609 6.7875 17.3109 6.83437 17.1563 6.87656C16.5844 6.28125 15.7875 5.90625 14.8969 5.90625C13.1953 5.90625 11.8125 7.28438 11.8125 8.99063C11.8125 9.22969 11.8406 9.46406 11.8922 9.68906C11.6531 9.67969 8.02969 9.47344 5.56875 6.49219C5.56875 6.49219 4.09688 8.50313 6.45 10.5703C6.45 10.5703 5.7375 10.5422 5.11875 10.1766C5.11875 10.1766 4.89375 12.6141 7.55625 13.2328C7.55625 13.2328 7.03125 13.4297 6.19688 13.2891C6.19688 13.2891 6.66563 15.2578 9.02813 15.4406C9.02813 15.4406 7.15313 17.1281 4.5 16.7344Z" fill="white"/>
</svg>
