<svg width="21" height="33" viewBox="0 0 21 33" fill="none" xmlns="http://www.w3.org/2000/svg">
<path d="M9.378 14.524L0.878 0.141999L6.964 0.141999L10.806 6.636L14.886 0.141999L20.666 0.141999L11.962 14.524L9.378 14.524ZM9.378 32.1217L0.877999 17.7397L6.964 17.7397L10.806 24.2337L14.886 17.7397L20.666 17.7397L11.962 32.1217L9.378 32.1217Z" fill="#F6F1FD"/>
</svg>
