<svg width="157" height="38" viewBox="0 0 157 38" fill="none" xmlns="http://www.w3.org/2000/svg">
<g clip-path="url(#clip0)">
<g opacity="0.4">
<path d="M0.0473633 37.1154V32.2093H0.669263V36.5626H2.50732V32.2093H3.12922V36.5626H4.96728V32.2093H5.58918V37.1154H0.0473633Z" fill="black"/>
<path d="M7.86727 37.1154V32.2093H8.48917V34.3306H9.14562L10.7626 32.2093H11.4812L9.65696 34.5863L11.6056 37.1154H10.8455L9.15944 34.8972H8.48917V37.1154H7.86727Z" fill="black"/>
<path d="M15.1872 37.1499C14.8417 37.1499 14.5285 37.0808 14.2475 36.9426C13.9665 36.8044 13.7223 36.6178 13.515 36.3829C13.3123 36.1433 13.1557 35.8762 13.0451 35.5813C12.9346 35.2819 12.8793 34.9756 12.8793 34.6623C12.8793 34.3352 12.9369 34.0243 13.052 33.7295C13.1718 33.43 13.3353 33.1651 13.5426 32.9348C13.7546 32.6999 14.001 32.5156 14.282 32.382C14.563 32.2438 14.8694 32.1747 15.201 32.1747C15.5465 32.1747 15.8598 32.2461 16.1408 32.3889C16.4218 32.5317 16.6637 32.7229 16.8664 32.9624C17.069 33.202 17.2257 33.4692 17.3362 33.764C17.4468 34.0588 17.5021 34.3606 17.5021 34.6692C17.5021 34.9963 17.4445 35.3095 17.3293 35.609C17.2142 35.9038 17.0506 36.1687 16.8387 36.4036C16.6314 36.634 16.3873 36.8159 16.1063 36.9495C15.8252 37.0831 15.5189 37.1499 15.1872 37.1499ZM13.5081 34.6623C13.5081 34.9111 13.5473 35.1529 13.6256 35.3879C13.7085 35.6182 13.8237 35.8232 13.9711 36.0028C14.1185 36.1825 14.2958 36.3253 14.5031 36.4313C14.7104 36.5372 14.9408 36.5902 15.1941 36.5902C15.4567 36.5902 15.6917 36.5349 15.899 36.4244C16.1063 36.3138 16.2813 36.1664 16.4241 35.9821C16.5715 35.7978 16.6821 35.5905 16.7558 35.3602C16.8341 35.1299 16.8733 34.8972 16.8733 34.6623C16.8733 34.4135 16.8318 34.174 16.7489 33.9437C16.6706 33.7133 16.5554 33.5083 16.4034 33.3287C16.256 33.1444 16.0786 33.0016 15.8713 32.9003C15.6686 32.7943 15.4429 32.7413 15.1941 32.7413C14.9316 32.7413 14.6966 32.7966 14.4893 32.9072C14.282 33.0131 14.1047 33.1582 13.9572 33.3425C13.8144 33.5268 13.7039 33.7341 13.6256 33.9644C13.5473 34.1901 13.5081 34.4228 13.5081 34.6623Z" fill="black"/>
<path d="M22.7194 37.1154V32.762H20.8883L20.8607 33.7364C20.8376 34.4043 20.787 34.9594 20.7086 35.4017C20.6349 35.8393 20.5267 36.1848 20.3839 36.4382C20.2457 36.6869 20.0729 36.8643 19.8656 36.9702C19.6583 37.0762 19.4119 37.1292 19.1262 37.1292V36.5833C19.3013 36.5833 19.4556 36.5395 19.5892 36.452C19.7228 36.3645 19.8357 36.2124 19.9278 35.9959C20.0245 35.7748 20.1006 35.4685 20.1558 35.0769C20.2111 34.6853 20.248 34.1855 20.2664 33.5774L20.3079 32.2093H23.3413V37.1154H22.7194Z" fill="black"/>
<path d="M27.1174 32.2093H27.6426L29.6465 37.1154H28.9831L28.4027 35.6781H26.3435L25.77 37.1154H25.1066L27.1174 32.2093ZM28.2645 35.1944L27.38 32.9279L26.4679 35.1944H28.2645Z" fill="black"/>
<path d="M37.755 37.1499C37.345 37.1499 36.981 37.0578 36.6632 36.8735C36.3453 36.6892 36.0897 36.4313 35.8962 36.0996C35.7027 35.7633 35.5898 35.3717 35.5576 34.9249H34.6662V37.1154H34.0443V32.2093H34.6662V34.3721H35.5645C35.6013 33.916 35.7188 33.5245 35.9169 33.1974C36.115 32.8703 36.373 32.6192 36.6908 32.4442C37.0133 32.2645 37.3703 32.1747 37.7619 32.1747C38.2133 32.1747 38.6072 32.2807 38.9435 32.4926C39.2798 32.7045 39.5424 32.9993 39.7312 33.377C39.9201 33.7502 40.0145 34.1809 40.0145 34.6692C40.0145 35.1944 39.9155 35.6412 39.7174 36.0098C39.5193 36.3783 39.2498 36.6616 38.9089 36.8597C38.5726 37.0532 38.188 37.1499 37.755 37.1499ZM37.7619 36.5902C38.0982 36.5902 38.3861 36.5073 38.6256 36.3414C38.8652 36.1756 39.0494 35.9476 39.1784 35.6573C39.312 35.3671 39.3788 35.0354 39.3788 34.6623C39.3788 34.2661 39.3097 33.9252 39.1715 33.6396C39.0333 33.354 38.8421 33.1329 38.598 32.9763C38.3584 32.8196 38.0774 32.7413 37.755 32.7413C37.4279 32.7413 37.1446 32.8242 36.905 32.9901C36.6701 33.1513 36.4881 33.377 36.3591 33.6673C36.2348 33.9529 36.1726 34.2846 36.1726 34.6623C36.1726 35.0539 36.2371 35.3948 36.3661 35.685C36.4996 35.9752 36.6862 36.1986 36.9258 36.3553C37.1653 36.5119 37.444 36.5902 37.7619 36.5902Z" fill="black"/>
<path d="M45.9313 32.2093V37.1154H45.3094V34.8834H42.6076V37.1154H41.9857V32.2093H42.6076V34.3306H45.3094V32.2093H45.9313Z" fill="black"/>
<path d="M48.213 37.1154V32.2093H48.8349V34.068H50.0096C50.544 34.068 50.9471 34.2085 51.2189 34.4896C51.4953 34.7706 51.6335 35.1368 51.6335 35.5882C51.6335 35.8739 51.5736 36.1341 51.4538 36.3691C51.334 36.5994 51.1567 36.7814 50.9218 36.915C50.6868 37.0486 50.3966 37.1154 50.0511 37.1154H48.213ZM52.4489 37.1154V32.2162H53.0708V37.1154H52.4489ZM48.8349 36.5971H49.9682C50.2123 36.5971 50.4104 36.551 50.5624 36.4589C50.7145 36.3622 50.825 36.2378 50.8941 36.0858C50.9632 35.9291 50.9978 35.7633 50.9978 35.5882C50.9978 35.4132 50.9655 35.2497 50.901 35.0976C50.8411 34.9456 50.7352 34.8235 50.5832 34.7314C50.4311 34.6347 50.2238 34.5863 49.9613 34.5863H48.8349V36.5971Z" fill="black"/>
<path d="M55.4896 32.2093L56.9683 34.2408L58.4471 32.2093H59.145L57.3138 34.6969L59.0897 37.1154H58.3918L56.9683 35.1529L55.5449 37.1154H54.84L56.6159 34.6969L54.7848 32.2093H55.4896Z" fill="black"/>
<path d="M63.7101 37.1154V32.2093H67.4967V37.1154H66.8748V32.762H64.332V37.1154H63.7101Z" fill="black"/>
<path d="M69.7755 37.1154V32.2093H71.8208C72.0373 32.2093 72.2354 32.2553 72.4151 32.3474C72.5947 32.435 72.7514 32.5548 72.885 32.7068C73.0186 32.8542 73.1222 33.0223 73.1959 33.2112C73.2696 33.3955 73.3065 33.5843 73.3065 33.7778C73.3065 34.045 73.2466 34.3007 73.1268 34.5448C73.007 34.7844 72.8389 34.9802 72.6224 35.1322C72.4059 35.2796 72.1525 35.3533 71.8623 35.3533H70.3974V37.1154H69.7755ZM70.3974 34.8005H71.8277C71.9982 34.8005 72.1456 34.7544 72.27 34.6623C72.399 34.5702 72.498 34.4458 72.5671 34.2892C72.6408 34.1325 72.6777 33.9621 72.6777 33.7778C72.6777 33.5843 72.6362 33.4116 72.5533 33.2596C72.4704 33.1029 72.3621 32.9809 72.2285 32.8933C72.0949 32.8058 71.9475 32.762 71.7863 32.762H70.3974V34.8005Z" fill="black"/>
<path d="M78.5169 36.5626V37.1154H75.1863V32.2093H78.4548V32.762H75.8082V34.3514H78.1093V34.8696H75.8082V36.5626H78.5169Z" fill="black"/>
<path d="M80.1302 38.0551V36.5626H80.3513C80.5218 36.5579 80.6646 36.4635 80.7798 36.2792C80.8995 36.095 80.9917 35.7863 81.0562 35.3533C81.1253 34.9157 81.1713 34.3237 81.1944 33.5774L81.2289 32.2093H84.2693V36.5626H84.8774V38.0551H84.3246V37.1154H80.683V38.0551H80.1302ZM81.1805 36.5626H83.6474V32.762H81.8024L81.7817 33.6534C81.7679 34.2339 81.7379 34.7199 81.6919 35.1115C81.6458 35.503 81.5813 35.8163 81.4984 36.0512C81.4155 36.2862 81.3095 36.4566 81.1805 36.5626Z" fill="black"/>
<path d="M86.8111 37.1154V32.2093H90.5977V37.1154H89.9758V32.762H87.433V37.1154H86.8111Z" fill="black"/>
<path d="M92.8765 37.1154V32.2093H94.9218C95.1383 32.2093 95.3364 32.2553 95.5161 32.3474C95.6957 32.435 95.8524 32.5548 95.986 32.7068C96.1196 32.8542 96.2232 33.0223 96.2969 33.2112C96.3706 33.3955 96.4075 33.5843 96.4075 33.7778C96.4075 34.045 96.3476 34.3007 96.2278 34.5448C96.108 34.7844 95.9399 34.9802 95.7234 35.1322C95.5069 35.2796 95.2535 35.3533 94.9633 35.3533H93.4984V37.1154H92.8765ZM93.4984 34.8005H94.9287C95.0992 34.8005 95.2466 34.7544 95.371 34.6623C95.5 34.5702 95.599 34.4458 95.6681 34.2892C95.7418 34.1325 95.7787 33.9621 95.7787 33.7778C95.7787 33.5843 95.7372 33.4116 95.6543 33.2596C95.5714 33.1029 95.4631 32.9809 95.3295 32.8933C95.1959 32.8058 95.0485 32.762 94.8873 32.762H93.4984V34.8005Z" fill="black"/>
<path d="M98.3219 37.1154V32.2093H98.9438V36.2516L101.784 32.2093H102.364V37.1154H101.742V33.149L98.9369 37.1154H98.3219Z" fill="black"/>
<path d="M108.622 32.2093V37.1154H108V34.8834H105.299V37.1154H104.677V32.2093H105.299V34.3306H108V32.2093H108.622Z" fill="black"/>
<path d="M110.939 37.1154V32.2093H111.56V36.2516L114.4 32.2093H114.981V37.1154H114.359V33.149L111.554 37.1154H110.939Z" fill="black"/>
<path d="M121.536 37.1154V33.3701L119.919 36.2516H119.539L117.915 33.3701V37.1154H117.293V32.2093H117.95L119.726 35.3948L121.508 32.2093H122.158V37.1154H121.536Z" fill="black"/>
<path d="M125.931 32.2093H126.456L128.46 37.1154H127.797L127.216 35.6781H125.157L124.584 37.1154H123.92L125.931 32.2093ZM127.078 35.1944L126.194 32.9279L125.281 35.1944H127.078Z" fill="black"/>
<path d="M133.299 32.762H131.607V37.1154H130.985V32.762H129.292V32.2093H133.299V32.762Z" fill="black"/>
<path d="M138.442 36.5626V37.1154H135.112V32.2093H138.38V32.762H135.734V34.3514H138.035V34.8696H135.734V36.5626H138.442Z" fill="black"/>
<path d="M143.649 37.1154V32.762H141.818L141.79 33.7364C141.767 34.4043 141.716 34.9594 141.638 35.4017C141.564 35.8393 141.456 36.1848 141.313 36.4382C141.175 36.6869 141.002 36.8643 140.795 36.9702C140.588 37.0762 140.341 37.1292 140.056 37.1292V36.5833C140.231 36.5833 140.385 36.5395 140.519 36.452C140.652 36.3645 140.765 36.2124 140.857 35.9959C140.954 35.7748 141.03 35.4685 141.085 35.0769C141.14 34.6853 141.177 34.1855 141.196 33.5774L141.237 32.2093H144.271V37.1154H143.649Z" fill="black"/>
<path d="M149.885 36.5626V37.1154H146.554V32.2093H149.823V32.762H147.176V34.3514H149.477V34.8696H147.176V36.5626H149.885Z" fill="black"/>
<path d="M151.878 37.1154V32.2093H152.5V36.2516L155.34 32.2093H155.92V37.1154H155.299V33.149L152.493 37.1154H151.878ZM153.903 31.843C153.539 31.843 153.262 31.7624 153.074 31.6012C152.889 31.4399 152.797 31.2395 152.797 31H153.274C153.274 31.1198 153.318 31.2303 153.405 31.3317C153.497 31.4284 153.663 31.4768 153.903 31.4768C154.133 31.4768 154.294 31.433 154.386 31.3455C154.479 31.2534 154.525 31.1382 154.525 31H155.001C155.001 31.2395 154.909 31.4399 154.725 31.6012C154.541 31.7624 154.267 31.843 153.903 31.843Z" fill="black"/>
</g>
<g clip-path="url(#clip1)">
<path d="M70.1084 7.0936C69.9901 6.97537 69.7537 6.85714 69.399 6.62069C69.0443 6.38424 68.4532 6.14778 67.8621 5.91133C67.2709 5.67488 66.5616 5.43842 65.8522 5.20197C65.1428 4.96552 64.4335 4.84729 63.7241 4.84729C61.8325 4.84729 60.7685 5.55665 60.7685 6.85714C60.7685 7.68473 61.2414 8.15763 62.0689 8.51231C62.8965 8.86699 64.197 9.22167 65.734 9.69458C67.2709 10.0493 68.5714 10.5222 69.7537 11.1133C70.8177 11.5862 71.7635 12.4138 72.3547 13.2414C72.9458 14.069 73.3005 15.2512 73.3005 16.7882C73.3005 18.0887 73.064 19.2709 72.5911 20.2167C72.1182 21.1626 71.4088 21.8719 70.5813 22.4631C69.7537 23.0542 68.8079 23.4089 67.7438 23.6453C66.6798 23.8818 65.6157 24 64.5517 24C62.7783 24 61.0049 23.7635 59.2315 23.2906C57.4581 22.8177 55.9212 21.9901 54.5024 21.1626L56.867 16.4335C56.9852 16.5517 57.2217 16.7882 57.6946 17.0246C58.1675 17.2611 58.7586 17.6158 59.468 17.9704C60.1773 18.3251 61.0049 18.5616 61.8325 18.798C62.6601 19.0345 63.6059 19.1527 64.5517 19.1527C66.4433 19.1527 67.3891 18.5616 67.3891 17.3793C67.3891 16.7882 67.1527 16.3153 66.6798 15.9606C66.2069 15.6059 65.4975 15.2512 64.6699 15.0148C63.8423 14.7783 62.8965 14.4236 61.7143 14.069C59.5862 13.3596 57.931 12.6502 56.867 11.7044C55.8029 10.7586 55.33 9.3399 55.33 7.68473C55.33 6.02956 55.6847 4.61084 56.5123 3.5468C57.3399 2.36453 58.4039 1.53695 59.7044 0.945813C61.0049 0.35468 62.4236 0 63.9606 0C65.6157 0 67.1527 0.236453 68.6896 0.827586C70.2266 1.41872 71.4088 2.00985 72.4729 2.60099L70.1084 7.0936ZM94.2266 4.96552H87.133V23.6453H81.6946V4.96552H74.4827V0.236453H94.2266V4.96552ZM100.611 0.236453H106.522L114.562 23.7635H109.005L107.232 18.4433H99.9015L98.1281 23.7635H92.5714L100.611 0.236453ZM106.286 14.6601L103.566 5.67488L100.729 14.6601H106.286ZM116.808 23.7635V0.236453H127.448C128.512 0.236453 129.576 0.472906 130.522 0.945813C131.468 1.41872 132.296 2.00985 133.005 2.71921C133.714 3.42857 134.187 4.37438 134.542 5.3202C134.897 6.26601 135.133 7.21182 135.133 8.15764C135.133 9.57635 134.778 10.9951 134.069 12.1773C133.36 13.3596 132.414 14.3054 131.232 15.0148L136.433 23.7635H130.404L125.911 16.197H122.246V23.7635H116.808ZM122.246 11.3498H127.212C127.803 11.3498 128.394 10.9951 128.867 10.4039C129.34 9.81281 129.576 8.98522 129.576 8.03941C129.576 7.0936 129.34 6.38424 128.749 5.7931C128.276 5.20197 127.685 4.84729 126.975 4.84729H122.128V11.3498H122.246ZM156.65 4.96552H149.557V23.6453H144.118V4.96552H136.906V0.236453H156.65V4.96552Z" fill="#9974D5"/>
<path d="M0 23.7635V0.236453H5.43842V10.4039L14.069 0.236453H20.0985L11.3498 10.6404L20.8079 23.6453H14.5419L7.92118 14.1872L5.43842 16.67V23.6453H0V23.7635ZM22.4631 23.7635V0.236453H27.9015V23.7635H22.4631ZM32.3941 23.7635V0.236453H41.1429C43.7438 0.236453 45.8719 0.70936 47.6453 1.7734C49.4187 2.83744 50.7192 4.25616 51.5468 6.02956C52.3744 7.80296 52.8473 9.81281 52.8473 11.9409C52.8473 14.3054 52.3744 16.4335 51.4286 18.2069C50.4828 19.9803 49.064 21.399 47.2906 22.3448C45.5172 23.2906 43.5074 23.7635 41.1429 23.7635H32.3941ZM47.4089 11.9409C47.4089 9.81281 46.8177 8.15764 45.7537 6.85714C44.6897 5.55665 43.1527 4.96552 41.1429 4.96552H37.8325V18.9163H41.1429C42.4433 18.9163 43.6256 18.5616 44.5714 17.9704C45.5172 17.3793 46.2266 16.5517 46.6995 15.4877C47.0542 14.4236 47.4089 13.2414 47.4089 11.9409ZM68.6897 0.827586C67.2709 0.236453 65.6158 0 63.9606 0C62.4236 0 61.0049 0.35468 59.5862 0.945813C58.2857 1.53695 57.2217 2.36453 56.3941 3.5468C55.5665 4.72906 55.2118 6.02956 55.2118 7.68473C55.2118 9.45813 55.6847 10.7586 56.7488 11.8227C57.6946 12.7685 59.2315 13.4778 61.1232 14.069L65.4975 9.69458C64.0788 9.22167 62.8965 8.86699 62.069 8.63054C61.2414 8.27586 60.7685 7.68473 60.7685 6.97537C60.7685 5.67488 61.7143 5.08374 63.7241 5.08374C64.4335 5.08374 65.1429 5.20197 65.8522 5.3202C66.5616 5.43842 67.1527 5.67488 67.8621 6.02956C68.2168 6.14778 68.5714 6.38424 68.8079 6.50246C69.0443 6.62069 69.1626 6.73892 69.399 6.85714C69.7537 6.85714 69.9901 6.97537 70.1084 7.0936L72.4729 2.60099C71.4089 2.00985 70.1084 1.41872 68.6897 0.827586Z" fill="#3ECF31"/>
</g>
</g>
<defs>
<clipPath id="clip0">
<rect width="157" height="38" fill="white"/>
</clipPath>
<clipPath id="clip1">
<rect width="156.65" height="24" fill="white"/>
</clipPath>
</defs>
</svg>
