<svg width="10" height="16" viewBox="0 0 10 16" fill="none" xmlns="http://www.w3.org/2000/svg">
<path d="M8.47816 9.10938C8.71878 9.10938 8.86253 8.91563 8.90941 8.725L9.15003 6.50938C9.15003 6.26875 8.95941 6.02812 8.71878 6.02812H6.08128V4.15C6.08128 3.33125 6.32191 2.75312 7.51878 2.75312H9.05316V0H6.80003C4.59378 0 3.0594 1.35 3.0594 3.85625V6.025H0.853149V9.10938H3.0594V16H6.12816V9.10938H8.47816Z" fill="#5E4A7E"/>
</svg>
