<svg width="16" height="16" viewBox="0 0 16 16" fill="none" xmlns="http://www.w3.org/2000/svg">
<g clip-path="url(#clip0)">
<path d="M15.3906 3.85001V3.82813C15.0187 2.31251 13.3312 0.687512 11.7875 0.359387H11.7656C9.27186 -0.118738 6.73124 -0.118738 4.23436 0.359387H4.21249C2.66874 0.693762 0.984363 2.31251 0.609363 3.82813V3.85001C0.149988 5.95313 0.149988 8.10001 0.609363 10.1969V10.2188C0.968738 11.6656 2.52499 13.2125 4.00936 13.6313V15.3188C4.00936 15.9375 4.75311 16.2344 5.18124 15.7875L6.89061 14.0156C7.26561 14.0375 7.62498 14.0469 7.99998 14.0469C9.25936 14.0469 10.5156 13.9281 11.7656 13.6813H11.7875C13.3344 13.3469 15.0156 11.7281 15.3906 10.2125V10.1906C15.8469 8.08751 15.8469 5.94688 15.3906 3.85001ZM14.0344 9.89375C13.7906 10.8719 12.5125 12.1031 11.4969 12.325C10.1625 12.5813 8.83123 12.6844 7.48749 12.6438C7.46561 12.6438 7.43436 12.6531 7.42499 12.675C7.23124 12.8688 6.17499 13.9563 6.17499 13.9563L4.84374 15.3219C4.74999 15.4219 4.57811 15.3594 4.57811 15.2188V12.4219C4.57811 12.3813 4.54686 12.3375 4.50624 12.3281C3.99686 12.2125 3.42811 11.85 2.94999 11.4C2.47186 10.9406 2.09061 10.3844 1.95936 9.89375C1.55311 7.98126 1.55311 6.05626 1.95936 4.14376C2.21561 3.16563 3.49061 1.93439 4.50624 1.71251C6.82811 1.27501 9.17811 1.27501 11.5 1.71251C11.6406 1.74376 11.7906 1.79376 11.9375 1.86251C11.9719 1.87814 12.0031 1.89376 12.0375 1.90939C12.0531 1.91876 12.0719 1.92501 12.0875 1.93439C12.1344 1.95939 12.1812 1.98439 12.2281 2.01251C12.2469 2.02501 12.2687 2.03751 12.2906 2.05001C12.7906 2.35314 13.2781 2.81251 13.6187 3.29063C13.6437 3.32501 13.6656 3.35626 13.6875 3.39063C13.7 3.40626 13.7094 3.42501 13.7187 3.44063C13.7437 3.48126 13.7687 3.51876 13.7906 3.55938C13.8125 3.60001 13.8344 3.63751 13.8562 3.67813C13.8781 3.72188 13.9 3.76876 13.9219 3.81251C13.9437 3.85938 13.9625 3.90626 13.9812 3.95626C13.9875 3.97188 13.9937 3.98751 13.9969 4.00313C14.0125 4.05001 14.025 4.09688 14.0375 4.14063C14.1031 4.43751 14.1562 4.73751 14.2031 5.03751C14.2125 5.09688 14.2219 5.15626 14.2281 5.21563C14.4375 6.77813 14.375 8.34376 14.0344 9.89375ZM11.5312 10.0313C11.3281 10.4594 11.0406 10.8219 10.6156 11.0563C10.4969 11.1188 10.3719 11.1406 10.2406 11.175C10.2469 11.1719 10.25 11.1656 10.2469 11.1625C10.2594 11.1406 10.1656 11.1406 10.1687 11.1594C10.1656 11.1625 10.1656 11.1688 10.1781 11.175C10.0375 11.1344 9.90311 11.1031 9.77186 11.0438C8.33436 10.4438 7.02186 9.67813 5.97499 8.50626C5.37499 7.83438 4.91874 7.09063 4.52186 6.28751C4.32811 5.90313 4.17811 5.50626 4.02186 5.12501C3.87186 4.75938 4.08436 4.40001 4.30936 4.13438C4.52186 3.87813 4.79999 3.68751 5.09999 3.54688C5.32499 3.42813 5.55936 3.49376 5.71874 3.69688C6.09374 4.11251 6.42186 4.56251 6.68749 5.05001C6.85936 5.34688 6.81874 5.72188 6.50624 5.92501C6.44374 5.97813 6.36561 6.02813 6.30311 6.09688C6.24061 6.13751 6.18436 6.19063 6.14061 6.25938C6.06874 6.39063 6.06874 6.52501 6.10936 6.66563C6.48436 7.69063 7.11561 8.47813 8.14686 8.91563C8.30936 8.97813 8.47498 9.05626 8.66873 9.03438C8.97498 9.00313 9.08436 8.65001 9.30936 8.46563C9.52186 8.28438 9.80936 8.28438 10.0437 8.43438C10.2781 8.58438 10.5031 8.74063 10.725 8.90313C10.95 9.06563 11.1719 9.20938 11.375 9.39375C11.5719 9.57188 11.6469 9.79688 11.5312 10.0313ZM9.85311 6.54688C9.83123 6.64063 9.76873 6.68751 9.69061 6.69688H9.62811C9.49686 6.67501 9.43436 6.59376 9.42498 6.47188C9.41561 6.36876 9.40311 6.26876 9.38436 6.17501C9.33123 5.98126 9.23436 5.80001 9.07811 5.68438C9.00623 5.63126 8.90623 5.59063 8.82186 5.56563C8.70311 5.52501 8.58748 5.53438 8.46873 5.51251C8.34999 5.48126 8.27498 5.37188 8.29686 5.25626C8.31874 5.15313 8.41561 5.07501 8.53123 5.07501C9.25936 5.12188 9.78123 5.50626 9.85311 6.36251C9.85311 6.41563 9.86561 6.48438 9.85311 6.54688ZM10.8531 6.68126V6.73438C10.8531 6.76563 10.8531 6.81876 10.8437 6.87501C10.7906 7.05626 10.5 7.07813 10.4375 6.89688C10.4156 6.83438 10.4156 6.76563 10.4156 6.71563C10.4156 6.30938 10.3312 5.91251 10.1281 5.57501C9.91873 5.22501 9.59686 4.92501 9.23748 4.74063C9.01248 4.63751 8.76873 4.55938 8.52498 4.51563C8.42186 4.50626 8.31248 4.49376 8.20623 4.47501C8.07499 4.46563 8.00311 4.38126 8.01248 4.25001C8.02186 4.13126 8.10624 4.04688 8.23748 4.04688C8.66561 4.07813 9.08123 4.16563 9.46561 4.36563C10.2469 4.78126 10.6937 5.43438 10.8187 6.29688C10.8187 6.33751 10.8281 6.36876 10.8281 6.41563C10.8437 6.50001 10.8531 6.57813 10.8531 6.68126ZM11.6344 7.41563C11.4844 7.41563 11.4094 7.29688 11.4 7.15938C11.3906 6.89376 11.3687 6.62813 11.3375 6.35626C11.1437 4.95938 10.025 3.80938 8.64061 3.55938C8.43748 3.51876 8.22498 3.50626 8.00936 3.48751C7.86873 3.47813 7.70311 3.46563 7.66561 3.30626C7.64373 3.16563 7.75936 3.05001 7.89061 3.04063H7.99373C9.86873 3.09376 11.4062 4.34376 11.7406 6.18751C11.7937 6.50626 11.8125 6.82813 11.8437 7.14688C11.8594 7.29063 11.775 7.41563 11.6344 7.41563Z" fill="#5E4A7E"/>
</g>
<defs>
<clipPath id="clip0">
<rect width="16" height="16" fill="white"/>
</clipPath>
</defs>
</svg>
