<svg width="34" height="41" viewBox="0 0 34 41" fill="none" xmlns="http://www.w3.org/2000/svg">
    <path d="M3.36758 11.892C2.74152 8.00114 5.64892 4.50621 10.0903 3.22577C10.8785 2.99838 11.7289 3.06311 12.4682 3.40676C13.2076 3.7504 13.7803 4.34711 14.0696 5.07529L15.4954 8.66301C15.7249 9.24018 15.7664 9.8689 15.6146 10.4685C15.4627 11.0681 15.1245 11.6112 14.6432 12.028L10.4017 15.6931C10.1927 15.8741 10.0369 16.1032 9.94955 16.3579C9.86223 16.6127 9.84636 16.8844 9.9035 17.1467L9.94283 17.3075L10.0444 17.7096C10.5719 19.6632 11.3756 21.5409 12.434 23.2922C13.5868 25.1532 15.0175 26.8479 16.682 28.3243L16.8131 28.4356C17.0248 28.613 17.2817 28.7356 17.5585 28.7914C17.8354 28.8472 18.1229 28.8344 18.393 28.7542L23.8767 27.1243C24.4999 26.9396 25.1674 26.9349 25.7935 27.1107C26.4195 27.2865 26.9757 27.6348 27.3905 28.1109L29.9865 31.0831C31.0682 32.3203 30.9371 34.1389 29.6948 35.2307C26.2957 38.2215 21.6216 38.8338 18.37 36.3688C14.3843 33.3352 11.0244 29.6354 8.45799 25.4541C5.8708 21.2761 4.14265 16.6748 3.36431 11.892H3.36758ZM13.3419 17.3508L16.8557 14.3075C17.8188 13.4741 18.496 12.3881 18.8003 11.1889C19.1046 9.98968 19.0221 8.73205 18.5634 7.57742L17.1409 3.9897C16.5585 2.52445 15.406 1.32384 13.9182 0.632524C12.4303 -0.0587962 10.7191 -0.188804 9.13322 0.268993C3.61669 1.86181 -0.811601 6.52894 0.125848 12.359C0.781406 16.4292 2.29247 21.6066 5.62598 27.0129C8.39477 31.5214 12.0192 35.5106 16.3181 38.7813C21.1955 42.4772 27.7052 41.2153 31.9335 37.4977C34.4443 35.2894 34.7 31.6213 32.5203 29.1223L29.9242 26.1469C29.0938 25.1958 27.9812 24.5004 26.7291 24.15C25.477 23.7995 24.1424 23.8099 22.8967 24.1799L18.3438 25.5315C17.1683 24.3878 16.1386 23.1183 15.2758 21.7489C14.4423 20.3644 13.7928 18.8883 13.3419 17.3539V17.3508Z" fill="white"/>
</svg>
