<svg width="22" height="22" viewBox="0 0 22 22" fill="none" xmlns="http://www.w3.org/2000/svg">
<path d="M22 11C22 7.99487 20.7883 5.26781 18.8283 3.28052C18.813 3.26018 18.7967 3.24028 18.7781 3.22174C18.7596 3.2032 18.7397 3.1869 18.7194 3.17168C16.7321 1.21166 14.0051 0 11 0C7.99494 0 5.26788 1.21173 3.28052 3.17168C3.26018 3.18697 3.24035 3.20327 3.22181 3.22174C3.20327 3.24028 3.18697 3.26011 3.17168 3.28052C1.21173 5.26781 0 7.99487 0 11C0 13.9378 1.14393 16.6997 3.22102 18.7773C3.2213 18.7775 3.22159 18.7779 3.22188 18.7782C3.2221 18.7783 3.22224 18.7785 3.22246 18.7787C3.22275 18.779 3.22304 18.7793 3.22332 18.7796C3.32892 18.8852 3.46734 18.9379 3.60576 18.9379C3.74426 18.9379 3.88275 18.8851 3.98835 18.7794C3.99736 18.7704 4.00552 18.7608 4.01374 18.7513L5.68083 17.0841C5.89211 16.8728 5.89211 16.5303 5.68083 16.319C5.46956 16.1078 5.12701 16.1078 4.91581 16.319L3.61485 17.62C2.09786 15.9319 1.21779 13.8073 1.09675 11.541H2.9366C3.23537 11.541 3.47759 11.2988 3.47759 11C3.47759 10.7012 3.23537 10.459 2.9366 10.459H1.0969C1.2227 8.1312 2.15492 6.01444 3.61839 4.38348L4.91581 5.68091C5.02141 5.78651 5.1599 5.83931 5.29832 5.83931C5.43674 5.83931 5.57523 5.78651 5.68083 5.68091C5.89211 5.46956 5.89211 5.12708 5.68083 4.91581L4.38348 3.61831C6.01451 2.15485 8.1312 1.22262 10.459 1.0969V2.93668C10.459 3.23551 10.7012 3.47766 11 3.47766C11.2988 3.47766 11.541 3.23551 11.541 2.93668V1.0969C13.8688 1.22262 15.9855 2.15492 17.6165 3.61839L16.3191 4.91581C16.1078 5.12715 16.1078 5.46963 16.3191 5.68091C16.4247 5.78651 16.5632 5.83931 16.7016 5.83931C16.84 5.83931 16.9785 5.78651 17.0841 5.68091L18.3815 4.38348C19.845 6.01451 20.7773 8.1312 20.903 10.459H19.0633C18.7645 10.459 18.5223 10.7012 18.5223 11C18.5223 11.2988 18.7645 11.541 19.0633 11.541H20.9031C20.7821 13.8073 19.9021 15.932 18.3851 17.6201L17.0841 16.319C16.8729 16.1078 16.5304 16.1078 16.3191 16.319C16.1078 16.5304 16.1078 16.8728 16.3191 17.0841L18.0131 18.7781C18.1187 18.8837 18.2572 18.9365 18.3956 18.9365C18.4648 18.9365 18.534 18.9233 18.5992 18.8969C18.6643 18.8705 18.7253 18.8309 18.7782 18.7781C20.8558 16.7005 22 13.9381 22 11Z" fill="white"/>
<path d="M22 11C22 7.99487 20.7883 5.26781 18.8283 3.28052C18.813 3.26018 18.7967 3.24028 18.7781 3.22174C18.7596 3.2032 18.7397 3.1869 18.7194 3.17168C16.7321 1.21166 14.0051 0 11 0C7.99494 0 5.26788 1.21173 3.28052 3.17168C3.26018 3.18697 3.24035 3.20327 3.22181 3.22174C3.20327 3.24028 3.18697 3.26011 3.17168 3.28052C1.21173 5.26781 0 7.99487 0 11C0 13.9378 1.14393 16.6997 3.22102 18.7773C3.2213 18.7775 3.22159 18.7779 3.22188 18.7782C3.2221 18.7783 3.22224 18.7785 3.22246 18.7787C3.22275 18.779 3.22304 18.7793 3.22332 18.7796C3.32892 18.8852 3.46734 18.9379 3.60576 18.9379C3.74426 18.9379 3.88275 18.8851 3.98835 18.7794C3.99736 18.7704 4.00552 18.7608 4.01374 18.7513L5.68083 17.0841C5.89211 16.8728 5.89211 16.5303 5.68083 16.319C5.46956 16.1078 5.12701 16.1078 4.91581 16.319L3.61485 17.62C2.09786 15.9319 1.21779 13.8073 1.09675 11.541H2.9366C3.23537 11.541 3.47759 11.2988 3.47759 11C3.47759 10.7012 3.23537 10.459 2.9366 10.459H1.0969C1.2227 8.1312 2.15492 6.01444 3.61839 4.38348L4.91581 5.68091C5.02141 5.78651 5.1599 5.83931 5.29832 5.83931C5.43674 5.83931 5.57523 5.78651 5.68083 5.68091C5.89211 5.46956 5.89211 5.12708 5.68083 4.91581L4.38348 3.61831C6.01451 2.15485 8.1312 1.22262 10.459 1.0969V2.93668C10.459 3.23551 10.7012 3.47766 11 3.47766C11.2988 3.47766 11.541 3.23551 11.541 2.93668V1.0969C13.8688 1.22262 15.9855 2.15492 17.6165 3.61839L16.3191 4.91581C16.1078 5.12715 16.1078 5.46963 16.3191 5.68091C16.4247 5.78651 16.5632 5.83931 16.7016 5.83931C16.84 5.83931 16.9785 5.78651 17.0841 5.68091L18.3815 4.38348C19.845 6.01451 20.7773 8.1312 20.903 10.459H19.0633C18.7645 10.459 18.5223 10.7012 18.5223 11C18.5223 11.2988 18.7645 11.541 19.0633 11.541H20.9031C20.7821 13.8073 19.9021 15.932 18.3851 17.6201L17.0841 16.319C16.8729 16.1078 16.5304 16.1078 16.3191 16.319C16.1078 16.5304 16.1078 16.8728 16.3191 17.0841L18.0131 18.7781C18.1187 18.8837 18.2572 18.9365 18.3956 18.9365C18.4648 18.9365 18.534 18.9233 18.5992 18.8969C18.6643 18.8705 18.7253 18.8309 18.7782 18.7781C20.8558 16.7005 22 13.9381 22 11Z" fill="black" fill-opacity="0.75"/>
<path d="M13.4854 4.79611C13.2079 4.68496 12.8931 4.8197 12.782 5.09711L11.2187 8.99941C11.1459 8.99162 11.073 8.98629 11.0001 8.98629C10.2387 8.98629 9.55091 9.40804 9.20504 10.0869C8.84352 10.7966 8.93613 11.6446 9.45259 12.3551C9.50539 12.4277 9.57175 12.4942 9.64489 12.5473C10.0645 12.8524 10.5331 13.0136 11.0001 13.0136C11.7615 13.0136 12.4494 12.5918 12.7951 11.9129C13.1567 11.2032 13.0641 10.3553 12.548 9.64535C12.4952 9.57249 12.4287 9.50585 12.3553 9.45247C12.3158 9.42376 12.2755 9.39758 12.2352 9.37147L13.7864 5.49939C13.8975 5.22212 13.7627 4.90719 13.4854 4.79611ZM11.831 11.4218C11.6708 11.7362 11.3524 11.9315 11 11.9315C10.7689 11.9315 10.5363 11.8508 10.3084 11.6916C10.0487 11.3187 9.99769 10.9145 10.1691 10.578C10.3293 10.2636 10.6477 10.0683 11.0001 10.0683C11.1125 10.0683 11.2251 10.0877 11.3375 10.1256C11.3412 10.1271 11.3446 10.1291 11.3483 10.1306C11.3602 10.1353 11.3721 10.1391 11.384 10.1429C11.4871 10.1825 11.5898 10.237 11.6917 10.3082C11.9513 10.681 12.0024 11.0853 11.831 11.4218Z" fill="white"/>
<path d="M13.4854 4.79611C13.2079 4.68496 12.8931 4.8197 12.782 5.09711L11.2187 8.99941C11.1459 8.99162 11.073 8.98629 11.0001 8.98629C10.2387 8.98629 9.55091 9.40804 9.20504 10.0869C8.84352 10.7966 8.93613 11.6446 9.45259 12.3551C9.50539 12.4277 9.57175 12.4942 9.64489 12.5473C10.0645 12.8524 10.5331 13.0136 11.0001 13.0136C11.7615 13.0136 12.4494 12.5918 12.7951 11.9129C13.1567 11.2032 13.0641 10.3553 12.548 9.64535C12.4952 9.57249 12.4287 9.50585 12.3553 9.45247C12.3158 9.42376 12.2755 9.39758 12.2352 9.37147L13.7864 5.49939C13.8975 5.22212 13.7627 4.90719 13.4854 4.79611ZM11.831 11.4218C11.6708 11.7362 11.3524 11.9315 11 11.9315C10.7689 11.9315 10.5363 11.8508 10.3084 11.6916C10.0487 11.3187 9.99769 10.9145 10.1691 10.578C10.3293 10.2636 10.6477 10.0683 11.0001 10.0683C11.1125 10.0683 11.2251 10.0877 11.3375 10.1256C11.3412 10.1271 11.3446 10.1291 11.3483 10.1306C11.3602 10.1353 11.3721 10.1391 11.384 10.1429C11.4871 10.1825 11.5898 10.237 11.6917 10.3082C11.9513 10.681 12.0024 11.0853 11.831 11.4218Z" fill="black" fill-opacity="0.75"/>
</svg>
