<svg width="90" height="143" viewBox="0 0 90 143" fill="none" xmlns="http://www.w3.org/2000/svg">
<path d="M89.29 43.9707C89.3567 54.7273 85.5716 64.5931 79.2277 72.2917C73.7766 78.9265 70.698 87.1834 70.698 95.7595V108.125C70.698 111.622 69.4185 114.84 67.2994 117.326C64.8738 120.185 61.3019 122.126 57.3436 122.392C57.0238 122.418 56.7172 122.392 56.3974 122.392H33.5138C33.2072 122.392 32.874 122.418 32.5675 122.392C25.1173 121.913 19.2132 115.664 19.2132 108.125V95.7861C19.2132 87.2233 16.1878 78.9531 10.7235 72.3448C4.41948 64.6995 0.621094 54.9135 0.621094 44.2366C0.621094 19.6917 20.5859 0 44.9622 0C69.4052 0 89.1434 19.5721 89.29 43.9707Z" fill="#FFB93E"/>
<path d="M57.3465 122.392C57.2265 123.283 55.3073 138.055 55.2807 138.201C54.9608 140.634 52.162 142.509 48.8301 142.509H41.2999C37.9947 142.509 35.1959 140.674 34.8493 138.254C34.4895 135.701 33.0768 125.929 32.5703 122.405H57.3465V122.392Z" fill="#ED7D2B"/>
<path d="M54.3532 122.392H54.2999H50.0883C43.2246 124.373 36.4008 126.327 33.2422 127.218L33.4021 128.375V128.401L33.5754 129.572C36.1343 128.867 42.265 127.112 57.2719 122.777L57.3253 122.392H54.3532Z" fill="#F99746"/>
<path d="M34.3865 135.183V135.209L34.5598 136.379C37.5185 135.555 43.6226 133.8 56.3238 130.13L56.4971 128.854V128.841L56.657 127.577C48.6338 129.904 38.9179 132.696 34.2266 134.026L34.3865 135.183Z" fill="#F99746"/>
<path d="M37.2321 141.458L37.2721 141.485C37.8052 141.791 38.3916 142.043 39.0313 142.216C42.5099 141.219 47.6943 139.73 55.3844 137.509L55.5443 136.233V136.22L55.7043 134.957C48.8405 136.938 40.9505 139.211 36.0859 140.607C36.4191 140.913 36.8056 141.206 37.2321 141.458Z" fill="#F99746"/>
<path d="M35.9967 122.392L26.4141 65.9764L28.3866 65.644L38.0225 122.392H35.9967Z" fill="#FFEAC5"/>
<path d="M53.0407 122.392H50.9883L61.2506 66.5215L63.2231 66.8805L53.0407 122.392Z" fill="#FFEAC5"/>
<path d="M50.2554 76.0681C50.0021 76.0681 49.7089 76.0415 49.3891 75.9618C48.856 75.8421 48.5095 75.4698 48.4028 74.8848C48.1763 73.6349 49.1625 71.3347 50.5353 69.3934C49.8156 68.1303 48.856 67.1064 47.8431 66.8006C46.3504 66.3486 44.0713 67.7181 42.4853 69.4732C42.7786 69.8854 43.0318 70.3108 43.2717 70.7496C44.0847 72.2787 44.6711 74.2465 43.8714 75.1507C43.5782 75.4831 42.9651 75.7889 41.7657 75.3368C40.2596 74.7651 39.7265 73.502 40.2863 71.8532C40.5662 71.0421 41.0726 70.2045 41.7123 69.42C40.4862 67.8111 38.8336 66.6012 37.2076 66.8006C36.3413 66.907 35.595 67.2128 34.9819 67.6383C36.0214 69.5663 36.2613 72.0128 35.5416 73.3158C35.0485 74.2067 34.1955 74.4859 33.1293 74.1136C32.3697 73.8477 31.9698 72.7972 32.1164 71.441C32.263 70.0582 32.9561 68.5291 34.1955 67.4787C33.8757 66.9735 33.4892 66.5347 33.036 66.189C30.2372 64.0217 27.9315 66.3486 27.8382 66.4416L27.3984 66.0162C27.4251 65.9896 30.1973 63.2106 33.4092 65.697C33.9023 66.0693 34.3155 66.5613 34.6753 67.0932C35.3551 66.6278 36.1814 66.2954 37.141 66.1757C38.9535 65.9497 40.7794 67.2261 42.1255 68.928C43.8581 67.0533 46.3237 65.6705 48.043 66.189C49.1359 66.5214 50.1488 67.5585 50.9351 68.8483C51.6681 67.9042 52.4811 67.0799 53.2674 66.5613C54.5336 65.7236 55.3599 65.9231 55.8263 66.2289C56.3061 66.548 56.7193 66.9735 57.0525 67.4522C57.439 67.1463 57.8388 66.8937 58.2253 66.6943C59.6914 65.963 61.0374 66.0162 62.0237 66.8405L61.6372 67.3059C60.5843 66.415 59.2249 66.8804 58.5052 67.2394C58.1054 67.4389 57.7322 67.6782 57.3723 67.9707C58.3453 69.7258 58.5452 72.0128 57.9854 73.1297C57.6389 73.8211 56.9992 74.0737 56.2662 73.8078C54.9467 73.3291 54.6135 72.4117 54.5735 71.7335C54.5069 70.4305 55.3999 68.9546 56.586 67.8643C56.2795 67.4123 55.9196 67.0134 55.4931 66.7475C54.9201 66.3752 54.1471 66.7209 53.6006 67.0799C52.8143 67.5984 51.988 68.4627 51.2549 69.4333C52.1612 71.1618 52.641 73.1695 52.2945 74.4726C52.1079 75.1241 51.6281 76.0681 50.2554 76.0681ZM50.8551 69.9917C49.6556 71.7335 48.8027 73.7147 49.0026 74.7784C49.0692 75.1108 49.2291 75.2969 49.5224 75.3634C50.7085 75.6293 51.4415 75.2836 51.6948 74.3396C51.988 73.2493 51.6015 71.5208 50.8551 69.9917ZM42.0722 69.9518C41.5124 70.6432 41.0859 71.3745 40.846 72.0527C40.3796 73.4089 40.7661 74.3263 41.9656 74.7784C42.4454 74.9645 43.0984 75.1108 43.405 74.7518C43.8848 74.2066 43.6049 72.6776 42.7252 71.0288C42.5387 70.6698 42.3121 70.3108 42.0722 69.9518ZM34.4888 68.0372C33.4359 68.9812 32.8361 70.3108 32.7028 71.5208C32.5962 72.5579 32.8495 73.3956 33.3159 73.5684C34.0889 73.8476 34.6487 73.6615 34.9952 73.0499C35.6083 71.9197 35.3817 69.7657 34.4888 68.0372ZM56.8792 68.4228C55.8263 69.4333 55.1066 70.723 55.16 71.7203C55.1999 72.4383 55.6397 72.9568 56.4527 73.2626C56.9059 73.4222 57.2124 73.3025 57.4123 72.8903C57.8921 71.9596 57.6922 69.9651 56.8792 68.4228Z" fill="#FFEAC5"/>
<path d="M67.847 17.0058C71.4855 20.4362 71.0323 26.7386 66.341 28.1347C62.8092 29.1984 57.5314 27.7757 54.9325 23.2816C52.3336 18.7742 53.5331 15.0778 56.7184 13.2429C59.9171 11.408 64.0486 13.4424 67.847 17.0058Z" fill="#FFEAC5"/>
</svg>
