<svg width="230" height="52" viewBox="0 0 230 52" fill="none" xmlns="http://www.w3.org/2000/svg">
    <path d="M77.968 20.256V22H69.568V10.8H77.744V12.544H71.648V15.456H77.056V17.168H71.648V20.256H77.968Z" fill="black" fill-opacity="0.72"/>
    <path d="M91.3908 20.24V24.384H89.4708V22H80.8788V24.384H78.9428L78.9588 20.24H79.4388C80.1428 20.208 80.6334 19.6907 80.9108 18.688C81.1988 17.6747 81.3748 16.2293 81.4388 14.352L81.5668 10.8H89.7748V20.24H91.3908ZM83.2628 14.544C83.2094 15.9947 83.0921 17.2053 82.9108 18.176C82.7294 19.136 82.4414 19.824 82.0468 20.24H87.7268V12.56H83.3428L83.2628 14.544Z" fill="black" fill-opacity="0.72"/>
    <path d="M93.3653 10.8H95.4133V18.752L101.429 10.8H103.365V22H101.317V14.064L95.3013 22H93.3653V10.8Z" fill="black" fill-opacity="0.72"/>
    <path d="M116.458 10.8V22H114.378V17.2H108.586V22H106.506V10.8H108.586V15.424H114.378V10.8H116.458Z" fill="black" fill-opacity="0.72"/>
    <path d="M127.023 19.408H121.423L120.319 22H118.175L123.215 10.8H125.263L130.319 22H128.143L127.023 19.408ZM126.335 17.776L124.223 12.88L122.127 17.776H126.335Z" fill="black" fill-opacity="0.72"/>
    <path d="M140.034 10.8V22H137.986V18.88H135.218H134.994L132.914 22H130.722L133.122 18.544C132.344 18.256 131.741 17.8027 131.314 17.184C130.898 16.5547 130.69 15.7973 130.69 14.912C130.69 14.0587 130.882 13.3227 131.266 12.704C131.65 12.0853 132.194 11.616 132.898 11.296C133.602 10.9653 134.429 10.8 135.378 10.8H140.034ZM135.442 12.56C134.589 12.56 133.933 12.7573 133.474 13.152C133.026 13.5467 132.802 14.1227 132.802 14.88C132.802 15.616 133.021 16.1867 133.458 16.592C133.896 16.9867 134.53 17.184 135.362 17.184H137.986V12.56H135.442Z" fill="black" fill-opacity="0.72"/>
    <path d="M147.631 10.8H156.351V12.512H149.679V15.264H152.991C154.335 15.264 155.354 15.5467 156.047 16.112C156.751 16.6667 157.103 17.472 157.103 18.528C157.103 19.6373 156.719 20.496 155.951 21.104C155.183 21.7013 154.09 22 152.671 22H147.631V10.8ZM152.559 20.4C153.359 20.4 153.967 20.2453 154.383 19.936C154.799 19.6267 155.007 19.1787 155.007 18.592C155.007 17.44 154.191 16.864 152.559 16.864H149.679V20.4H152.559Z" fill="black" fill-opacity="0.72"/>
    <path d="M166.726 19.408H161.126L160.022 22H157.878L162.918 10.8H164.966L170.022 22H167.846L166.726 19.408ZM166.038 17.776L163.926 12.88L161.83 17.776H166.038Z" fill="black" fill-opacity="0.72"/>
    <path d="M177.628 16.16C178.3 16.3733 178.823 16.72 179.196 17.2C179.58 17.6693 179.772 18.224 179.772 18.864C179.772 19.536 179.553 20.1227 179.116 20.624C178.679 21.1147 178.092 21.4933 177.356 21.76C176.631 22.0267 175.836 22.16 174.972 22.16C174.225 22.16 173.473 22.0587 172.716 21.856C171.969 21.6427 171.276 21.328 170.636 20.912L171.308 19.392C171.799 19.7227 172.343 19.9787 172.94 20.16C173.537 20.3307 174.129 20.416 174.716 20.416C175.559 20.416 176.257 20.2507 176.812 19.92C177.377 19.5893 177.66 19.136 177.66 18.56C177.66 18.0693 177.457 17.696 177.052 17.44C176.647 17.184 176.087 17.056 175.372 17.056H172.764V15.424H175.212C175.831 15.424 176.316 15.296 176.668 15.04C177.02 14.784 177.196 14.4373 177.196 14C177.196 13.4773 176.956 13.072 176.476 12.784C176.007 12.496 175.404 12.352 174.668 12.352C174.167 12.352 173.649 12.4267 173.116 12.576C172.583 12.7147 172.081 12.9227 171.612 13.2L170.956 11.52C171.532 11.2107 172.14 10.9813 172.78 10.832C173.431 10.672 174.076 10.592 174.716 10.592C175.548 10.592 176.311 10.72 177.004 10.976C177.708 11.232 178.268 11.6 178.684 12.08C179.1 12.5493 179.308 13.104 179.308 13.744C179.308 14.2987 179.159 14.784 178.86 15.2C178.561 15.616 178.151 15.936 177.628 16.16Z" fill="black" fill-opacity="0.72"/>
    <path d="M189.555 19.408H183.955L182.851 22H180.707L185.747 10.8H187.795L192.851 22H190.675L189.555 19.408ZM188.867 17.776L186.755 12.88L184.659 17.776H188.867Z" fill="black" fill-opacity="0.72"/>
    <path d="M74.72 42.16C73.5894 42.16 72.5654 41.9147 71.648 41.424C70.7414 40.9227 70.0267 40.2347 69.504 39.36C68.992 38.4853 68.736 37.4987 68.736 36.4C68.736 35.3013 68.9974 34.3147 69.52 33.44C70.0427 32.5653 70.7574 31.8827 71.664 31.392C72.5814 30.8907 73.6054 30.64 74.736 30.64C75.6534 30.64 76.4907 30.8 77.248 31.12C78.0054 31.44 78.6454 31.904 79.168 32.512L77.824 33.776C77.0134 32.9013 76.016 32.464 74.832 32.464C74.064 32.464 73.376 32.6347 72.768 32.976C72.16 33.3067 71.6854 33.7707 71.344 34.368C71.0027 34.9653 70.832 35.6427 70.832 36.4C70.832 37.1573 71.0027 37.8347 71.344 38.432C71.6854 39.0293 72.16 39.4987 72.768 39.84C73.376 40.1707 74.064 40.336 74.832 40.336C76.016 40.336 77.0134 39.8933 77.824 39.008L79.168 40.288C78.6454 40.896 78 41.36 77.232 41.68C76.4747 42 75.6374 42.16 74.72 42.16Z" fill="black" fill-opacity="0.72"/>
    <path d="M90.4809 30.8L85.6169 39.84C85.1902 40.64 84.6782 41.2427 84.0809 41.648C83.4942 42.0427 82.8542 42.24 82.1609 42.24C81.6062 42.24 81.0569 42.1227 80.5129 41.888L81.0249 40.256C81.4622 40.3947 81.8249 40.464 82.1129 40.464C82.7849 40.464 83.3396 40.1173 83.7769 39.424L83.9529 39.152L79.4889 30.8H81.7129L85.0249 37.376L88.4329 30.8H90.4809Z" fill="black" fill-opacity="0.72"/>
    <path d="M102.86 40.24V44.384H100.94V42H92.3475V44.384H90.4115L90.4275 40.24H90.9075C91.6115 40.208 92.1022 39.6907 92.3795 38.688C92.6675 37.6747 92.8435 36.2293 92.9075 34.352L93.0355 30.8H101.244V40.24H102.86ZM94.7315 34.544C94.6782 35.9947 94.5609 37.2053 94.3795 38.176C94.1982 39.136 93.9102 39.824 93.5155 40.24H99.1955V32.56H94.8115L94.7315 34.544Z" fill="black" fill-opacity="0.72"/>
    <path d="M113.218 40.256V42H104.818V30.8H112.994V32.544H106.898V35.456H112.306V37.168H106.898V40.256H113.218Z" fill="black" fill-opacity="0.72"/>
    <path d="M115.553 30.8H124.273V32.512H117.601V35.264H120.913C122.257 35.264 123.275 35.5467 123.969 36.112C124.673 36.6667 125.025 37.472 125.025 38.528C125.025 39.6373 124.641 40.496 123.873 41.104C123.105 41.7013 122.011 42 120.593 42H115.553V30.8ZM120.481 40.4C121.281 40.4 121.889 40.2453 122.305 39.936C122.721 39.6267 122.929 39.1787 122.929 38.592C122.929 37.44 122.113 36.864 120.481 36.864H117.601V40.4H120.481Z" fill="black" fill-opacity="0.72"/>
    <path d="M137.254 30.8V42H135.174V37.2H129.382V42H127.302V30.8H129.382V35.424H135.174V30.8H137.254Z" fill="black" fill-opacity="0.72"/>
    <path d="M145.564 34.592C146.908 34.592 147.937 34.896 148.652 35.504C149.377 36.1013 149.74 36.992 149.74 38.176C149.74 39.4133 149.345 40.3627 148.556 41.024C147.767 41.6747 146.657 42 145.228 42H140.412V30.8H142.46V34.592H145.564ZM145.132 40.4C145.943 40.4 146.567 40.2133 147.004 39.84C147.441 39.4667 147.66 38.9227 147.66 38.208C147.66 36.8533 146.817 36.176 145.132 36.176H142.46V40.4H145.132ZM151.356 30.8H153.404V42H151.356V30.8Z" fill="black" fill-opacity="0.72"/>
    <path d="M157.848 30.8L160.488 34.544L163.128 30.8H165.56L161.8 36.176L165.864 42H163.4L160.488 37.92L157.592 42H155.192L159.24 36.256L155.448 30.8H157.848Z" fill="black" fill-opacity="0.72"/>
    <path d="M179.476 39.408H173.876L172.772 42H170.628L175.668 30.8H177.716L182.772 42H180.596L179.476 39.408ZM178.788 37.776L176.676 32.88L174.58 37.776H178.788Z" fill="black" fill-opacity="0.72"/>
    <path d="M188.618 37.28H186.538V42H184.49V30.8H186.538V35.488H188.682L191.898 30.8H194.106L190.282 36.224L194.25 42H191.898L188.618 37.28Z" fill="black" fill-opacity="0.72"/>
    <path d="M203.68 32.56H199.968V42H197.904V32.56H194.208V30.8H203.68V32.56Z" fill="black" fill-opacity="0.72"/>
    <path d="M210.502 42.16C209.361 42.16 208.331 41.9147 207.414 41.424C206.497 40.9227 205.777 40.2347 205.254 39.36C204.731 38.4747 204.47 37.488 204.47 36.4C204.47 35.312 204.731 34.3307 205.254 33.456C205.777 32.5707 206.497 31.8827 207.414 31.392C208.331 30.8907 209.361 30.64 210.502 30.64C211.643 30.64 212.673 30.8907 213.59 31.392C214.507 31.8827 215.227 32.5653 215.75 33.44C216.273 34.3147 216.534 35.3013 216.534 36.4C216.534 37.4987 216.273 38.4853 215.75 39.36C215.227 40.2347 214.507 40.9227 213.59 41.424C212.673 41.9147 211.643 42.16 210.502 42.16ZM210.502 40.336C211.249 40.336 211.921 40.1707 212.518 39.84C213.115 39.4987 213.585 39.0293 213.926 38.432C214.267 37.824 214.438 37.1467 214.438 36.4C214.438 35.6533 214.267 34.9813 213.926 34.384C213.585 33.776 213.115 33.3067 212.518 32.976C211.921 32.6347 211.249 32.464 210.502 32.464C209.755 32.464 209.083 32.6347 208.486 32.976C207.889 33.3067 207.419 33.776 207.078 34.384C206.737 34.9813 206.566 35.6533 206.566 36.4C206.566 37.1467 206.737 37.824 207.078 38.432C207.419 39.0293 207.889 39.4987 208.486 39.84C209.083 40.1707 209.755 40.336 210.502 40.336Z" fill="black" fill-opacity="0.72"/>
    <path d="M226.21 36.176C226.924 36.368 227.468 36.6987 227.842 37.168C228.215 37.6267 228.402 38.2027 228.402 38.896C228.402 39.8773 228.039 40.64 227.314 41.184C226.588 41.728 225.538 42 224.162 42H218.85V30.8H223.858C225.116 30.8 226.098 31.0507 226.802 31.552C227.506 32.0533 227.858 32.7627 227.858 33.68C227.858 34.2667 227.714 34.7733 227.426 35.2C227.148 35.6267 226.743 35.952 226.21 36.176ZM220.898 35.584H223.682C224.354 35.584 224.866 35.4507 225.218 35.184C225.57 34.9173 225.746 34.5227 225.746 34C225.746 33.4773 225.57 33.0827 225.218 32.816C224.866 32.5387 224.354 32.4 223.682 32.4H220.898V35.584ZM224.098 40.4C225.57 40.4 226.306 39.8453 226.306 38.736C226.306 37.648 225.57 37.104 224.098 37.104H220.898V40.4H224.098Z" fill="black" fill-opacity="0.72"/>
    <g clip-path="url(#clip0)">
        <path d="M13 3.48334C0.632546 10.6237 -3.65701 26.6325 3.48334 39C10.6237 51.3675 26.6325 55.657 39 48.5167C51.3675 41.3763 55.657 25.3674 48.5167 13C41.3763 0.632545 25.3675 -3.65701 13 3.48334ZM16.0469 8.76068C23.8253 4.26979 33.5477 5.72061 39.7454 11.6225C39.4495 11.3866 39.0691 11.2548 38.6628 11.2919C34.0554 11.7084 27.1216 13.0386 20.668 16.7646C14.2143 20.4907 9.59545 25.8304 6.93103 29.6123C6.69582 29.9457 6.61967 30.3409 6.67598 30.7151C4.66371 22.3968 8.26842 13.2516 16.0469 8.76068ZM11.0628 39.1534C11.4812 39.5728 12.1246 39.7266 12.709 39.492L16.1332 38.1026C20.5024 36.3479 25.5871 37.7104 28.4936 41.4145L30.7644 44.3299C31.1012 44.759 31.622 44.9458 32.1271 44.8911C24.6647 47.3004 16.2589 45.0455 11.0628 39.1534ZM28.2852 29.958C26.1026 31.2181 23.3021 30.4677 22.042 28.2852C20.7819 26.1026 21.5323 23.3021 23.7148 22.042C25.8974 20.7819 28.6979 21.5323 29.958 23.7148C31.2181 25.8974 30.4677 28.6979 28.2852 29.958ZM39.2966 40.7517C39.5965 40.3416 39.6952 39.7973 39.492 39.2909L38.1025 35.8667C36.3479 31.4975 37.7103 26.4128 41.4145 23.5063L44.3299 21.2356C44.8252 20.8467 45.0137 20.2126 44.8598 19.6405C47.3644 27.0867 45.1144 35.4938 39.2966 40.7517Z" fill="#20D152"/>
        <path d="M25.2383 24.6807C24.5104 25.1009 24.2604 26.0338 24.6807 26.7617C25.1009 27.4896 26.0338 27.7396 26.7617 27.3193C27.4896 26.8991 27.7396 25.9662 27.3193 25.2383C26.8991 24.5104 25.9662 24.2604 25.2383 24.6807Z" fill="#20D152"/>
    </g>
    <defs>
        <clipPath id="clip0">
            <rect width="52" height="52" fill="white"/>
        </clipPath>
    </defs>
</svg>
