<svg width="44" height="48" viewBox="0 0 44 48" fill="none" xmlns="http://www.w3.org/2000/svg">
<path d="M35.2735 13.9135V39.4089C35.2735 41.5426 33.5437 43.2725 31.4099 43.2725H4.84759C2.71381 43.2725 0.983971 41.5426 0.983971 39.4089V3.86361C0.983971 1.72984 2.71381 0 4.84759 0H21.3836C21.8228 0 22.2516 0.0996812 22.6399 0.286487C22.9321 0.427026 34.8703 12.3998 35.0122 12.7108C35.1828 13.0849 35.2735 13.4945 35.2735 13.9135Z" fill="white"/>
<path d="M18.4773 14.4885H6.52903C6.12895 14.4885 5.8046 14.1642 5.8046 13.7641C5.8046 13.364 6.12895 13.0397 6.52903 13.0397H18.4773C18.8773 13.0397 19.2017 13.364 19.2017 13.7641C19.2017 14.1642 18.8773 14.4885 18.4773 14.4885Z" fill="#FFED00"/>
<path d="M18.4773 31.8748H6.52903C6.12895 31.8748 5.8046 31.5504 5.8046 31.1503C5.8046 30.7503 6.12895 30.4259 6.52903 30.4259H18.4773C18.8773 30.4259 19.2017 30.7503 19.2017 31.1503C19.2017 31.5504 18.8773 31.8748 18.4773 31.8748Z" fill="#FFED00"/>
<path d="M27.9721 20.2839H6.33585C5.93577 20.2839 5.61142 19.9596 5.61142 19.5595C5.61142 19.1594 5.93577 18.8351 6.33585 18.8351H27.9721C28.3722 18.8351 28.6965 19.1594 28.6965 19.5595C28.6965 19.9596 28.3722 20.2839 27.9721 20.2839Z" fill="#FFED00"/>
<path d="M35.0137 12.7151H25.1972C23.7552 12.7151 22.5854 11.5425 22.5854 10.0975V0.262695C22.8984 0.403717 23.1872 0.602693 23.4345 0.850931L34.4274 11.8671C34.6737 12.1143 34.8727 12.4022 35.0137 12.7151Z" fill="#C5B927"/>
<path d="M23.1426 26.0793H6.33585C5.93577 26.0793 5.61142 25.7551 5.61142 25.3549C5.61142 24.9547 5.93577 24.6305 6.33585 24.6305H23.1426C23.5427 24.6305 23.867 24.9547 23.867 25.3549C23.867 25.7551 23.5427 26.0793 23.1426 26.0793Z" fill="#FFED00"/>
<path d="M37.7616 46.7365L31.8569 39.2496L34.323 36.8492L41.7537 42.7407C43.4608 44.0196 43.3224 45.7001 42.0203 47.0034C40.7182 48.3067 39.0393 48.4453 37.7616 46.7365Z" fill="#FFED00"/>
<path d="M37.1551 39.095L34.1222 42.1211L31.8571 39.2495L34.3231 36.8492L37.1551 39.095Z" fill="#C5B927"/>
<path d="M37.8094 34.3481L29.4085 42.7314L22.197 35.5287L30.5979 27.1454L37.8094 34.3481Z" fill="#FFED00"/>
<path d="M29.7389 44.6023L29.7383 44.6029C29.0241 45.3157 27.9821 45.432 27.4107 44.8626L20.0587 37.5239C19.487 36.9542 19.6028 35.9138 20.3175 35.2006L20.3181 35.2C21.0324 34.4872 22.0743 34.3709 22.6457 34.9403L29.9977 42.279C30.5695 42.8487 30.4536 43.8891 29.7389 44.6023Z" fill="#C5B927"/>
<path d="M39.658 34.6738L39.6586 34.6732C40.3707 33.9582 40.4869 32.9153 39.9181 32.3433L32.5863 24.9844C32.0172 24.4121 30.9778 24.5281 30.2652 25.2435L30.2647 25.244C29.5525 25.959 29.4363 27.0019 30.0051 27.5739L37.3369 34.9328C37.906 35.5051 38.9453 35.3891 39.658 34.6738Z" fill="#C5B927"/>
</svg>
