<svg width="30" height="100%" viewBox="0 0 30 240" fill="none" xmlns="http://www.w3.org/2000/svg">
    <path d="M13.5858 239.414C14.3668 240.195 15.6332 240.195 16.4142 239.414L29.1421 226.686C29.9232 225.905 29.9232 224.639 29.1421 223.858C28.3611 223.077 27.0948 223.077 26.3137 223.858L15 235.172L3.6863 223.858C2.90525 223.077 1.63892 223.077 0.857874 223.858C0.0768254 224.639 0.0768255 225.905 0.857874 226.686L13.5858 239.414ZM13 8.74228e-08L13 238L17 238L17 -8.74228e-08L13 8.74228e-08Z" fill="#20D152"/>
</svg>
