<svg width="15" height="15" viewBox="0 0 25 25" fill="none" xmlns="http://www.w3.org/2000/svg">
<path d="M13.9655 12.5069L24.682 1.79043C25.0956 1.39097 25.107 0.731877 24.7076 0.318267C24.3081 -0.0953437 23.649 -0.106813 23.2354 0.292645C23.2268 0.301002 23.2182 0.309543 23.2098 0.318267L12.4933 11.0347L1.77677 0.318206C1.36316 -0.0812517 0.704069 -0.0697828 0.304611 0.343828C-0.0850862 0.747311 -0.0850862 1.38694 0.304611 1.79043L11.0211 12.5069L0.304611 23.2234C-0.101862 23.6299 -0.101862 24.289 0.304611 24.6955C0.711145 25.1019 1.37024 25.1019 1.77677 24.6955L12.4933 13.9791L23.2097 24.6955C23.6234 25.095 24.2824 25.0835 24.6819 24.6699C25.0715 24.2664 25.0715 23.6268 24.6819 23.2234L13.9655 12.5069Z" fill="black" fill-opacity="0.36"/>
</svg>
