<svg width="19" height="18" viewBox="0 0 19 18" fill="none" xmlns="http://www.w3.org/2000/svg">
<g clip-path="url(#clip0_107_389)">
<path d="M8.95798 16.0939C10.7047 15.8023 10.9838 14.578 11.0167 14.0027C11.027 13.8216 11.1194 13.6534 11.272 13.554C11.9119 13.1372 12.0811 12.5787 12.0811 12.1043C12.0811 11.7635 11.9938 11.4662 11.9308 11.296C11.9229 11.2748 11.9191 11.2528 11.9191 11.2313C11.9191 11.164 11.9557 11.0997 12.0173 11.064C12.7476 10.6407 12.936 10.0389 12.936 9.5307C12.936 9.2349 12.8722 8.9709 12.8144 8.79214C12.8084 8.7735 12.8055 8.73304 12.8055 8.71471C12.8055 8.61756 12.8856 8.51073 12.9903 8.51073H16.7458C17.6043 8.51073 18.0335 7.87459 18.0335 7.23443C18.0335 6.59426 17.6043 5.95812 16.7458 5.95812H10.1398C9.75168 5.95812 9.51167 5.66333 9.51167 5.34565C9.51167 5.15266 9.60021 4.9667 9.79781 4.83884L10.7533 4.2249C11.2035 3.95355 11.3903 3.56153 11.3903 3.17098C11.3904 2.28824 10.4367 1.42484 9.41862 2.03824L0.106816 6.87203C0.0459779 6.90359 3.00264e-07 6.96679 2.97273e-07 7.03509L0 13.8233C-4.24448e-09 13.9202 0.0836339 14.0003 0.180881 14.0062L2.9673 14.1761C2.99943 14.178 3.03265 14.1886 3.05956 14.2062C5.62643 15.8913 7.28081 16.3737 8.95798 16.0939Z" fill="black" fill-opacity="0.4"/>
</g>
<defs>
<clipPath id="clip0_107_389">
<rect width="18.0335" height="18" fill="white"/>
</clipPath>
</defs>
</svg>
