<svg width="36" height="36" viewBox="0 0 36 36" fill="none" xmlns="http://www.w3.org/2000/svg">
<path d="M25.2914 0H10.7086C4.76719 0 0 4.76719 0 10.7086V25.2914C0 31.2328 4.76719 36 10.7086 36H25.2914C31.2328 36 36 31.2328 36 25.2914V10.7086C36 4.85859 31.2328 0 25.2914 0ZM32.4 25.2914C32.4 29.25 29.25 32.4 25.2914 32.4H10.7086C6.75 32.4 3.6 29.25 3.6 25.2914V10.7086C3.6 6.75 6.75 3.6 10.7086 3.6H25.2914C29.25 3.6 32.4 6.75 32.4 10.7086V25.2914ZM18 8.73281C12.8672 8.73281 8.73281 12.8742 8.73281 18C8.73281 23.1258 12.8672 27.2672 18 27.2672C23.1328 27.2672 27.2672 23.1258 27.2672 18C27.2672 12.8742 23.1328 8.73281 18 8.73281ZM18 23.7586C14.85 23.7586 12.3328 21.2414 12.3328 18.0914C12.3328 14.9414 14.85 12.4242 18 12.4242C21.15 12.4242 23.6672 14.9414 23.6672 18.0914C23.6672 21.15 21.15 23.7586 18 23.7586ZM27.3586 6.56719C28.6031 6.56719 29.6086 7.57266 29.6086 8.81719C29.6086 10.0617 28.6031 11.0672 27.3586 11.0672C26.1141 11.0672 25.1086 10.0617 25.1086 8.81719C25.1086 7.57266 26.1141 6.56719 27.3586 6.56719Z" fill="url(#paint0_linear_325_893)"/>
<defs>
<linearGradient id="paint0_linear_325_893" x1="18" y1="36" x2="18" y2="0" gradientUnits="userSpaceOnUse">
<stop stop-color="#E09B3D"/>
<stop offset="0.3" stop-color="#C74C4D"/>
<stop offset="0.6" stop-color="#C21975"/>
<stop offset="1" stop-color="#7024C4"/>
</linearGradient>
</defs>
</svg>
