<svg width="20" height="20" viewBox="0 0 20 20" fill="none" xmlns="http://www.w3.org/2000/svg">
<g opacity="0.6">
<path d="M14.3476 11.3867C14.6484 11.3867 14.8281 11.1445 14.8867 10.9062L15.1874 8.13672C15.1874 7.83594 14.9492 7.53516 14.6484 7.53516H11.3515V5.1875C11.3515 4.16406 11.6523 3.44141 13.1484 3.44141H15.0663V0H12.2499C9.49213 0 7.57416 1.6875 7.57416 4.82031V7.53125H4.81635V11.3867H7.57416V20H11.4101V11.3867H14.3476Z" fill="white"/>
</g>
</svg>
