<svg width="20" height="20" viewBox="0 0 20 20" fill="none" xmlns="http://www.w3.org/2000/svg">
<path d="M5 0C4.3125 0 3.75 0.5625 3.75 1.25V18.75C3.75 19.4375 4.3125 20 5 20H17.5C18.1875 20 18.75 19.4375 18.75 18.75V5L13.75 0H5Z" fill="#E2E5E7"/>
<path d="M15 5H18.75L13.75 0V3.75C13.75 4.4375 14.3125 5 15 5Z" fill="#B0B7BD"/>
<path d="M18.75 8.75L15 5H18.75V8.75Z" fill="#CAD1D8"/>
<path d="M16.25 16.25C16.25 16.5938 15.9688 16.875 15.625 16.875H1.875C1.53125 16.875 1.25 16.5938 1.25 16.25V10C1.25 9.65625 1.53125 9.375 1.875 9.375H15.625C15.9688 9.375 16.25 9.65625 16.25 10V16.25Z" fill="#F15642"/>
<path d="M3.97437 11.8419C3.97437 11.6769 4.10437 11.4969 4.31374 11.4969H5.46811C6.11811 11.4969 6.70311 11.9319 6.70311 12.7656C6.70311 13.5556 6.11811 13.9956 5.46811 13.9956H4.63374V14.6556C4.63374 14.8756 4.49374 15 4.31374 15C4.14874 15 3.97437 14.8756 3.97437 14.6556V11.8419ZM4.63374 12.1262V13.3712H5.46811C5.80311 13.3712 6.06811 13.0756 6.06811 12.7656C6.06811 12.4162 5.80311 12.1262 5.46811 12.1262H4.63374Z" fill="white"/>
<path d="M7.68191 15C7.51691 15 7.33691 14.91 7.33691 14.6906V11.8519C7.33691 11.6725 7.51691 11.5419 7.68191 11.5419H8.82629C11.11 11.5419 11.06 15 8.87129 15H7.68191ZM7.99691 12.1519V14.3906H8.82629C10.1757 14.3906 10.2357 12.1519 8.82629 12.1519H7.99691Z" fill="white"/>
<path d="M11.8701 12.1919V12.9863H13.1444C13.3244 12.9863 13.5044 13.1662 13.5044 13.3406C13.5044 13.5056 13.3244 13.6406 13.1444 13.6406H11.8701V14.69C11.8701 14.865 11.7457 14.9994 11.5707 14.9994C11.3507 14.9994 11.2163 14.865 11.2163 14.69V11.8513C11.2163 11.6719 11.3513 11.5413 11.5707 11.5413H13.3251C13.5451 11.5413 13.6751 11.6719 13.6751 11.8513C13.6751 12.0113 13.5451 12.1913 13.3251 12.1913H11.8701V12.1919Z" fill="white"/>
<path d="M15.625 16.875H3.75V17.5H15.625C15.9688 17.5 16.25 17.2188 16.25 16.875V16.25C16.25 16.5938 15.9688 16.875 15.625 16.875Z" fill="#CAD1D8"/>
</svg>
