<svg width="60" height="60" viewBox="0 0 60 60" fill="none" xmlns="http://www.w3.org/2000/svg">
<g clip-path="url(#clip0_102:229)">
<path d="M57.9955 58.7993L56.995 53.7965C56.8999 53.3306 56.4899 52.9959 56.0144 52.996H54.0133V45.992C54.0133 44.3342 52.6694 42.9903 51.0115 42.9903H23.9961C22.3383 42.9903 20.9944 44.3342 20.9944 45.992V52.996H18.9933C18.5177 52.9959 18.1078 53.3306 18.0127 53.7965L17.0121 58.7993C16.9016 59.3408 17.2509 59.8693 17.7923 59.9797C17.8582 59.9932 17.9254 60 17.9927 60H57.015C57.5675 60.0001 58.0157 59.5522 58.0158 58.9997C58.0158 58.9323 58.009 58.8652 57.9955 58.7993ZM22.9955 45.992C22.9955 45.4394 23.4435 44.9914 23.9961 44.9914H51.0115C51.5641 44.9914 52.0121 45.4394 52.0121 45.992V52.996H22.9955V45.992ZM19.2134 57.9989L19.8137 54.9971H55.1949L55.7953 57.9989H19.2134Z" fill="white"/>
<path d="M50.9736 19.9481C50.0624 19.0809 48.7151 18.8558 47.5716 19.3798L38.9417 10.7499L32.448 4.25218C32.9938 3.11015 32.7627 1.74825 31.8707 0.850235C30.683 -0.283412 28.8139 -0.283412 27.6262 0.850235L16.3038 12.1647C15.1261 13.3236 15.111 15.2178 16.2699 16.3955C17.1714 17.3116 18.5573 17.5495 19.7127 16.9864L22.6734 19.9471L22.3972 20.2233C21.4206 21.1832 21.0857 22.6207 21.5378 23.9134L6.27004 39.1811C5.12664 38.6329 3.76199 38.8642 2.8631 39.7584C1.6913 40.9306 1.6913 42.8307 2.8631 44.0029L7.10752 48.2483C8.27469 49.4202 10.1708 49.4241 11.3427 48.2569C12.2443 47.3589 12.4801 45.9891 11.9303 44.8413L27.198 29.5726C28.4907 30.0231 29.9274 29.6886 30.8881 28.7131L31.1633 28.438L34.8313 32.1061C34.1232 33.6008 34.7608 35.3865 36.2554 36.0946C37.3982 36.636 38.758 36.4013 39.6531 35.508L50.9736 24.1926C52.1454 23.0204 52.1454 21.1203 50.9736 19.9481ZM19.1363 14.9953C18.7458 15.3863 18.1122 15.3867 17.7212 14.9961C17.721 14.9958 17.7207 14.9956 17.7205 14.9953C17.3295 14.6048 17.3291 13.9712 17.7197 13.5803C17.72 13.58 17.7202 13.5798 17.7205 13.5795L21.9659 9.33508L29.0419 2.26004C29.4325 1.87007 30.0651 1.87007 30.4557 2.26004C30.8463 2.65076 30.8463 3.28412 30.4557 3.67485L19.1363 14.9953ZM9.93751 46.834C9.54654 47.2247 8.91293 47.2245 8.5222 46.8335L4.27778 42.5901C3.89981 42.187 3.9202 41.5537 4.32331 41.1758C4.7084 40.8147 5.30774 40.8148 5.69259 41.1763L9.93801 45.4187C10.3287 45.8096 10.3285 46.4433 9.93751 46.834ZM10.6454 43.2965L7.8148 40.4658L22.6733 25.6074L25.5029 28.438L10.6454 43.2965ZM29.4732 27.2983C28.8439 27.9281 27.8232 27.9283 27.1936 27.2991C27.1934 27.2988 27.1931 27.2986 27.1929 27.2983L23.8119 23.9174C23.1837 23.2875 23.1837 22.268 23.8119 21.6381L24.0881 21.3629L29.7483 27.0232L29.4732 27.2983ZM36.116 30.5612L21.2585 15.7027L31.1631 5.79706L46.0216 20.6555L36.116 30.5612ZM49.5586 22.7778L38.2382 34.0972C37.8604 34.5006 37.2272 34.5213 36.8239 34.1436C36.4205 33.7659 36.3997 33.1327 36.7775 32.7293C36.792 32.7138 36.8068 32.6988 36.8224 32.6843L48.1448 21.3628C48.3311 21.1737 48.5858 21.0679 48.8512 21.0697C49.4038 21.0698 49.8517 21.5178 49.8515 22.0705C49.8515 22.3357 49.7462 22.5901 49.5586 22.7778Z" fill="white"/>
<path d="M27.8763 14.6391L29.6153 12.9021L28.1986 11.4873L26.4616 13.2243C25.2141 14.4741 25.2141 16.498 26.4616 17.7479L27.3621 18.6484L28.7769 17.2336L27.8764 16.3331C27.4101 15.8646 27.4101 15.1075 27.8763 14.6391Z" fill="white"/>
<path d="M27.486 46.9926C26.1118 46.9942 24.9982 48.1078 24.9966 49.482V50.9949H26.9977V49.482C26.9982 49.2126 27.2166 48.9942 27.486 48.9937H31V46.9926H27.486Z" fill="white"/>
<path d="M30.9998 8.55629L29.5848 9.9713L30.9998 11.3863L32.4149 9.9713L30.9998 8.55629Z" fill="white"/>
</g>
<defs>
<clipPath id="clip0_102:229">
<rect width="60" height="60" fill="white"/>
</clipPath>
</defs>
</svg>
