<svg width="20" height="20" viewBox="0 0 20 20" fill="none" xmlns="http://www.w3.org/2000/svg">
<g opacity="0.6">
<path d="M14.0508 0H5.94922C2.64844 0 0 2.64844 0 5.94922V14.0508C0 17.3516 2.64844 20 5.94922 20H14.0508C17.3516 20 20 17.3516 20 14.0508V5.94922C20 2.69922 17.3516 0 14.0508 0ZM18 14.0508C18 16.25 16.25 18 14.0508 18H5.94922C3.75 18 2 16.25 2 14.0508V5.94922C2 3.75 3.75 2 5.94922 2H14.0508C16.25 2 18 3.75 18 5.94922V14.0508ZM10 4.85156C7.14844 4.85156 4.85156 7.15234 4.85156 10C4.85156 12.8477 7.14844 15.1484 10 15.1484C12.8516 15.1484 15.1484 12.8477 15.1484 10C15.1484 7.15234 12.8516 4.85156 10 4.85156ZM10 13.1992C8.25 13.1992 6.85156 11.8008 6.85156 10.0508C6.85156 8.30078 8.25 6.90234 10 6.90234C11.75 6.90234 13.1484 8.30078 13.1484 10.0508C13.1484 11.75 11.75 13.1992 10 13.1992ZM15.1992 3.64844C15.8906 3.64844 16.4492 4.20703 16.4492 4.89844C16.4492 5.58984 15.8906 6.14844 15.1992 6.14844C14.5078 6.14844 13.9492 5.58984 13.9492 4.89844C13.9492 4.20703 14.5078 3.64844 15.1992 3.64844Z" fill="white"/>
</g>
</svg>
