<svg width="20" height="20" viewBox="0 0 20 20" fill="none" xmlns="http://www.w3.org/2000/svg">
<g opacity="0.6">
<path d="M19.4297 15.6719H16.5156C15.75 15.7266 15.1563 15.4453 14.6484 14.9063C14.2539 14.4805 13.8828 14.0586 13.4883 13.6328C13.3203 13.4648 13.1484 13.293 12.9492 13.1797C12.5547 12.9258 12.2148 13.0117 11.9883 13.4063C11.7617 13.832 11.707 14.2852 11.6758 14.7656C11.6484 15.4453 11.4492 15.6445 10.7422 15.6719C9.26953 15.7266 7.88281 15.5313 6.58203 14.7656C5.44922 14.1133 4.54297 13.1797 3.78125 12.1328C2.27734 10.0938 1.11719 7.85938 0.097657 5.53906C-0.128905 5.03125 0.0429696 4.74609 0.60547 4.71875C1.56641 4.69141 2.5 4.69141 3.46484 4.71875C3.85938 4.71875 4.11719 4.94531 4.25781 5.3125C4.76563 6.58594 5.39063 7.77344 6.18359 8.90625C6.38281 9.1875 6.60938 9.5 6.91797 9.69922C7.25781 9.92578 7.51172 9.83984 7.68359 9.47266C7.79688 9.24609 7.82422 8.96484 7.85156 8.70703C7.9375 7.82812 7.9375 6.95313 7.79688 6.07422C7.71094 5.53516 7.40234 5.16797 6.86328 5.08203C6.58203 5.02734 6.63672 4.91406 6.75 4.76953C6.97656 4.48828 7.20313 4.31641 7.65625 4.31641H10.9375C11.4453 4.42969 11.5586 4.65625 11.6445 5.16406V8.81641C11.6445 9.01563 11.7578 9.60938 12.0977 9.75C12.3789 9.83594 12.5781 9.60938 12.75 9.4375C13.543 8.58984 14.1094 7.59766 14.6172 6.57812C14.8438 6.125 15.043 5.67187 15.2109 5.19141C15.3516 4.85156 15.5781 4.68359 15.9453 4.68359H19.1172C19.2031 4.68359 19.3164 4.68359 19.3984 4.71094C19.9375 4.79688 20.0781 5.02344 19.9063 5.55859C19.6523 6.37891 19.1406 7.05859 18.6328 7.73828C18.0938 8.47266 17.5273 9.18359 17.0195 9.91797C16.5938 10.5977 16.625 10.9375 17.2188 11.5313C17.8711 12.1836 18.5781 12.7773 19.1719 13.5117C19.4258 13.8242 19.6797 14.1641 19.8789 14.5313C20.1641 15.0469 19.9102 15.6406 19.4297 15.6719Z" fill="white"/>
</g>
</svg>
