<svg width="157" height="33" viewBox="0 0 157 33" fill="none" xmlns="http://www.w3.org/2000/svg">
<g clip-path="url(#clip0_111_638)">
<path fill-rule="evenodd" clip-rule="evenodd" d="M38.552 22.2224C38.3257 22.2224 38.0994 22.2224 37.9485 22.3032C37.7976 22.384 37.6467 22.4648 37.5713 22.5456C37.5335 22.586 37.4958 22.6466 37.4581 22.7072C37.4204 22.7678 37.3827 22.8284 37.3449 22.8688C37.3072 22.9092 37.2884 22.9698 37.2695 23.0304C37.2506 23.0911 37.2318 23.1517 37.194 23.1921C37.194 22.9496 37.194 22.788 37.2695 22.5456C37.3449 22.0607 37.4204 21.7375 37.5713 21.4951C37.7222 21.2527 38.0239 21.0102 38.4012 20.8486C38.4324 20.8486 38.4766 20.8347 38.5284 20.8185C38.6016 20.7955 38.69 20.7678 38.7784 20.7678C38.8668 20.7678 38.9552 20.7401 39.0284 20.7171C39.0802 20.7009 39.1244 20.687 39.1556 20.687C39.231 20.687 39.3819 20.6062 39.4574 20.5254C39.6083 20.4446 39.7592 20.3638 39.8346 20.2829L39.6837 19.7981C39.5328 19.9597 39.3819 20.0405 39.231 20.1213C39.0802 20.2021 38.9293 20.2829 38.7029 20.2829C38.6165 20.3138 38.541 20.3329 38.4766 20.3492C38.3723 20.3755 38.2969 20.3946 38.2503 20.4446C38.0925 20.5009 37.9347 20.5965 37.8024 20.6767C37.745 20.7115 37.6924 20.7433 37.6467 20.7678C37.4958 20.9294 37.3449 21.091 37.2695 21.2527C37.194 21.4143 37.1186 21.6567 37.0432 21.8991C36.9677 22.1416 36.9677 22.4648 36.9677 22.7072V24.5658C36.9677 24.8082 36.9677 24.9699 37.0432 25.2123C37.0432 25.4547 37.1186 25.6163 37.194 25.7779C37.2695 25.9396 37.3449 26.0204 37.4958 26.182C37.5713 26.3436 37.7222 26.4244 37.9485 26.4244C38.0994 26.5052 38.3257 26.5052 38.552 26.5052C39.1556 26.5052 39.5328 26.3436 39.7592 25.9396C39.9855 25.5355 40.0609 24.9699 40.0609 24.2426C40.0609 23.4345 39.9855 22.8688 39.7592 22.5456C39.7167 22.5274 39.6752 22.5092 39.6343 22.4913C39.3112 22.3497 39.0207 22.2224 38.552 22.2224ZM39.231 25.6971C39.0802 25.9396 38.7784 26.1012 38.4012 26.1012C38.0239 26.1012 37.7222 25.9396 37.5713 25.6971C37.4204 25.4547 37.3449 24.9699 37.3449 24.3234C37.3449 23.7577 37.4204 23.3537 37.5713 23.1113C37.7222 22.8688 38.0239 22.7072 38.4766 22.7072C38.8538 22.7072 39.1556 22.788 39.3065 23.0304C39.4574 23.2729 39.5328 23.6769 39.5328 24.3234C39.4574 24.9699 39.3819 25.4547 39.231 25.6971Z" fill="#878787"/>
<path d="M45.1912 22.0607H44.7385V26.4244H45.1912V22.0607Z" fill="#878787"/>
<path fill-rule="evenodd" clip-rule="evenodd" d="M41.7207 23.8385H42.7015C43.2296 23.8385 43.5313 23.9193 43.6068 24.1618C43.8331 24.4042 43.9086 24.7274 43.9086 25.2123C43.9086 25.6971 43.7577 26.1012 43.6068 26.2628C43.4559 26.4244 43.1541 26.5052 42.7015 26.5052C42.3644 26.5052 42.0744 26.48 41.8183 26.4578C41.6158 26.4402 41.4346 26.4244 41.268 26.4244V22.0607H41.7207V23.8385ZM42.7769 26.0204C43.0787 26.0204 43.2296 25.9396 43.3805 25.8588C43.4559 25.7779 43.5314 25.5355 43.5314 25.0507C43.5314 24.7274 43.4559 24.5658 43.3805 24.4042C43.305 24.3234 43.0787 24.2426 42.7769 24.2426H41.7961V26.0204H42.7769Z" fill="#878787"/>
<path d="M48.2844 26.1012C47.8317 26.1012 47.5299 25.9396 47.3036 25.6971C47.1527 25.4547 47.0018 24.9699 47.0018 24.2426C47.0018 23.5153 47.0772 23.0304 47.3036 22.788C47.4545 22.5456 47.8317 22.384 48.2844 22.384C48.6616 22.384 48.9634 22.384 49.1897 22.4648L49.2651 22.0607C48.9634 21.8991 48.5861 21.8991 48.2089 21.8991C47.6054 21.8991 47.1527 22.0607 46.9264 22.384C46.7 22.7072 46.5491 23.3537 46.5491 24.1618C46.5491 24.9699 46.7 25.6163 46.9264 25.9396C47.1527 26.2628 47.6054 26.4244 48.2089 26.4244C48.5861 26.4244 48.9634 26.3436 49.3406 26.2628L49.2651 25.8588C49.0388 26.0204 48.737 26.1012 48.2844 26.1012Z" fill="#878787"/>
<path d="M51.5286 22.5456H50.246V22.0607H53.3393V22.5456H51.9813V26.4244H51.5286V22.5456Z" fill="#878787"/>
<path fill-rule="evenodd" clip-rule="evenodd" d="M56.3569 21.9799C55.8288 21.9799 55.3761 22.2224 54.9235 22.788L54.848 22.0607H54.4708V28.283H54.9235V26.0204C55.3761 26.3436 55.8288 26.5052 56.2815 26.5052C56.7341 26.5052 57.1114 26.3436 57.2623 26.0204C57.4886 25.6971 57.564 25.0507 57.564 24.2426C57.564 23.4345 57.4886 22.8688 57.2623 22.4648C57.1114 22.1416 56.8096 21.9799 56.3569 21.9799ZM56.885 25.6971C56.7341 25.9396 56.5078 26.1012 56.1306 26.1012C55.8288 26.1012 55.4516 26.0204 54.9235 25.7779V23.2729C55.0499 23.1713 55.163 23.0698 55.263 22.9801C55.4016 22.8558 55.5148 22.7542 55.6025 22.7072C55.6497 22.6904 55.6937 22.6735 55.7357 22.6574C55.8951 22.5962 56.0269 22.5456 56.206 22.5456C56.5078 22.5456 56.7341 22.7072 56.885 22.9496C57.0359 23.1921 57.1114 23.6769 57.1114 24.3234C57.1114 24.9699 57.0359 25.4547 56.885 25.6971Z" fill="#878787"/>
<path fill-rule="evenodd" clip-rule="evenodd" d="M59.2239 22.4648C59.4502 22.1416 59.8274 21.9799 60.431 21.9799C61.0345 21.9799 61.4117 22.1416 61.6381 22.4648C61.8644 22.788 62.0153 23.4345 62.0153 24.2426C62.0153 25.0507 61.8644 25.6971 61.6381 26.0204C61.4117 26.3436 61.0345 26.5052 60.431 26.5052C59.9029 26.5052 59.4502 26.3436 59.2239 26.0204C58.9975 25.6971 58.8466 25.0507 58.8466 24.2426C58.8466 23.4345 58.9221 22.788 59.2239 22.4648ZM60.431 26.1012C60.8836 26.1012 61.1854 25.9396 61.3363 25.6971C61.4872 25.4547 61.5626 24.9699 61.5626 24.2426C61.5626 23.5153 61.4872 23.0304 61.3363 22.788C61.11 22.5456 60.8836 22.384 60.431 22.384C59.9783 22.384 59.6765 22.5456 59.5256 22.788C59.3747 23.1113 59.2993 23.5153 59.2993 24.2426C59.2993 24.9699 59.3747 25.4547 59.5256 25.6971C59.6765 25.9396 59.9783 26.1012 60.431 26.1012Z" fill="#878787"/>
<path fill-rule="evenodd" clip-rule="evenodd" d="M68.6545 22.0607H67.2965C66.7683 22.0607 66.542 22.384 66.4666 23.0304C66.3911 24.2426 66.2402 25.2931 65.863 26.0204H65.4858V27.7982H65.7876L65.863 26.5052H68.8053L68.8808 27.7982H69.1826V26.0204H68.6545V22.0607ZM68.2018 26.0204H66.2402C66.542 25.2931 66.7683 24.3234 66.8438 23.1113C66.8438 22.7072 66.9947 22.5456 67.2965 22.5456H68.2018V26.0204Z" fill="#878787"/>
<path fill-rule="evenodd" clip-rule="evenodd" d="M70.6161 22.4648C70.8424 22.1416 71.2196 21.9799 71.8232 21.9799C72.4267 21.9799 72.8039 22.1416 73.0303 22.4648C73.2566 22.788 73.4075 23.4345 73.4075 24.2426C73.4075 25.0507 73.2566 25.6971 73.0303 26.0204C72.8039 26.3436 72.4267 26.5052 71.8232 26.5052C71.2951 26.5052 70.8424 26.3436 70.6161 26.0204C70.3897 25.6971 70.2388 25.0507 70.2388 24.2426C70.2388 23.4345 70.3897 22.788 70.6161 22.4648ZM71.8232 26.1012C72.2758 26.1012 72.5776 25.9396 72.7285 25.6971C72.8794 25.4547 72.9548 24.9699 72.9548 24.2426C72.9548 23.5153 72.8794 23.0304 72.7285 22.788C72.5022 22.5456 72.2758 22.384 71.8232 22.384C71.3705 22.384 71.0687 22.5456 70.9178 22.788C70.7669 23.1113 70.6915 23.5153 70.6915 24.2426C70.6915 24.9699 70.7669 25.4547 70.9178 25.6971C71.0687 25.9396 71.3705 26.1012 71.8232 26.1012Z" fill="#878787"/>
<path d="M76.3498 26.1012C75.8971 26.1012 75.5953 25.9396 75.369 25.6971C75.2181 25.4547 75.0672 24.9699 75.0672 24.2426C75.0672 23.5153 75.1427 23.0304 75.369 22.788C75.5199 22.5456 75.8971 22.384 76.3498 22.384C76.727 22.384 77.0288 22.384 77.2551 22.4648L77.3305 22.0607C77.0288 21.8991 76.6515 21.8991 76.2743 21.8991C75.6708 21.8991 75.2181 22.0607 74.9918 22.384C74.7654 22.788 74.69 23.4345 74.69 24.2426C74.69 25.0507 74.8409 25.6971 75.0672 26.0204C75.2935 26.3436 75.7462 26.5052 76.3498 26.5052C76.727 26.5052 77.1042 26.4244 77.4814 26.3436L77.406 25.9396C77.1042 26.0204 76.8024 26.1012 76.3498 26.1012Z" fill="#878787"/>
<path d="M79.5939 22.5456H78.3114V22.0607H81.4046V22.5456H80.0466V26.4244H79.5939V22.5456Z" fill="#878787"/>
<path fill-rule="evenodd" clip-rule="evenodd" d="M84.196 21.9799C83.8378 21.9799 83.4324 22.0305 82.9424 22.0917C82.8131 22.1078 82.678 22.1247 82.5363 22.1416L82.6117 22.5456C82.6884 22.5353 82.7638 22.5251 82.838 22.515C83.3482 22.4456 83.8009 22.384 84.196 22.384C84.4978 22.384 84.6487 22.4648 84.7996 22.6264C84.875 22.788 84.9505 22.9496 84.9505 23.2729V23.7577H83.3661C83.0644 23.7577 82.838 23.8385 82.6871 24.0002C82.5363 24.1618 82.4608 24.485 82.4608 24.8082V25.2931C82.4608 25.6971 82.5363 25.9396 82.7626 26.182C82.9135 26.4244 83.2152 26.5052 83.517 26.5052C83.8188 26.5052 84.1206 26.4244 84.3469 26.2628C84.6487 26.1012 84.875 25.8588 85.0259 25.6972L85.1014 26.5052H85.4786V23.3537C85.4786 22.8688 85.4031 22.5456 85.1768 22.3032C84.7996 22.0607 84.5733 21.9799 84.196 21.9799ZM84.7996 25.2931C84.5733 25.5355 84.3469 25.6971 84.1206 25.8588C83.8943 26.0204 83.5925 26.0204 83.4416 26.0204C83.0644 26.0204 82.838 25.7779 82.838 25.2931V24.8891C82.838 24.485 82.9889 24.2426 83.3661 24.2426H84.875V25.2931H84.7996Z" fill="#878787"/>
<path fill-rule="evenodd" clip-rule="evenodd" d="M89.4772 23.9193C89.3263 24.081 89.1754 24.1618 88.8736 24.2426C89.2509 24.2426 89.4017 24.3234 89.5526 24.6466C89.7035 24.8082 89.779 25.1315 89.779 25.4547C89.779 25.8588 89.7035 26.182 89.4772 26.3436C89.3263 26.5052 88.9491 26.586 88.421 26.586C88.0319 26.586 87.6924 26.5595 87.4025 26.5369C87.1863 26.52 86.9977 26.5052 86.8366 26.5052V22.1416C87.1384 22.0607 87.5911 22.0607 88.1946 22.0607C88.7227 22.0607 89.1 22.1416 89.3263 22.3032C89.5526 22.4648 89.6281 22.7072 89.6281 23.1921C89.6281 23.5153 89.6281 23.7577 89.4772 23.9193ZM88.1946 22.4648H87.2893V23.9193H88.2701C88.6473 23.9193 88.8736 23.8385 89.0245 23.7577C89.1754 23.6769 89.2509 23.5153 89.2509 23.1921C89.2509 22.9496 89.1754 22.7072 89.0245 22.6264C88.8736 22.5456 88.5719 22.4648 88.1946 22.4648ZM88.3455 26.0204C88.7227 26.0204 88.9491 25.9396 89.1 25.8588C89.2509 25.7779 89.3263 25.6163 89.3263 25.2123C89.3263 24.8891 89.2509 24.7274 89.1 24.5658C88.9491 24.485 88.6473 24.4042 88.2701 24.4042H87.2893V26.0204H88.3455Z" fill="#878787"/>
<path d="M91.8914 22.3032C91.7405 22.4648 91.665 22.7072 91.665 23.0304V23.9193C91.665 24.081 91.665 24.2426 91.5896 24.3234C91.5896 24.4042 91.5896 24.5658 91.5142 24.6466C91.5142 24.7413 91.4883 24.8082 91.4668 24.8637C91.4516 24.9029 91.4387 24.9364 91.4387 24.9699C91.4387 25.0103 91.4198 25.0709 91.401 25.1315C91.3821 25.1921 91.3633 25.2527 91.3633 25.2931C91.2878 25.4547 91.2124 25.6163 91.1369 25.6971C91.0615 25.7779 90.9106 25.8588 90.7597 25.9396L90.8352 26.4244C91.2878 26.3436 91.665 26.0204 91.8159 25.4547C91.8159 25.4143 91.8348 25.3739 91.8537 25.3335C91.8725 25.2931 91.8914 25.2527 91.8914 25.2123C91.8914 25.1719 91.9102 25.1315 91.9291 25.0911C91.948 25.0507 91.9668 25.0103 91.9668 24.9699C91.9668 24.8891 91.9668 24.8082 92.0423 24.6466C92.0423 24.485 92.0423 24.4042 92.1177 24.3234C92.1177 24.2426 92.1177 24.1618 92.1931 24.0002V23.0304C92.1931 22.8386 92.2404 22.748 92.2975 22.6384C92.3125 22.6095 92.3283 22.5793 92.344 22.5456C92.4195 22.4648 92.4949 22.384 92.6458 22.384H93.5512V26.3436H94.0038V21.9799H92.5704C92.2686 22.0607 92.0423 22.1416 91.8914 22.3032Z" fill="#878787"/>
<path fill-rule="evenodd" clip-rule="evenodd" d="M95.4373 23.3537C95.4373 22.9496 95.5127 22.6264 95.739 22.384C95.8899 22.1416 96.1917 21.9799 96.6444 22.1416C97.3234 22.1416 97.7761 22.1416 98.1533 22.2224V26.586H97.7006V24.8891H96.7198C96.3426 24.8891 96.1163 25.0507 96.0408 25.3739L95.739 26.5052H95.2864L95.5882 25.2123C95.6636 24.8891 95.8899 24.7274 96.2672 24.6466C95.739 24.5658 95.4373 24.1618 95.4373 23.3537ZM97.7006 24.4042V22.5456C97.5497 22.4648 97.1725 22.4648 96.6444 22.5456C96.3426 22.5456 96.1917 22.6264 96.0408 22.788C95.9654 22.9496 95.8899 23.1113 95.8899 23.4345C95.8899 23.7577 95.8899 24.0002 96.0408 24.1618C96.1917 24.3234 96.418 24.4042 96.7198 24.4042H97.7006Z" fill="#878787"/>
<path fill-rule="evenodd" clip-rule="evenodd" d="M102.604 23.3537C102.604 22.8688 102.454 22.5456 102.227 22.3032C102.001 22.0607 101.624 21.9799 101.096 21.9799C100.567 21.9799 100.115 22.1416 99.8884 22.4648C99.6621 22.788 99.5112 23.4345 99.5112 24.2426C99.5112 25.0507 99.6621 25.6971 99.8884 26.0204C100.115 26.3436 100.567 26.586 101.171 26.586C101.775 26.586 102.227 26.5052 102.454 26.3436L102.378 25.9396C101.925 26.0204 101.548 26.0204 101.171 26.0204C100.794 26.0204 100.492 25.9396 100.266 25.6971C100.115 25.4547 99.9638 25.0507 99.9638 24.485H101.699C102.378 24.5658 102.604 24.1618 102.604 23.3537ZM100.039 24.081C100.039 23.4345 100.115 23.0304 100.266 22.788C100.416 22.5456 100.718 22.4648 101.096 22.4648C101.397 22.4648 101.699 22.5456 101.85 22.7072C102.001 22.8688 102.076 23.0304 102.076 23.3537C102.076 23.8385 101.925 24.081 101.624 24.081H100.039Z" fill="#878787"/>
<path d="M107.282 22.0607H107.81C107.864 22.0607 107.917 22.1011 108.024 22.1819C108.068 22.2154 108.121 22.2558 108.187 22.3032L108.338 26.5052H107.886L107.735 22.5456H107.584L106.528 25.8588C106.528 25.9396 106.452 26.0204 106.377 26.0204H106C105.849 26.0204 105.849 26.0204 105.773 25.8588L104.717 22.5456H104.566L104.415 26.5052H103.963L104.113 22.3032C104.113 22.1416 104.113 22.0607 104.264 22.0607H104.792C104.868 22.0607 104.868 22.0607 104.943 22.2224L105.773 24.9699C105.811 25.091 105.83 25.192 105.849 25.293C105.867 25.394 105.886 25.4952 105.924 25.6163H106.075C106.104 25.4929 106.133 25.3812 106.157 25.2858C106.197 25.1315 106.226 25.0198 106.226 24.9699L107.056 22.2224C107.131 22.1416 107.207 22.0607 107.282 22.0607Z" fill="#878787"/>
<path fill-rule="evenodd" clip-rule="evenodd" d="M114.298 24.2426C114.6 24.1618 114.751 24.081 114.902 23.9193C115.053 23.7577 115.053 23.5153 115.053 23.1921C115.053 22.7072 114.977 22.4648 114.751 22.3032C114.525 22.1416 114.148 22.0607 113.619 22.0607C113.016 22.0607 112.563 22.0607 112.261 22.1416V26.5052C112.422 26.5052 112.611 26.52 112.827 26.5369C113.117 26.5595 113.457 26.586 113.846 26.586C114.374 26.586 114.751 26.5052 114.902 26.3436C115.128 26.182 115.204 25.8588 115.204 25.4547C115.204 25.1315 115.128 24.8082 114.977 24.6466C114.902 24.3234 114.676 24.2426 114.298 24.2426ZM112.714 22.4648H113.619C113.997 22.4648 114.298 22.5456 114.449 22.6264C114.6 22.7072 114.676 22.9496 114.676 23.1921C114.676 23.5153 114.6 23.6769 114.449 23.7577C114.298 23.8385 114.072 23.9193 113.695 23.9193H112.714V22.4648ZM114.525 25.8588C114.374 25.9396 114.148 26.0204 113.77 26.0204H112.714V24.4042H113.695C114.072 24.4042 114.374 24.485 114.525 24.5658C114.676 24.7274 114.751 24.8891 114.751 25.2123C114.751 25.6163 114.676 25.7779 114.525 25.8588Z" fill="#878787"/>
<path d="M119.051 25.1315C119.051 25.2123 119.127 25.3739 119.202 25.5355C119.278 25.6971 119.353 25.8588 119.278 25.8588C119.278 25.9087 119.307 25.9895 119.346 26.1012C119.371 26.1702 119.4 26.251 119.429 26.3436H118.976C118.832 25.8825 118.689 25.5189 118.584 25.2527C118.523 25.0991 118.475 24.9778 118.448 24.8891C118.221 24.5658 117.995 24.3234 117.618 24.3234H117.014V26.4244H116.562V22.0607H117.014V23.9193H117.618C117.769 23.9193 117.844 23.9193 117.995 23.8385C118.146 23.7577 118.221 23.6769 118.297 23.5961C118.372 23.5153 118.448 23.3537 118.523 23.1921L118.75 22.7072C118.825 22.5456 118.9 22.3032 118.976 22.0607H119.429C119.397 22.1622 119.379 22.2637 119.362 22.3533C119.34 22.4778 119.322 22.5794 119.278 22.6264C119.278 22.788 119.202 22.9496 119.127 23.1112C119.051 23.2728 118.976 23.4345 118.9 23.5153C118.863 23.5557 118.825 23.6163 118.787 23.6769C118.75 23.7375 118.712 23.7981 118.674 23.8385C118.636 23.8789 118.58 23.9193 118.523 23.9597C118.467 24.0002 118.41 24.0406 118.372 24.081C118.341 24.081 118.31 24.0948 118.273 24.1111C118.221 24.134 118.159 24.1618 118.071 24.1618C118.159 24.1618 118.221 24.1895 118.273 24.2125C118.31 24.2287 118.341 24.2426 118.372 24.2426C118.41 24.283 118.448 24.3032 118.486 24.3234C118.523 24.3436 118.561 24.3638 118.599 24.4042C118.599 24.4541 118.628 24.4732 118.667 24.4996C118.692 24.5159 118.721 24.5349 118.75 24.5658C118.75 24.5658 118.825 24.6466 118.9 24.8082C118.929 24.87 118.958 24.9199 118.983 24.9626C119.023 25.0316 119.051 25.0815 119.051 25.1315Z" fill="#878787"/>
<path d="M122.069 25.9396H121.994C121.956 25.8588 121.937 25.778 121.918 25.6972C121.899 25.6164 121.881 25.5355 121.843 25.4547L120.787 22.0607H120.334L121.692 26.2628C121.692 26.3436 121.767 26.4244 121.843 26.4244H121.994L121.918 26.6668C121.767 27.1517 121.616 27.4749 121.39 27.6366C121.164 27.7982 120.937 27.879 120.56 27.879L120.485 28.283C120.937 28.3638 121.39 28.283 121.692 28.0406C121.918 27.7982 122.145 27.3941 122.371 26.7477L123.804 22.0607H123.352L122.22 25.4547L122.069 25.9396Z" fill="#878787"/>
<path d="M125.389 25.6971C125.615 25.9396 125.917 26.1012 126.369 26.1012C126.822 26.1012 127.124 26.0204 127.35 25.8588L127.426 26.2628C127.048 26.3436 126.671 26.4244 126.294 26.4244C125.69 26.4244 125.238 26.2628 125.011 25.9396C124.785 25.6163 124.634 24.9699 124.634 24.1618C124.634 23.3537 124.785 22.7072 125.011 22.384C125.238 22.0607 125.69 21.8991 126.294 21.8991C126.671 21.8991 127.048 21.8991 127.35 22.0607L127.275 22.4648C127.048 22.384 126.747 22.384 126.369 22.384C125.917 22.384 125.54 22.5456 125.389 22.788C125.162 23.0304 125.087 23.5153 125.087 24.2426C125.087 24.9699 125.238 25.4547 125.389 25.6971Z" fill="#878787"/>
<path d="M131.198 23.9193H129.161V22.0607H128.708V26.4244H129.161V24.3234H131.198V26.4244H131.651V22.0607H131.198V23.9193Z" fill="#878787"/>
<path d="M134.442 25.9396H134.518L135.725 22.0607H136.177L134.744 26.7477C134.518 27.3941 134.291 27.7982 134.065 28.0406C133.763 28.283 133.31 28.3638 132.858 28.283L132.933 27.879C133.31 27.879 133.537 27.7982 133.763 27.6366C133.989 27.4749 134.14 27.1517 134.291 26.6668L134.442 26.4244H134.291C134.216 26.4244 134.14 26.3436 134.14 26.2628L132.782 22.0607H133.235L134.291 25.4547C134.329 25.5355 134.348 25.6163 134.367 25.6971C134.385 25.7779 134.404 25.8588 134.442 25.9396Z" fill="#878787"/>
<path fill-rule="evenodd" clip-rule="evenodd" d="M140.327 21.9799C139.799 21.9799 139.421 22.1416 139.195 22.384C138.969 22.7072 138.818 23.1921 138.818 24.0002H137.837V22.1416H137.384V26.5052H137.837V24.485H138.818C138.818 25.2931 138.969 25.8588 139.195 26.182C139.421 26.5052 139.799 26.6668 140.402 26.6668C141.006 26.6668 141.458 26.5052 141.685 26.182C141.911 25.8588 142.062 25.2931 142.062 24.4042C142.062 23.5153 141.911 22.9496 141.685 22.6264C141.383 22.1416 140.93 21.9799 140.327 21.9799ZM141.232 25.6163C141.081 25.8588 140.779 26.0204 140.327 26.0204C139.95 26.0204 139.648 25.8588 139.497 25.6163C139.346 25.3739 139.271 24.8891 139.271 24.2426C139.271 23.5961 139.346 23.1113 139.497 22.8688C139.648 22.6264 139.95 22.4648 140.327 22.4648C140.779 22.4648 141.081 22.6264 141.232 22.8688C141.383 23.1113 141.458 23.5961 141.458 24.2426C141.458 24.8891 141.383 25.3739 141.232 25.6163Z" fill="#878787"/>
<path fill-rule="evenodd" clip-rule="evenodd" d="M147.796 22.3032C148.022 22.5456 148.173 22.8688 148.173 23.3537C148.173 24.1618 147.871 24.5658 147.268 24.485H145.532C145.532 25.0507 145.683 25.4547 145.834 25.6971C146.061 25.9396 146.362 26.0204 146.74 26.0204C147.117 26.0204 147.494 26.0204 147.947 25.9396L148.022 26.3436C147.796 26.5052 147.343 26.586 146.74 26.586C146.136 26.586 145.683 26.3436 145.457 26.0204C145.231 25.6971 145.08 25.0507 145.08 24.2426C145.08 23.4345 145.231 22.788 145.457 22.4648C145.683 22.1416 146.136 21.9799 146.664 21.9799C147.192 21.9799 147.569 22.0607 147.796 22.3032ZM145.834 22.788C145.683 23.0304 145.608 23.4345 145.608 24.081H147.192C147.494 24.081 147.645 23.8385 147.645 23.3537C147.645 23.0304 147.569 22.8688 147.419 22.7072C147.268 22.5456 146.966 22.4648 146.664 22.4648C146.287 22.4648 145.985 22.5456 145.834 22.788Z" fill="#878787"/>
<path fill-rule="evenodd" clip-rule="evenodd" d="M150.889 22.0607C150.361 22.0607 150.135 22.384 150.059 23.0304C149.984 24.2426 149.833 25.2931 149.456 26.0204H149.078V27.7982H149.38L149.456 26.5052H152.398L152.473 27.7982H152.775V26.0204H152.322V22.0607H150.889ZM149.908 26.0204C150.21 25.2931 150.436 24.3234 150.512 23.1113C150.512 22.7072 150.663 22.5456 150.964 22.5456H151.87V26.0204H149.908Z" fill="#878787"/>
<path d="M155.189 25.9396H155.265L156.472 22.0607H157L155.567 26.7477C155.34 27.3941 155.114 27.7982 154.888 28.0406C154.586 28.283 154.133 28.3638 153.68 28.283L153.756 27.879C154.133 27.879 154.359 27.7982 154.586 27.6366C154.812 27.4749 154.963 27.1517 155.114 26.6668L155.189 26.4244H155.038C154.963 26.4244 154.888 26.3436 154.888 26.2628L153.53 22.0607H153.982L155.038 25.4547C155.076 25.5355 155.095 25.6163 155.114 25.6971C155.133 25.7779 155.152 25.8588 155.189 25.9396Z" fill="#878787"/>
<path d="M100.492 16.1618V0H90.2317V16.1618H93.0986V2.58588H97.6252V16.1618H100.492Z" fill="#F17E00"/>
<path fill-rule="evenodd" clip-rule="evenodd" d="M103.585 1.69699C104.34 0.565662 105.773 0 107.81 0C109.847 0 111.281 0.565662 112.035 1.69699C112.865 2.82831 113.242 4.92934 113.242 8.08088C113.242 11.1516 112.865 13.2526 112.035 14.4648C111.205 15.5961 109.847 16.1618 107.81 16.1618C105.773 16.1618 104.34 15.5961 103.585 14.4648C102.831 13.3335 102.378 11.2324 102.378 8.08088C102.454 5.01015 102.831 2.90912 103.585 1.69699ZM109.772 3.87882C109.394 3.15154 108.791 2.7475 107.81 2.7475C106.829 2.7475 106.226 3.15154 105.849 3.87882C105.471 4.6061 105.32 5.97985 105.32 8.08088C105.32 10.1819 105.471 11.5557 105.849 12.2829C106.226 13.0102 106.829 13.4143 107.81 13.4143C108.791 13.4143 109.394 13.0102 109.772 12.2829C110.149 11.5557 110.3 10.1819 110.3 8.08088C110.3 5.97985 110.149 4.6061 109.772 3.87882Z" fill="#F17E00"/>
<path d="M123.804 15.9193L123.729 13.3335V13.2526H118.75C118.448 13.2526 118.222 13.1718 118.071 13.0102C117.92 12.8486 117.844 12.5254 117.844 12.1213V8.96978H122.975V6.3839H117.844V3.95963C117.844 3.55559 117.92 3.23235 118.071 3.07073C118.222 2.90912 118.448 2.82831 118.75 2.82831H123.729L123.804 0.242426C122.673 0.0808088 120.636 0 117.844 0C117.014 0 116.335 0.323235 115.807 0.888897C115.279 1.45456 115.053 2.26265 115.053 3.23235V12.9294C115.053 13.8991 115.279 14.7072 115.807 15.2729C116.335 15.8385 117.014 16.1618 117.844 16.1618C120.636 16.1618 122.673 16.081 123.804 15.9193Z" fill="#F17E00"/>
<path d="M141.987 2.90912H145.834V0H135.272V2.90912H139.12V16.1618H141.987V2.90912Z" fill="#F17E00"/>
<path fill-rule="evenodd" clip-rule="evenodd" d="M152.247 5.89904H150.21V0H147.419V15.9193H147.494C148.701 16.0001 150.361 16.081 152.624 16.081C154.133 16.081 155.265 15.7577 155.868 15.0304C156.547 14.3032 156.849 13.0102 156.849 11.0708C156.849 9.1314 156.547 7.75765 155.868 7.03037C155.189 6.30309 153.982 5.89904 152.247 5.89904ZM152.247 13.4143H150.361V8.40412H152.247C153.002 8.40412 153.53 8.64654 153.756 8.96978C153.982 9.29301 154.133 10.0203 154.133 10.99C154.133 11.9597 153.982 12.6062 153.756 12.9294C153.454 13.2526 153.002 13.4143 152.247 13.4143Z" fill="#F17E00"/>
<path d="M134.291 13.0102L134.518 15.5961C133.386 16.0001 132.103 16.2426 130.444 16.2426C128.482 16.2426 127.124 15.6769 126.294 14.4648C125.464 13.2526 125.087 11.1516 125.087 8.16169C125.087 5.17176 125.464 3.07074 126.294 1.8586C127.124 0.646471 128.482 0.0808091 130.444 0.0808091C131.877 0.0808091 133.16 0.242427 134.216 0.565662L133.989 3.15154C133.009 3.07074 131.802 3.07074 130.444 3.07074C129.538 3.07074 128.935 3.39397 128.557 4.12125C128.256 4.84853 128.029 6.14147 128.029 8.16169C128.029 10.1011 128.18 11.4749 128.557 12.2021C128.859 12.9294 129.538 13.2526 130.444 13.2526C132.179 13.1718 133.461 13.091 134.291 13.0102Z" fill="#F17E00"/>
<path d="M44.6631 7.83846L47.9827 16.1618H45.0403L42.3998 9.05059L39.6838 16.1618H36.8169L40.1364 7.83846L37.0432 0H39.9855L42.3998 6.62632L44.814 0H47.7563L44.6631 7.83846Z" fill="#50CE1B"/>
<path fill-rule="evenodd" clip-rule="evenodd" d="M54.0183 0C51.9813 0 50.5478 0.565662 49.7934 1.69699C48.9635 2.90912 48.5863 5.01015 48.5863 8.08088C48.5863 11.2324 49.039 13.3335 49.7934 14.4648C50.5478 15.5961 51.9813 16.1618 54.0183 16.1618C56.0553 16.1618 57.4133 15.5961 58.2432 14.4648C59.0731 13.2526 59.4503 11.1516 59.4503 8.08088C59.4503 4.92934 59.0731 2.82831 58.2432 1.69699C57.4887 0.565662 56.0553 0 54.0183 0ZM54.0183 2.7475C54.9991 2.7475 55.6026 3.15154 55.9799 3.87882C56.2816 4.6061 56.508 5.97985 56.508 8.08088C56.508 10.1819 56.3571 11.5557 55.9799 12.2829C55.6026 13.0102 54.9991 13.4143 54.0183 13.4143C53.0375 13.4143 52.434 13.0102 52.0567 12.2829C51.6795 11.5557 51.5286 10.1819 51.5286 8.08088C51.5286 5.97985 51.6795 4.6061 52.0567 3.87882C52.434 3.15154 53.0375 2.7475 54.0183 2.7475Z" fill="#50CE1B"/>
<path d="M68.1264 16.1618H70.9179V0H68.1264V6.94956C67.1457 7.43441 66.2403 7.67684 65.2595 7.67684C64.7314 7.67684 64.3542 7.51522 64.1279 7.27279C63.9015 7.03037 63.8261 6.62632 63.8261 5.97985V0H61.0346V6.70713C61.0346 8.08088 61.261 9.05059 61.7891 9.69706C62.3172 10.3435 63.0716 10.6668 64.2033 10.6668C65.4859 10.6668 66.693 10.5051 68.1264 9.93948V16.1618Z" fill="#50CE1B"/>
<path d="M79.8957 0L77.7832 7.27279L75.8217 0H72.4267L76.2743 12.5254L75.2181 16.1618H78.085L83.2907 0H79.8957Z" fill="#50CE1B"/>
<path d="M0 29.7377C2.56511 26.1013 5.05479 22.4649 7.6199 18.8285L4.30034 20.0407C2.86689 23.273 1.43345 26.5054 0 29.7377Z" fill="#F17E00"/>
<path d="M7.77086 28.6872C8.52531 25.8589 9.3552 22.5457 10.1096 19.7174L7.6199 18.8285C7.69534 21.9801 7.69542 25.5357 7.77086 28.6872Z" fill="#F17E00"/>
<path d="M13.8063 6.94963C12.4483 7.03044 11.2412 7.19206 10.1095 7.43448L11.3921 10.4244C13.4291 9.29309 15.4661 8.08096 17.5031 6.94963C16.4468 6.86882 15.1643 6.86882 13.8063 6.94963Z" fill="#F17E00"/>
<path d="M3.69678 12.283C2.18789 14.3032 1.28256 16.3235 0.754445 17.778C2.41423 16.4043 4.14945 15.1113 5.80923 13.7376L6.86545 8.96985C5.96012 9.69713 4.82845 10.8285 3.69678 12.283Z" fill="#F17E00"/>
<path d="M29.2726 3.39404C29.1971 3.39404 29.1217 3.39404 29.0462 3.39404C28.2163 3.39404 27.2356 3.47485 26.1793 3.63647C24.7459 3.8789 23.4633 4.20213 22.3317 4.52537C21.8035 4.8486 21.3509 5.25265 20.8228 5.57588C22.0299 5.09103 23.4633 4.68698 25.1231 4.36375C27.0092 3.9597 28.7444 3.9597 30.1025 3.9597C30.1025 3.79809 30.1779 3.55566 30.1779 3.39404C29.8761 3.39404 29.5743 3.39404 29.2726 3.39404Z" fill="#F17E00"/>
<path d="M1.13167 32.3235C0.754445 31.5962 0.377223 30.869 0 30.1417C10.0341 28.9296 20.1437 27.6366 30.1778 26.5053C20.5209 28.4447 10.7886 30.3841 1.13167 32.3235Z" fill="#50CE1B"/>
<path d="M10.5622 6.14147C10.7885 5.65662 11.0903 5.33338 11.3166 5.17176C11.6184 5.33338 11.9202 5.57581 12.222 5.73743C12.0711 5.33338 11.9956 4.84853 11.8448 4.28287C11.7693 3.79801 11.6939 3.31316 11.6939 2.90912C11.8448 2.50507 12.0711 2.02022 12.4483 1.45456C12.901 0.808088 13.4291 0.323235 13.8063 0.0808088C13.2028 0 12.2974 -0.0808088 11.2412 0.161618C10.3359 0.323235 9.58142 0.727279 9.05331 0.969706C8.5252 1.69699 7.8462 2.82831 7.31808 4.44449C6.71453 6.3839 6.78997 8.00007 6.86542 8.96978L5.88464 13.7375C5.35653 15.8385 4.82841 17.9396 4.3003 20.0406L7.61986 18.8285L10.1095 19.7174C10.6376 16.8082 10.864 13.2526 11.3921 10.4243L10.1095 7.43441C10.185 7.11118 10.3359 6.62632 10.5622 6.14147Z" fill="#50CE1B"/>
<path d="M26.1793 3.6364C27.2356 3.47478 28.2163 3.39397 29.0462 3.39397C28.9708 2.98993 28.669 1.8586 27.7637 1.21213C27.311 0.888897 26.7074 0.727279 26.1793 0.727279C26.1793 0.484853 26.0284 0.242427 25.8021 0.0808089C25.5003 -0.0808087 24.9722 1.44497e-07 24.7459 0.404044C24.595 0.565662 24.5196 0.888897 24.595 1.05051C24.1423 1.29294 23.6897 1.61618 23.3124 2.02022C22.4825 2.98993 22.4071 4.12125 22.3317 4.6061C23.4633 4.20206 24.7459 3.87882 26.1793 3.6364ZM24.9722 0.565662C25.1231 0.404044 25.3494 0.323235 25.5758 0.404044C25.7267 0.484853 25.8021 0.565662 25.8021 0.727279C25.5003 0.727279 25.1986 0.808088 24.8968 0.888897C24.8968 0.808088 24.8968 0.646471 24.9722 0.565662Z" fill="#50CE1B"/>
<path d="M17.805 6.3839C18.0313 6.14147 18.3331 5.89904 18.7858 5.65662C19.2384 5.41419 19.6911 5.33338 19.9929 5.33338C19.9798 5.33338 19.9486 5.32125 19.9025 5.3033C19.6822 5.21764 19.1208 4.99934 18.5594 5.33338C18.0313 5.73743 17.805 6.30309 17.805 6.3839Z" fill="#50CE1B"/>
<path d="M18.1391 6.74177C18.4261 6.67145 18.7945 6.5812 19.163 6.3839C19.6156 6.22228 19.9174 5.97985 20.1437 5.73742C19.842 5.73742 19.4647 5.81823 18.9366 6.06066C18.5594 6.30308 18.1822 6.54552 17.9558 6.78794C18.012 6.7729 18.0734 6.75786 18.1391 6.74177Z" fill="#50CE1B"/>
<path d="M19.3893 6.78794C19.842 6.54551 20.2192 6.30309 20.3701 6.06066C20.3701 6.14147 20.1438 6.86875 19.4648 7.11118C18.8612 7.43441 18.2577 7.19199 18.1822 7.11118C18.4085 7.11118 18.8612 7.03037 19.3893 6.78794Z" fill="#50CE1B"/>
</g>
<defs>
<clipPath id="clip0_111_638">
<rect width="157" height="32.3235" fill="white"/>
</clipPath>
</defs>
</svg>
