<svg width="162" height="48" viewBox="0 0 162 48" fill="none" xmlns="http://www.w3.org/2000/svg">
<path d="M43.2654 9.10345C44.2985 9.10345 45.2191 9.32069 46.027 9.75515C46.8482 10.1896 47.4906 10.803 47.9542 11.5952C48.4178 12.3875 48.6495 13.3011 48.6495 14.3362C48.6495 15.3712 48.4178 16.2913 47.9542 17.0963C47.4906 17.8886 46.8482 18.5019 46.027 18.9364C45.2191 19.3709 44.2985 19.5881 43.2654 19.5881C41.835 19.5881 40.7025 19.1281 39.8681 18.208V23.1724H37.3846V9.21846H39.7489V10.5602C40.1595 10.0746 40.6628 9.71043 41.2588 9.46764C41.8681 9.22485 42.5369 9.10345 43.2654 9.10345ZM42.9873 17.5372C43.9012 17.5372 44.6495 17.2433 45.2323 16.6555C45.8283 16.0677 46.1264 15.2946 46.1264 14.3362C46.1264 13.3778 45.8283 12.6047 45.2323 12.0169C44.6495 11.4291 43.9012 11.1352 42.9873 11.1352C42.3913 11.1352 41.8548 11.2694 41.378 11.5377C40.9012 11.7933 40.5237 12.1639 40.2455 12.6494C39.9674 13.135 39.8283 13.6973 39.8283 14.3362C39.8283 14.9751 39.9674 15.5374 40.2455 16.0229C40.5237 16.5085 40.9012 16.8855 41.378 17.1538C41.8548 17.4094 42.3913 17.5372 42.9873 17.5372Z" fill="white"/>
<path d="M51.1212 9.21846H53.6047V15.9654L59.4656 9.21846H61.7305V19.4539H59.2471V12.7069L53.406 19.4539H51.1212V9.21846Z" fill="white"/>
<path d="M76.3957 17.4222V21.7349H74.0712V19.4539H65.8858V21.7349H63.5811V17.4222H64.0778C64.7533 17.3966 65.2103 16.9813 65.4487 16.1763C65.7004 15.3585 65.8659 14.2084 65.9454 12.7261L66.0845 9.21846H74.8262V17.4222H76.3957ZM68.2103 12.8986C68.1573 14.0742 68.058 15.0326 67.9123 15.7738C67.7666 16.5149 67.5017 17.0644 67.1176 17.4222H72.3428V11.2502H68.2699L68.2103 12.8986Z" fill="white"/>
<path d="M78.6138 9.21846H81.0972V15.9654L86.9582 9.21846H89.2231V19.4539H86.7396V12.7069L80.8986 19.4539H78.6138V9.21846Z" fill="white"/>
<path d="M101.564 9.21846V19.4539H99.0804V15.4862C98.0605 15.959 96.9943 16.1954 95.8817 16.1954C94.5174 16.1954 93.4711 15.8951 92.7426 15.2946C92.0141 14.6812 91.6499 13.7484 91.6499 12.4961V9.21846H94.1333V12.3428C94.1333 12.9945 94.332 13.48 94.7294 13.7995C95.1267 14.119 95.6896 14.2787 96.4181 14.2787C97.3453 14.2787 98.2327 14.087 99.0804 13.7037V9.21846H101.564Z" fill="white"/>
<path d="M114.837 14.3937C114.837 14.5598 114.824 14.7962 114.798 15.1029H106.473C106.619 15.8568 106.996 16.4574 107.605 16.9046C108.228 17.3391 108.996 17.5563 109.91 17.5563C111.076 17.5563 112.036 17.1858 112.791 16.4446L114.122 17.9205C113.645 18.47 113.043 18.8853 112.314 19.1664C111.586 19.4475 110.764 19.5881 109.85 19.5881C108.685 19.5881 107.658 19.3645 106.771 18.9172C105.884 18.47 105.195 17.8502 104.705 17.058C104.228 16.2529 103.99 15.3457 103.99 14.3362C103.99 13.3395 104.221 12.445 104.685 11.6527C105.162 10.8477 105.817 10.2216 106.652 9.77432C107.486 9.32708 108.427 9.10345 109.473 9.10345C110.506 9.10345 111.427 9.32708 112.235 9.77432C113.056 10.2088 113.692 10.8285 114.142 11.6336C114.605 12.4258 114.837 13.3459 114.837 14.3937ZM109.473 11.0202C108.678 11.0202 108.003 11.2502 107.446 11.7102C106.903 12.1575 106.572 12.7581 106.453 13.512H112.473C112.367 12.7708 112.043 12.1703 111.499 11.7102C110.956 11.2502 110.281 11.0202 109.473 11.0202Z" fill="white"/>
<path d="M122.381 19.5881C121.282 19.5881 120.295 19.3645 119.421 18.9172C118.547 18.47 117.865 17.8502 117.375 17.058C116.885 16.2529 116.64 15.3457 116.64 14.3362C116.64 13.3267 116.885 12.4258 117.375 11.6336C117.865 10.8413 118.54 10.2216 119.401 9.77432C120.275 9.32708 121.269 9.10345 122.381 9.10345C123.428 9.10345 124.342 9.30791 125.123 9.71682C125.918 10.1257 126.514 10.7135 126.911 11.4802L125.004 12.5536C124.699 12.0808 124.315 11.7294 123.852 11.4994C123.401 11.2566 122.905 11.1352 122.361 11.1352C121.434 11.1352 120.666 11.4291 120.057 12.0169C119.448 12.5919 119.143 13.365 119.143 14.3362C119.143 15.3073 119.441 16.0868 120.037 16.6746C120.646 17.2497 121.421 17.5372 122.361 17.5372C122.905 17.5372 123.401 17.4222 123.852 17.1922C124.315 16.9494 124.699 16.5916 125.004 16.1188L126.911 17.1922C126.501 17.9589 125.898 18.553 125.103 18.9747C124.322 19.3836 123.414 19.5881 122.381 19.5881Z" fill="white"/>
<path d="M133.508 15.3521H131.581V19.4539H129.098V9.21846H131.581V13.3586H133.568L136.707 9.21846H139.369L135.515 14.1445L139.628 19.4539H136.707L133.508 15.3521Z" fill="white"/>
<path d="M145.139 9.10345C146.702 9.10345 147.894 9.46764 148.715 10.196C149.549 10.9116 149.967 11.9978 149.967 13.4545V19.4539H147.622V18.208C147.318 18.6553 146.88 19.0003 146.311 19.2431C145.755 19.4731 145.079 19.5881 144.284 19.5881C143.49 19.5881 142.794 19.4603 142.198 19.2047C141.602 18.9364 141.139 18.5722 140.808 18.1122C140.49 17.6394 140.331 17.1091 140.331 16.5213C140.331 15.6012 140.682 14.8665 141.384 14.317C142.099 13.7548 143.218 13.4737 144.741 13.4737H147.483V13.3203C147.483 12.6047 147.258 12.0553 146.808 11.6719C146.371 11.2886 145.715 11.0969 144.841 11.0969C144.245 11.0969 143.655 11.1863 143.073 11.3652C142.503 11.5441 142.02 11.7933 141.622 12.1128L140.649 10.3685C141.205 9.9596 141.874 9.64653 142.655 9.4293C143.437 9.21207 144.265 9.10345 145.139 9.10345ZM144.801 17.8438C145.424 17.8438 145.973 17.7097 146.45 17.4413C146.94 17.1602 147.284 16.7641 147.483 16.2529V15.0646H144.92C143.49 15.0646 142.775 15.5182 142.775 16.4254C142.775 16.8599 142.953 17.2049 143.311 17.4605C143.669 17.7161 144.165 17.8438 144.801 17.8438Z" fill="white"/>
<path d="M162 9.21846V19.4539H159.775V16.3679H156.973L154.808 19.4539H152.146L154.649 16.0421C153.881 15.7865 153.291 15.3968 152.881 14.8729C152.483 14.3362 152.285 13.6781 152.285 12.8986C152.285 11.723 152.715 10.8158 153.576 10.1768C154.437 9.53792 155.622 9.21846 157.132 9.21846H162ZM157.212 11.2311C155.609 11.2311 154.808 11.8125 154.808 12.9753C154.808 14.1253 155.583 14.7004 157.132 14.7004H159.775V11.2311H157.212Z" fill="white"/>
<path d="M51.7618 37.0326H49.8358V41.2416H47.3539V30.7387H49.8358V34.9871H51.8214L54.9586 30.7387H57.6193L53.7673 35.7935L57.8774 41.2416H54.9586L51.7618 37.0326Z" fill="white"/>
<path d="M64.0046 41.3793C62.9324 41.3793 61.9661 41.1499 61.1057 40.6909C60.2453 40.232 59.5702 39.596 59.0804 38.7831C58.6039 37.957 58.3656 37.026 58.3656 35.9902C58.3656 34.9543 58.6039 34.0299 59.0804 33.2169C59.5702 32.404 60.2453 31.768 61.1057 31.3091C61.9661 30.8502 62.9324 30.6207 64.0046 30.6207C65.0901 30.6207 66.063 30.8502 66.9234 31.3091C67.7838 31.768 68.4523 32.404 68.9289 33.2169C69.4186 34.0299 69.6635 34.9543 69.6635 35.9902C69.6635 37.026 69.4186 37.957 68.9289 38.7831C68.4523 39.596 67.7838 40.232 66.9234 40.6909C66.063 41.1499 65.0901 41.3793 64.0046 41.3793ZM64.0046 39.2748C64.918 39.2748 65.6725 38.9732 66.2682 38.3701C66.8639 37.7669 67.1617 36.9736 67.1617 35.9902C67.1617 35.0068 66.8639 34.2135 66.2682 33.6103C65.6725 33.0071 64.918 32.7055 64.0046 32.7055C63.0913 32.7055 62.3367 33.0071 61.7411 33.6103C61.1586 34.2135 60.8674 35.0068 60.8674 35.9902C60.8674 36.9736 61.1586 37.7669 61.7411 38.3701C62.3367 38.9732 63.0913 39.2748 64.0046 39.2748Z" fill="white"/>
<path d="M76.9404 41.3793C75.8417 41.3793 74.8555 41.1499 73.9818 40.6909C73.1082 40.232 72.4265 39.596 71.9367 38.7831C71.4469 37.957 71.202 37.026 71.202 35.9902C71.202 34.9543 71.4469 34.0299 71.9367 33.2169C72.4265 32.404 73.1016 31.768 73.962 31.3091C74.8356 30.8502 75.8284 30.6207 76.9404 30.6207C77.9861 30.6207 78.8995 30.8305 79.6805 31.2501C80.4747 31.6697 81.0704 32.2728 81.4675 33.0596L79.5613 34.161C79.2569 33.6759 78.873 33.3153 78.4097 33.0792C77.9596 32.8301 77.4632 32.7055 76.9205 32.7055C75.9939 32.7055 75.2261 33.0071 74.6172 33.6103C74.0083 34.2003 73.7039 34.9936 73.7039 35.9902C73.7039 36.9867 74.0017 37.7866 74.5974 38.3897C75.2063 38.9798 75.9807 39.2748 76.9205 39.2748C77.4632 39.2748 77.9596 39.1568 78.4097 38.9208C78.873 38.6716 79.2569 38.3045 79.5613 37.8193L81.4675 38.9208C81.0571 39.7075 80.4548 40.3172 79.6606 40.7499C78.8796 41.1695 77.9729 41.3793 76.9404 41.3793Z" fill="white"/>
<path d="M83.6527 30.7387H86.1347V37.662L91.9921 30.7387H94.2557V41.2416H91.7737V34.3184L85.9361 41.2416H83.6527V30.7387Z" fill="white"/>
<path d="M102.419 41.3793C101.321 41.3793 100.334 41.1499 99.4608 40.6909C98.5872 40.232 97.9055 39.596 97.4157 38.7831C96.9259 37.957 96.681 37.026 96.681 35.9902C96.681 34.9543 96.9259 34.0299 97.4157 33.2169C97.9055 32.404 98.5806 31.768 99.441 31.3091C100.315 30.8502 101.307 30.6207 102.419 30.6207C103.465 30.6207 104.378 30.8305 105.159 31.2501C105.954 31.6697 106.549 32.2728 106.946 33.0596L105.04 34.161C104.736 33.6759 104.352 33.3153 103.889 33.0792C103.439 32.8301 102.942 32.7055 102.399 32.7055C101.473 32.7055 100.705 33.0071 100.096 33.6103C99.4873 34.2003 99.1829 34.9936 99.1829 35.9902C99.1829 36.9867 99.4807 37.7866 100.076 38.3897C100.685 38.9798 101.46 39.2748 102.399 39.2748C102.942 39.2748 103.439 39.1568 103.889 38.9208C104.352 38.6716 104.736 38.3045 105.04 37.8193L106.946 38.9208C106.536 39.7075 105.934 40.3172 105.14 40.7499C104.359 41.1695 103.452 41.3793 102.419 41.3793Z" fill="white"/>
<path d="M117.434 32.8236H113.721V41.2416H111.239V32.8236H107.506V30.7387H117.434V32.8236Z" fill="white"/>
<path d="M128.697 36.0492C128.697 36.2196 128.683 36.4622 128.657 36.7769H120.337C120.483 37.5505 120.86 38.1668 121.469 38.6257C122.091 39.0716 122.859 39.2945 123.772 39.2945C124.937 39.2945 125.897 38.9142 126.651 38.1537L127.982 39.6682C127.505 40.232 126.903 40.6581 126.175 40.9466C125.447 41.2351 124.626 41.3793 123.713 41.3793C122.548 41.3793 121.522 41.1499 120.635 40.6909C119.748 40.232 119.06 39.596 118.57 38.7831C118.094 37.957 117.855 37.026 117.855 35.9902C117.855 34.9674 118.087 34.0496 118.55 33.2366C119.027 32.4105 119.682 31.768 120.516 31.3091C121.35 30.8502 122.29 30.6207 123.336 30.6207C124.368 30.6207 125.288 30.8502 126.096 31.3091C126.916 31.7549 127.552 32.3909 128.002 33.2169C128.465 34.0299 128.697 34.974 128.697 36.0492ZM123.336 32.5875C122.541 32.5875 121.866 32.8236 121.31 33.2956C120.768 33.7545 120.437 34.3708 120.317 35.1444H126.334C126.228 34.3839 125.904 33.7676 125.361 33.2956C124.818 32.8236 124.143 32.5875 123.336 32.5875Z" fill="white"/>
<path d="M141.836 41.2416V34.279L138.262 40.1402H137.189L133.675 34.2594V41.2416H131.411V30.7387H134.012L137.785 37.308L141.736 30.7387H144.059L144.079 41.2416H141.836Z" fill="white"/>
<path d="M151.36 30.6207C152.922 30.6207 154.113 30.9944 154.934 31.7418C155.768 32.4761 156.185 33.5906 156.185 35.0854V41.2416H153.842V39.9632C153.537 40.4221 153.1 40.7762 152.531 41.0253C151.975 41.2613 151.3 41.3793 150.506 41.3793C149.712 41.3793 149.017 41.2482 148.421 40.986C147.825 40.7106 147.362 40.3369 147.031 39.8649C146.713 39.3797 146.555 38.8355 146.555 38.2324C146.555 37.2883 146.905 36.5343 147.607 35.9705C148.322 35.3936 149.44 35.1051 150.963 35.1051H153.703V34.9477C153.703 34.2135 153.478 33.6496 153.028 33.2563C152.591 32.8629 151.935 32.6662 151.062 32.6662C150.466 32.6662 149.877 32.758 149.295 32.9416C148.725 33.1251 148.242 33.3808 147.845 33.7086L146.872 31.9188C147.428 31.4992 148.097 31.178 148.878 30.9551C149.659 30.7322 150.486 30.6207 151.36 30.6207ZM151.022 39.5895C151.644 39.5895 152.194 39.4518 152.67 39.1765C153.16 38.888 153.504 38.4815 153.703 37.957V36.7376H151.141C149.712 36.7376 148.997 37.2031 148.997 38.134C148.997 38.5798 149.176 38.9339 149.533 39.1961C149.89 39.4584 150.387 39.5895 151.022 39.5895Z" fill="white"/>
<path d="M0 3.46503V0.353575H10.793V3.46503L8.00079 3.9954V11.774H10.4887C10.7393 8.33258 11.9266 5.50987 14.0506 3.30592C16.1746 1.10197 18.8893 0 22.1946 0C25.7266 0 28.5845 1.23751 30.7681 3.71254C32.9637 6.18756 34.0615 9.29902 34.0615 13.0469V13.4358C34.0615 17.2073 32.9697 20.3247 30.786 22.7879C28.6024 25.2511 25.7445 26.4828 22.2125 26.4828C19.0742 26.4828 16.461 25.4927 14.3728 23.5127C12.2846 21.5209 11.0257 18.9339 10.5961 15.7518H8.00079V22.4697L10.793 23V26.0938H0V23L2.79222 22.4697V3.9954L0 3.46503ZM28.853 13.0116C28.853 10.348 28.2921 8.18526 27.1705 6.52346C26.0488 4.86165 24.3902 4.03075 22.1946 4.03075C19.999 4.03075 18.3583 4.85576 17.2724 6.50578C16.1985 8.15579 15.6615 10.3244 15.6615 13.0116V13.4358C15.6615 16.1466 16.2044 18.3329 17.2903 19.9947C18.3881 21.6447 20.0288 22.4697 22.2125 22.4697C24.42 22.4697 26.0786 21.6447 27.1884 19.9947C28.2981 18.3329 28.853 16.1466 28.853 13.4358V13.0116Z" fill="#51D585"/>
<path d="M23.2615 25.4622C24.3023 24.2711 25.618 23.3158 27.2084 22.5964C28.7988 21.877 30.5881 21.5172 32.5761 21.5172C35.9909 21.5172 38.7508 22.7143 40.8557 25.1084C42.9724 27.4908 44.0308 30.5689 44.0308 34.3429V35.2097C44.0308 38.9719 42.9666 42.0442 40.8382 44.4265C38.7215 46.8088 35.9675 48 32.5761 48C30.5881 48 28.7988 47.6462 27.2084 46.9386C25.618 46.2309 24.3023 45.2757 23.2615 44.0727V38.9778H27.0681L27.5943 42.3921C28.0387 42.8992 28.676 43.3002 29.5063 43.5951C30.3483 43.8899 31.2839 44.0373 32.313 44.0373C34.2192 44.0373 35.7278 43.3887 36.8387 42.0914C37.9497 40.7823 38.5929 39.0427 38.7683 36.8726L38.7332 36.7842H29.8045V32.7861H38.7332L38.7683 32.6977C38.5929 30.5158 37.9497 28.7704 36.8387 27.4613C35.7278 26.1522 34.1899 25.4976 32.2253 25.4976C31.1611 25.4976 30.2431 25.645 29.4713 25.9399C28.7111 26.2347 28.0855 26.6357 27.5943 27.1428L27.0681 30.5571H23.2615V25.4622Z" fill="#51D585"/>
</svg>
