<svg width="23" height="23" viewBox="0 0 23 23" fill="none" xmlns="http://www.w3.org/2000/svg">
<path d="M22.3424 3.14431C22.004 2.80538 21.455 2.80479 21.1167 3.14287L10.7176 13.5145L6.96562 9.43952C6.64142 9.08761 6.09329 9.06478 5.74078 9.38894C5.38855 9.71314 5.366 10.2615 5.6902 10.6138L10.0533 15.3522C10.2131 15.5258 10.4367 15.6267 10.6725 15.6316C10.6788 15.6319 10.6849 15.6319 10.691 15.6319C10.9201 15.6319 11.1406 15.5409 11.303 15.379L22.3407 4.37027C22.6799 4.03224 22.6805 3.48325 22.3424 3.14431Z" fill="#51D585"/>
<path d="M22.1331 10.6331C21.6544 10.6331 21.2663 11.0212 21.2663 11.5C21.2663 16.8854 16.8854 21.2663 11.5 21.2663C6.11495 21.2663 1.73367 16.8854 1.73367 11.5C1.73367 6.11495 6.11495 1.73367 11.5 1.73367C11.9788 1.73367 12.3669 1.34563 12.3669 0.866857C12.3669 0.388035 11.9788 0 11.5 0C5.15883 0 0 5.15883 0 11.5C0 17.8409 5.15883 23 11.5 23C17.8409 23 23 17.8409 23 11.5C23 11.0212 22.612 10.6331 22.1331 10.6331Z" fill="#51D585"/>
</svg>
