<svg width="162" height="48" viewBox="0 0 162 48" fill="none" xmlns="http://www.w3.org/2000/svg">
<path d="M43.2653 9.10345C44.2984 9.10345 45.219 9.32069 46.0269 9.75515C46.8481 10.1896 47.4905 10.803 47.9541 11.5952C48.4177 12.3875 48.6495 13.3011 48.6495 14.3362C48.6495 15.3712 48.4177 16.2913 47.9541 17.0963C47.4905 17.8886 46.8481 18.5019 46.0269 18.9364C45.219 19.3709 44.2984 19.5881 43.2653 19.5881C41.8349 19.5881 40.7024 19.1281 39.868 18.208V23.1724H37.3845V9.21846H39.7488V10.5602C40.1594 10.0746 40.6627 9.71043 41.2587 9.46764C41.868 9.22485 42.5369 9.10345 43.2653 9.10345ZM42.9872 17.5372C43.9011 17.5372 44.6494 17.2433 45.2322 16.6555C45.8283 16.0677 46.1263 15.2946 46.1263 14.3362C46.1263 13.3778 45.8283 12.6047 45.2322 12.0169C44.6494 11.4291 43.9011 11.1352 42.9872 11.1352C42.3912 11.1352 41.8547 11.2694 41.3779 11.5377C40.9011 11.7933 40.5236 12.1639 40.2455 12.6494C39.9673 13.135 39.8282 13.6973 39.8282 14.3362C39.8282 14.9751 39.9673 15.5374 40.2455 16.0229C40.5236 16.5085 40.9011 16.8855 41.3779 17.1538C41.8547 17.4094 42.3912 17.5372 42.9872 17.5372Z" fill="black"/>
<path d="M51.1211 9.21846H53.6046V15.9654L59.4655 9.21846H61.7304V19.4539H59.247V12.7069L53.4059 19.4539H51.1211V9.21846Z" fill="black"/>
<path d="M76.3957 17.4222V21.7349H74.0711V19.4539H65.8857V21.7349H63.581V17.4222H64.0777C64.7532 17.3966 65.2102 16.9813 65.4486 16.1763C65.7003 15.3585 65.8658 14.2084 65.9453 12.7261L66.0844 9.21846H74.8261V17.4222H76.3957ZM68.2102 12.8986C68.1572 14.0742 68.0579 15.0326 67.9122 15.7738C67.7665 16.5149 67.5016 17.0644 67.1175 17.4222H72.3427V11.2502H68.2698L68.2102 12.8986Z" fill="black"/>
<path d="M78.6137 9.21846H81.0971V15.9654L86.9581 9.21846H89.223V19.4539H86.7395V12.7069L80.8985 19.4539H78.6137V9.21846Z" fill="black"/>
<path d="M101.564 9.21846V19.4539H99.0803V15.4862C98.0604 15.959 96.9942 16.1954 95.8816 16.1954C94.5173 16.1954 93.471 15.8951 92.7425 15.2946C92.014 14.6812 91.6498 13.7484 91.6498 12.4961V9.21846H94.1332V12.3428C94.1332 12.9945 94.3319 13.48 94.7293 13.7995C95.1266 14.119 95.6895 14.2787 96.418 14.2787C97.3452 14.2787 98.2326 14.087 99.0803 13.7037V9.21846H101.564Z" fill="black"/>
<path d="M114.837 14.3937C114.837 14.5598 114.824 14.7962 114.797 15.1029H106.473C106.619 15.8568 106.996 16.4574 107.605 16.9046C108.228 17.3391 108.996 17.5563 109.91 17.5563C111.076 17.5563 112.036 17.1858 112.791 16.4446L114.122 17.9205C113.645 18.47 113.042 18.8853 112.314 19.1664C111.585 19.4475 110.764 19.5881 109.85 19.5881C108.685 19.5881 107.658 19.3645 106.771 18.9172C105.883 18.47 105.195 17.8502 104.705 17.058C104.228 16.2529 103.989 15.3457 103.989 14.3362C103.989 13.3395 104.221 12.445 104.685 11.6527C105.162 10.8477 105.817 10.2216 106.652 9.77432C107.486 9.32708 108.427 9.10345 109.473 9.10345C110.506 9.10345 111.427 9.32708 112.234 9.77432C113.056 10.2088 113.691 10.8285 114.142 11.6336C114.605 12.4258 114.837 13.3459 114.837 14.3937ZM109.473 11.0202C108.678 11.0202 108.003 11.2502 107.446 11.7102C106.903 12.1575 106.572 12.7581 106.453 13.512H112.473C112.367 12.7708 112.042 12.1703 111.499 11.7102C110.956 11.2502 110.281 11.0202 109.473 11.0202Z" fill="black"/>
<path d="M122.381 19.5881C121.282 19.5881 120.295 19.3645 119.421 18.9172C118.547 18.47 117.865 17.8502 117.375 17.058C116.885 16.2529 116.64 15.3457 116.64 14.3362C116.64 13.3267 116.885 12.4258 117.375 11.6336C117.865 10.8413 118.54 10.2216 119.401 9.77432C120.275 9.32708 121.269 9.10345 122.381 9.10345C123.428 9.10345 124.342 9.30791 125.123 9.71682C125.918 10.1257 126.514 10.7135 126.911 11.4802L125.004 12.5536C124.699 12.0808 124.315 11.7294 123.851 11.4994C123.401 11.2566 122.904 11.1352 122.361 11.1352C121.434 11.1352 120.666 11.4291 120.057 12.0169C119.447 12.5919 119.143 13.365 119.143 14.3362C119.143 15.3073 119.441 16.0868 120.037 16.6746C120.646 17.2497 121.421 17.5372 122.361 17.5372C122.904 17.5372 123.401 17.4222 123.851 17.1922C124.315 16.9494 124.699 16.5916 125.004 16.1188L126.911 17.1922C126.5 17.9589 125.898 18.553 125.103 18.9747C124.322 19.3836 123.414 19.5881 122.381 19.5881Z" fill="black"/>
<path d="M133.508 15.3521H131.581V19.4539H129.098V9.21846H131.581V13.3586H133.568L136.707 9.21846H139.369L135.515 14.1445L139.627 19.4539H136.707L133.508 15.3521Z" fill="black"/>
<path d="M145.139 9.10345C146.702 9.10345 147.894 9.46764 148.715 10.196C149.549 10.9116 149.966 11.9978 149.966 13.4545V19.4539H147.622V18.208C147.317 18.6553 146.88 19.0003 146.311 19.2431C145.755 19.4731 145.079 19.5881 144.284 19.5881C143.49 19.5881 142.794 19.4603 142.198 19.2047C141.602 18.9364 141.139 18.5722 140.808 18.1122C140.49 17.6394 140.331 17.1091 140.331 16.5213C140.331 15.6012 140.682 14.8665 141.384 14.317C142.099 13.7548 143.218 13.4737 144.741 13.4737H147.483V13.3203C147.483 12.6047 147.258 12.0553 146.808 11.6719C146.37 11.2886 145.715 11.0969 144.841 11.0969C144.245 11.0969 143.655 11.1863 143.072 11.3652C142.503 11.5441 142.019 11.7933 141.622 12.1128L140.649 10.3685C141.205 9.9596 141.874 9.64653 142.655 9.4293C143.437 9.21207 144.264 9.10345 145.139 9.10345ZM144.801 17.8438C145.423 17.8438 145.973 17.7097 146.45 17.4413C146.94 17.1602 147.284 16.7641 147.483 16.2529V15.0646H144.92C143.49 15.0646 142.774 15.5182 142.774 16.4254C142.774 16.8599 142.953 17.2049 143.311 17.4605C143.668 17.7161 144.165 17.8438 144.801 17.8438Z" fill="black"/>
<path d="M162 9.21846V19.4539H159.775V16.3679H156.973L154.808 19.4539H152.146L154.649 16.0421C153.881 15.7865 153.291 15.3968 152.881 14.8729C152.483 14.3362 152.285 13.6781 152.285 12.8986C152.285 11.723 152.715 10.8158 153.576 10.1768C154.437 9.53792 155.622 9.21846 157.132 9.21846H162ZM157.212 11.2311C155.609 11.2311 154.808 11.8125 154.808 12.9753C154.808 14.1253 155.583 14.7004 157.132 14.7004H159.775V11.2311H157.212Z" fill="black"/>
<path d="M51.7617 37.0326H49.8357V41.2416H47.3538V30.7387H49.8357V34.9871H51.8213L54.9585 30.7387H57.6192L53.7672 35.7935L57.8773 41.2416H54.9585L51.7617 37.0326Z" fill="black"/>
<path d="M64.0045 41.3793C62.9323 41.3793 61.966 41.1499 61.1056 40.6909C60.2452 40.232 59.5701 39.596 59.0803 38.7831C58.6038 37.957 58.3655 37.026 58.3655 35.9902C58.3655 34.9543 58.6038 34.0299 59.0803 33.2169C59.5701 32.404 60.2452 31.768 61.1056 31.3091C61.966 30.8502 62.9323 30.6207 64.0045 30.6207C65.09 30.6207 66.0629 30.8502 66.9233 31.3091C67.7838 31.768 68.4522 32.404 68.9288 33.2169C69.4185 34.0299 69.6634 34.9543 69.6634 35.9902C69.6634 37.026 69.4185 37.957 68.9288 38.7831C68.4522 39.596 67.7838 40.232 66.9233 40.6909C66.0629 41.1499 65.09 41.3793 64.0045 41.3793ZM64.0045 39.2748C64.9179 39.2748 65.6724 38.9732 66.2681 38.3701C66.8638 37.7669 67.1616 36.9736 67.1616 35.9902C67.1616 35.0068 66.8638 34.2135 66.2681 33.6103C65.6724 33.0071 64.9179 32.7055 64.0045 32.7055C63.0912 32.7055 62.3367 33.0071 61.741 33.6103C61.1585 34.2135 60.8673 35.0068 60.8673 35.9902C60.8673 36.9736 61.1585 37.7669 61.741 38.3701C62.3367 38.9732 63.0912 39.2748 64.0045 39.2748Z" fill="black"/>
<path d="M76.9403 41.3793C75.8416 41.3793 74.8554 41.1499 73.9818 40.6909C73.1081 40.232 72.4264 39.596 71.9366 38.7831C71.4468 37.957 71.2019 37.026 71.2019 35.9902C71.2019 34.9543 71.4468 34.0299 71.9366 33.2169C72.4264 32.404 73.1015 31.768 73.9619 31.3091C74.8356 30.8502 75.8283 30.6207 76.9403 30.6207C77.986 30.6207 78.8994 30.8305 79.6804 31.2501C80.4746 31.6697 81.0703 32.2728 81.4674 33.0596L79.5612 34.161C79.2568 33.6759 78.8729 33.3153 78.4096 33.0792C77.9595 32.8301 77.4631 32.7055 76.9204 32.7055C75.9938 32.7055 75.226 33.0071 74.6171 33.6103C74.0082 34.2003 73.7038 34.9936 73.7038 35.9902C73.7038 36.9867 74.0016 37.7866 74.5973 38.3897C75.2062 38.9798 75.9806 39.2748 76.9204 39.2748C77.4631 39.2748 77.9595 39.1568 78.4096 38.9208C78.8729 38.6716 79.2568 38.3045 79.5612 37.8193L81.4674 38.9208C81.057 39.7075 80.4547 40.3172 79.6605 40.7499C78.8795 41.1695 77.9728 41.3793 76.9403 41.3793Z" fill="black"/>
<path d="M83.6526 30.7387H86.1346V37.662L91.992 30.7387H94.2556V41.2416H91.7736V34.3184L85.936 41.2416H83.6526V30.7387Z" fill="black"/>
<path d="M102.419 41.3793C101.321 41.3793 100.334 41.1499 99.4608 40.6909C98.5871 40.232 97.9054 39.596 97.4156 38.7831C96.9258 37.957 96.6809 37.026 96.6809 35.9902C96.6809 34.9543 96.9258 34.0299 97.4156 33.2169C97.9054 32.404 98.5805 31.768 99.4409 31.3091C100.315 30.8502 101.307 30.6207 102.419 30.6207C103.465 30.6207 104.378 30.8305 105.159 31.2501C105.954 31.6697 106.549 32.2728 106.946 33.0596L105.04 34.161C104.736 33.6759 104.352 33.3153 103.889 33.0792C103.439 32.8301 102.942 32.7055 102.399 32.7055C101.473 32.7055 100.705 33.0071 100.096 33.6103C99.4872 34.2003 99.1828 34.9936 99.1828 35.9902C99.1828 36.9867 99.4806 37.7866 100.076 38.3897C100.685 38.9798 101.46 39.2748 102.399 39.2748C102.942 39.2748 103.439 39.1568 103.889 38.9208C104.352 38.6716 104.736 38.3045 105.04 37.8193L106.946 38.9208C106.536 39.7075 105.934 40.3172 105.14 40.7499C104.359 41.1695 103.452 41.3793 102.419 41.3793Z" fill="black"/>
<path d="M117.434 32.8236H113.721V41.2416H111.239V32.8236H107.506V30.7387H117.434V32.8236Z" fill="black"/>
<path d="M128.697 36.0492C128.697 36.2196 128.683 36.4622 128.657 36.7769H120.337C120.483 37.5505 120.86 38.1668 121.469 38.6257C122.091 39.0716 122.859 39.2945 123.772 39.2945C124.937 39.2945 125.897 38.9142 126.651 38.1537L127.982 39.6682C127.505 40.232 126.903 40.6581 126.175 40.9466C125.447 41.2351 124.626 41.3793 123.713 41.3793C122.548 41.3793 121.522 41.1499 120.635 40.6909C119.748 40.232 119.06 39.596 118.57 38.7831C118.094 37.957 117.855 37.026 117.855 35.9902C117.855 34.9674 118.087 34.0496 118.55 33.2366C119.027 32.4105 119.682 31.768 120.516 31.3091C121.35 30.8502 122.29 30.6207 123.335 30.6207C124.368 30.6207 125.288 30.8502 126.095 31.3091C126.916 31.7549 127.552 32.3909 128.002 33.2169C128.465 34.0299 128.697 34.974 128.697 36.0492ZM123.335 32.5875C122.541 32.5875 121.866 32.8236 121.31 33.2956C120.767 33.7545 120.437 34.3708 120.317 35.1444H126.334C126.228 34.3839 125.903 33.7676 125.361 33.2956C124.818 32.8236 124.143 32.5875 123.335 32.5875Z" fill="black"/>
<path d="M141.835 41.2416V34.279L138.261 40.1402H137.189L133.675 34.2594V41.2416H131.411V30.7387H134.012L137.785 37.308L141.736 30.7387H144.059L144.079 41.2416H141.835Z" fill="black"/>
<path d="M151.36 30.6207C152.922 30.6207 154.113 30.9944 154.934 31.7418C155.768 32.4761 156.185 33.5906 156.185 35.0854V41.2416H153.842V39.9632C153.537 40.4221 153.1 40.7762 152.531 41.0253C151.975 41.2613 151.3 41.3793 150.506 41.3793C149.712 41.3793 149.017 41.2482 148.421 40.986C147.825 40.7106 147.362 40.3369 147.031 39.8649C146.713 39.3797 146.554 38.8355 146.554 38.2324C146.554 37.2883 146.905 36.5343 147.607 35.9705C148.322 35.3936 149.44 35.1051 150.962 35.1051H153.703V34.9477C153.703 34.2135 153.478 33.6496 153.027 33.2563C152.591 32.8629 151.935 32.6662 151.062 32.6662C150.466 32.6662 149.877 32.758 149.295 32.9416C148.725 33.1251 148.242 33.3808 147.845 33.7086L146.872 31.9188C147.428 31.4992 148.097 31.178 148.878 30.9551C149.659 30.7322 150.486 30.6207 151.36 30.6207ZM151.022 39.5895C151.644 39.5895 152.194 39.4518 152.67 39.1765C153.16 38.888 153.504 38.4815 153.703 37.957V36.7376H151.141C149.712 36.7376 148.997 37.2031 148.997 38.134C148.997 38.5798 149.175 38.9339 149.533 39.1961C149.89 39.4584 150.387 39.5895 151.022 39.5895Z" fill="black"/>
<path d="M0 3.46503V0.353575H10.793V3.46503L8.00079 3.9954V11.774H10.4887C10.7393 8.33258 11.9266 5.50987 14.0506 3.30592C16.1746 1.10197 18.8893 0 22.1946 0C25.7266 0 28.5845 1.23751 30.7681 3.71254C32.9637 6.18756 34.0615 9.29902 34.0615 13.0469V13.4358C34.0615 17.2073 32.9697 20.3247 30.786 22.7879C28.6024 25.2511 25.7445 26.4828 22.2125 26.4828C19.0742 26.4828 16.461 25.4927 14.3728 23.5127C12.2846 21.5209 11.0257 18.9339 10.5961 15.7518H8.00079V22.4697L10.793 23V26.0938H0V23L2.79222 22.4697V3.9954L0 3.46503ZM28.853 13.0116C28.853 10.348 28.2921 8.18526 27.1705 6.52346C26.0488 4.86165 24.3902 4.03075 22.1946 4.03075C19.999 4.03075 18.3583 4.85576 17.2724 6.50578C16.1985 8.15579 15.6615 10.3244 15.6615 13.0116V13.4358C15.6615 16.1466 16.2044 18.3329 17.2903 19.9947C18.3881 21.6447 20.0288 22.4697 22.2125 22.4697C24.42 22.4697 26.0786 21.6447 27.1884 19.9947C28.2981 18.3329 28.853 16.1466 28.853 13.4358V13.0116Z" fill="#51D585"/>
<path d="M23.2615 25.4622C24.3023 24.2711 25.6179 23.3158 27.2083 22.5964C28.7988 21.877 30.588 21.5172 32.5761 21.5172C35.9908 21.5172 38.7507 22.7143 40.8557 25.1084C42.9724 27.4908 44.0307 30.5689 44.0307 34.3429V35.2097C44.0307 38.9719 42.9665 42.0442 40.8381 44.4265C38.7215 46.8088 35.9674 48 32.5761 48C30.588 48 28.7988 47.6462 27.2083 46.9386C25.6179 46.2309 24.3023 45.2757 23.2615 44.0727V38.9778H27.068L27.5942 42.3921C28.0386 42.8992 28.676 43.3002 29.5063 43.5951C30.3483 43.8899 31.2838 44.0373 32.3129 44.0373C34.2191 44.0373 35.7277 43.3887 36.8387 42.0914C37.9496 40.7823 38.5928 39.0427 38.7682 36.8726L38.7332 36.7842H29.8045V32.7861H38.7332L38.7682 32.6977C38.5928 30.5158 37.9496 28.7704 36.8387 27.4613C35.7277 26.1522 34.1899 25.4976 32.2252 25.4976C31.161 25.4976 30.243 25.645 29.4712 25.9399C28.7111 26.2347 28.0854 26.6357 27.5942 27.1428L27.068 30.5571H23.2615V25.4622Z" fill="#51D585"/>
</svg>
