<svg width="24" height="24" viewBox="0 0 24 24" fill="none" xmlns="http://www.w3.org/2000/svg">
<rect y="2" width="24" height="2" rx="1" fill="#51D585"/>
<rect y="11" width="24" height="2" rx="1" fill="#51D585"/>
<rect y="20" width="24" height="2" rx="1" fill="#51D585"/>
</svg>
