<svg width="24" height="24" viewBox="0 0 24 24" fill="none" xmlns="http://www.w3.org/2000/svg">
    <path d="M0 12C0 5.37258 5.37258 0 12 0C18.6274 0 24 5.37258 24 12C24 18.6274 18.6274 24 12 24C5.37258 24 0 18.6274 0 12Z" fill="#3183FF"/>
    <path d="M12 7.23132C8.94303 7.23132 6.17081 8.90382 4.12519 11.6204C3.95827 11.843 3.95827 12.1539 4.12519 12.3765C6.17081 15.0963 8.94303 16.7688 12 16.7688C15.057 16.7688 17.8292 15.0963 19.8748 12.3797C20.0417 12.1572 20.0417 11.8462 19.8748 11.6237C17.8292 8.90382 15.057 7.23132 12 7.23132ZM12.2193 15.3582C10.19 15.4858 8.51427 13.8133 8.64191 11.7808C8.74665 10.105 10.1049 8.74672 11.7807 8.64198C13.81 8.51433 15.4857 10.1868 15.3581 12.2194C15.2501 13.8919 13.8918 15.2501 12.2193 15.3582ZM12.1178 13.8068C11.0246 13.8755 10.1213 12.9754 10.1933 11.8822C10.249 10.9789 10.9821 10.249 11.8854 10.1901C12.9786 10.1214 13.882 11.0214 13.81 12.1146C13.751 13.0212 13.0179 13.7511 12.1178 13.8068Z" fill="white"/>
</svg>
