<svg width="16" height="16" viewBox="0 0 16 16" fill="none" xmlns="http://www.w3.org/2000/svg">
    <path d="M0 8C0 3.58172 3.58172 0 8 0C12.4183 0 16 3.58172 16 8C16 12.4183 12.4183 16 8 16C3.58172 16 0 12.4183 0 8Z" fill="#3183FF"/>
    <path d="M4.80005 8.58182L6.80005 10.4L11.2 6.4" stroke="white" stroke-width="2" stroke-linecap="round"/>
</svg>
