<svg width="12" height="12" viewBox="0 0 12 12" fill="none" xmlns="http://www.w3.org/2000/svg">
    <path d="M11.5711 1.71436H0.428223L5.99966 6.3035L11.6341 1.72721C11.6135 1.72119 11.5924 1.71689 11.5711 1.71436Z" fill="#3183FF"/>
    <path d="M6.27041 7.18976C6.11251 7.31906 5.88533 7.31906 5.72743 7.18976L0 2.47119V9.85719C0 10.0939 0.191878 10.2858 0.428579 10.2858H11.5714C11.8081 10.2858 12 10.0939 12 9.85719V2.53462L6.27041 7.18976Z" fill="#3183FF"/>
</svg>
