<svg width="16" height="16" viewBox="0 0 16 16" fill="none" xmlns="http://www.w3.org/2000/svg">
    <path d="M8 0C3.58179 0 0 3.58179 0 8C0 12.4182 3.58179 16 8 16C12.4182 16 16 12.4182 16 8C16 3.58179 12.4182 0 8 0ZM1.37931 8C1.37931 4.34952 4.34952 1.37931 8 1.37931C9.61269 1.37931 11.0919 1.95945 12.2414 2.9211L2.9211 12.2414C1.95945 11.0919 1.37931 9.61241 1.37931 8ZM8 14.6207C6.45793 14.6207 5.03834 14.0891 3.91172 13.2017L13.2017 3.91145C14.0891 5.03834 14.6207 6.45793 14.6207 8C14.6207 11.6505 11.6505 14.6207 8 14.6207Z" fill="#DB4661"/>
</svg>
