<svg width="76" height="79" viewBox="0 0 76 79" fill="none" xmlns="http://www.w3.org/2000/svg">
    <path d="M67.1827 46.4989C62.6504 63.4137 42.409 74.3279 25.3381 69.7538C8.26714 65.1796 6.13096 42.5248 10.6633 25.61C15.1956 8.69526 37.4542 5.70735 54.5251 10.2815C71.5961 14.8556 71.715 29.5841 67.1827 46.4989Z" fill="#1CB1C6"/>
</svg>
