<svg xmlns="http://www.w3.org/2000/svg" xmlns:xlink="http://www.w3.org/1999/xlink" version="1.1" x="0px" y="0px" viewBox="10 10 80 80" fill="#0a82ba" style="enable-background:new 0 0 96 96;" xml:space="preserve"><style type="text/css">
	.st0{fill:none;stroke:#000000;stroke-width:6;stroke-linecap:round;stroke-linejoin:round;stroke-miterlimit:10;}
	.st1{fill:none;stroke:#000000;stroke-width:6;stroke-miterlimit:10;}
	.st2{fill:none;stroke:#000000;stroke-width:6;stroke-linecap:round;stroke-miterlimit:10;}
</style><g><g><path d="M37.5,60.2l-3.7,3.7c-3.5,3.5-9.2,3.5-12.7,0c-3.5-3.5-3.5-9.2,0-12.7L36.3,36c1.7-1.7,3.9-2.6,6.3-2.6    c2.4,0,4.6,0.9,6.3,2.6c1.7,1.7,2.6,3.9,2.6,6.3c0,2.4-0.9,4.6-2.6,6.3c-1.2,1.2-1.2,3.1,0,4.2c1.2,1.2,3.1,1.2,4.2,0    c2.8-2.8,4.4-6.6,4.4-10.6c0-4-1.6-7.7-4.4-10.6c-5.8-5.8-15.3-5.8-21.1,0L16.9,47c-5.8,5.8-5.8,15.3,0,21.1    c2.9,2.9,6.7,4.4,10.6,4.4c3.8,0,7.7-1.5,10.6-4.4l3.3-3.3c0,0,0,0,0,0l0.3-0.3c1.2-1.2,1.2-3.1,0-4.2    C40.5,59.1,38.6,59.1,37.5,60.2z"/><path d="M77.1,21.9C71.3,16,61.8,16,56,21.9l-3.3,3.3c0,0,0,0,0,0l-0.3,0.3c-1.2,1.2-1.2,3.1,0,4.2c1.2,1.2,3.1,1.2,4.2,0l3.7-3.7    c3.5-3.5,9.2-3.5,12.7,0c3.5,3.5,3.5,9.2,0,12.7L57.7,54c-1.7,1.7-3.9,2.6-6.3,2.6c-2.4,0-4.6-0.9-6.3-2.6    c-1.7-1.7-2.6-3.9-2.6-6.3c0-2.4,0.9-4.6,2.6-6.3c1.2-1.2,1.2-3.1,0-4.2c-1.2-1.2-3.1-1.2-4.2,0c-2.8,2.8-4.4,6.6-4.4,10.6    c0,4,1.6,7.7,4.4,10.6c2.9,2.9,6.7,4.4,10.6,4.4c3.8,0,7.7-1.5,10.6-4.4L77.1,43C82.9,37.2,82.9,27.7,77.1,21.9z"/></g></g></svg>