<?xml version="1.0" encoding="utf-8"?>
<!-- Generator: Adobe Illustrator 17.0.0, SVG Export Plug-In . SVG Version: 6.00 Build 0)  -->
<!DOCTYPE svg PUBLIC "-//W3C//DTD SVG 1.1//EN" "http://www.w3.org/Graphics/SVG/1.1/DTD/svg11.dtd">
<svg version="1.1" id="Layer_1" xmlns="http://www.w3.org/2000/svg" xmlns:xlink="http://www.w3.org/1999/xlink" x="0px" y="0px"
	 width="35.814px" height="35.813px" viewBox="4.647 0 35.814 35.813" enable-background="new 4.647 0 35.814 35.813"
	 xml:space="preserve">
<g>
	<path fill="#FFFFFF" d="M22.554,35.813c-9.873,0-17.907-8.032-17.907-17.907C4.648,8.033,12.681,0,22.554,0
		s17.907,8.033,17.907,17.907C40.461,27.78,32.427,35.813,22.554,35.813z M22.554,2.754c-8.355,0-15.152,6.797-15.152,15.152
		c0,8.354,6.797,15.151,15.152,15.151c8.353,0,15.152-6.796,15.152-15.151C37.705,9.552,30.907,2.754,22.554,2.754z"/>
</g>
<g>
	<path fill="#FFFFFF" d="M20.187,23.76c-0.352,0-0.705-0.135-0.973-0.403l-4.218-4.219c-0.539-0.537-0.539-1.409,0-1.947
		c0.537-0.538,1.408-0.538,1.947,0l3.244,3.244l7.979-7.978c0.537-0.537,1.408-0.537,1.948,0c0.537,0.538,0.537,1.41,0,1.948
		l-8.954,8.954C20.892,23.625,20.539,23.76,20.187,23.76z"/>
</g>
</svg>
