<svg width="16" height="16" viewBox="0 0 16 16" fill="none" xmlns="http://www.w3.org/2000/svg">
<path d="M6 12L10 8L6 4" stroke="#424242" stroke-width="1.33333" stroke-linecap="round" stroke-linejoin="round"/>
</svg>
