<svg width="18" height="14" viewBox="0 0 18 14" fill="none" xmlns="http://www.w3.org/2000/svg">
    <path d="M1 13H8M1 1H17H1ZM1 7H17H1Z" stroke="#2B7FE2" stroke-width="2" stroke-linecap="round" stroke-linejoin="round"/>
</svg>
