<svg width="25" height="24" viewBox="0 0 25 24" fill="none" xmlns="http://www.w3.org/2000/svg">
<path d="M15.5 18L9.5 12L15.5 6" stroke="#FF4949" stroke-width="1.33333" stroke-linecap="round" stroke-linejoin="round"/>
</svg>
