<?xml version="1.0" encoding="UTF-8"?>
<session version="1.0">
<refactoring comment="Delete resource &apos;MINIPROJECT&apos;" deleteContents="false" description="Delete resource &apos;MINIPROJECT&apos;" element1="/MINIPROJECT" flags="7" id="org.eclipse.ltk.core.refactoring.delete.resources" resources="1" stamp="1641547325080"/>
</session>