<?xml version="1.0" encoding="UTF-8"?>
<session version="1.0">
<refactoring comment="Rename compilation unit &apos;com.hcl.devops.HelloWorldApplication.java&apos; to &apos;DevopsApplication.java&apos;&#x0D;&#x0A;- Original project: &apos;Devops&apos;&#x0D;&#x0A;- Original element: &apos;com.hcl.devops.HelloWorldApplication.java&apos;&#x0D;&#x0A;- Renamed element: &apos;com.hcl.devops.DevopsApplication.java&apos;" description="Rename compilation unit &apos;HelloWorldApplication.java&apos;" flags="2" id="org.eclipse.jdt.ui.rename.compilationunit" input="/src\/main\/java=/optional=/true=/=/maven.pomderived=/true=/&lt;com.hcl.devops{HelloWorldApplication.java" name="DevopsApplication.java" references="false" stamp="1643343467493" version="1.0"/>
</session>