<svg width="25" height="25" viewBox="0 0 40 40" fill="none" xmlns="http://www.w3.org/2000/svg">
    <path
            d="M26.4805 19.2406L17.1055 13.3813C16.7442 13.1555 16.2889 13.1435 15.9163 13.35C15.5437 13.5565 15.3125 13.949 15.3125 14.375V26.0938C15.3125 26.5198 15.5437 26.9122 15.9163 27.1188C16.0934 27.2169 16.289 27.2656 16.4844 27.2656C16.7002 27.2656 16.9158 27.206 17.1055 27.0875L26.4805 21.2281C26.8231 21.014 27.0312 20.6384 27.0312 20.2344C27.0312 19.8303 26.8232 19.4548 26.4805 19.2406ZM17.6563 23.9794V16.4893L23.6484 20.2344L17.6563 23.9794Z"
            fill="white"/>
    <path
            d="M34.1406 5H5.85938C2.62852 5 0 7.62852 0 10.8594V29.6094C0 32.8402 2.62852 35.4688 5.85938 35.4688H34.1406C37.3715 35.4688 40 32.8402 40 29.6094V10.8594C40 7.62852 37.3715 5 34.1406 5ZM37.6562 29.6094C37.6562 31.5479 36.0791 33.125 34.1406 33.125H5.85938C3.92086 33.125 2.34375 31.5479 2.34375 29.6094V10.8594C2.34375 8.92086 3.92086 7.34375 5.85938 7.34375H34.1406C36.0791 7.34375 37.6562 8.92086 37.6562 10.8594V29.6094Z"
            fill="white"/>
</svg>
