{
  "files": {
    "main.css": "/static/css/main.cf513aad.chunk.css",
    "main.js": "/static/js/main.707dcd71.chunk.js",
    "main.js.map": "/static/js/main.707dcd71.chunk.js.map",
    "runtime-main.js": "/static/js/runtime-main.08375643.js",
    "runtime-main.js.map": "/static/js/runtime-main.08375643.js.map",
    "static/css/2.4c97ca4f.chunk.css": "/static/css/2.4c97ca4f.chunk.css",
    "static/js/2.dca9e31f.chunk.js": "/static/js/2.dca9e31f.chunk.js",
    "static/js/2.dca9e31f.chunk.js.map": "/static/js/2.dca9e31f.chunk.js.map",
    "static/js/3.4c7ff742.chunk.js": "/static/js/3.4c7ff742.chunk.js",
    "static/js/3.4c7ff742.chunk.js.map": "/static/js/3.4c7ff742.chunk.js.map",
    "index.html": "/index.html",
    "static/css/2.4c97ca4f.chunk.css.map": "/static/css/2.4c97ca4f.chunk.css.map",
    "static/css/main.cf513aad.chunk.css.map": "/static/css/main.cf513aad.chunk.css.map",
    "static/js/2.dca9e31f.chunk.js.LICENSE.txt": "/static/js/2.dca9e31f.chunk.js.LICENSE.txt",
    "static/media/quiz.fc0c5e01.svg": "/static/media/quiz.fc0c5e01.svg",
    "static/media/texte.098dae41.svg": "/static/media/texte.098dae41.svg",
    "static/media/video.87ea92c6.svg": "/static/media/video.87ea92c6.svg"
  },
  "entrypoints": [
    "static/js/runtime-main.08375643.js",
    "static/css/2.4c97ca4f.chunk.css",
    "static/js/2.dca9e31f.chunk.js",
    "static/css/main.cf513aad.chunk.css",
    "static/js/main.707dcd71.chunk.js"
  ]
}