[0.147s] DEBUG:colcon:Command line arguments: ['/usr/bin/colcon', 'build']
[0.147s] DEBUG:colcon:Parsed command line arguments: Namespace(allow_overriding=[], ament_cmake_args=None, base_paths=['.'], build_base='build', catkin_cmake_args=None, catkin_skip_building_tests=False, cmake_args=None, cmake_clean_cache=False, cmake_clean_first=False, cmake_force_configure=False, cmake_target=None, cmake_target_skip_unavailable=False, continue_on_error=False, event_handlers=None, executor='sequential', install_base='install', log_base=None, log_level=None, main=<bound method BuildVerb.main of <colcon_core.verb.build.BuildVerb object at 0x7f6bf9196d30>>, merge_install=False, paths=None, symlink_install=False, test_result_base=None, verb_extension=<colcon_core.verb.build.BuildVerb object at 0x7f6bf9196d30>, verb_name='build', verb_parser=CustomArgumentParser(prog='colcon build', usage=None, description='Build a set of packages.', formatter_class=<class 'colcon_core.command.CustomFormatter'>, conflict_handler='error', add_help=True))
[0.158s] Level 1:colcon.colcon_core.package_discovery:discover_packages(recursive) check parameters
[0.158s] Level 1:colcon.colcon_core.package_discovery:discover_packages(path) check parameters
[0.158s] Level 1:colcon.colcon_core.package_discovery:discover_packages(recursive) discover
[0.158s] INFO:colcon.colcon_core.package_discovery:Crawling recursively for packages in '/home/roy/Desktop/Project806'
[0.159s] Level 1:colcon.colcon_core.package_identification:_identify(.) by extensions ['ignore', 'ignore_ament_install']
[0.159s] Level 1:colcon.colcon_core.package_identification:_identify(.) by extension 'ignore'
[0.159s] Level 1:colcon.colcon_core.package_identification:_identify(.) by extension 'ignore_ament_install'
[0.159s] Level 1:colcon.colcon_core.package_identification:_identify(.) by extensions ['ros']
[0.159s] Level 1:colcon.colcon_core.package_identification:_identify(.) by extension 'ros'
[0.176s] Level 1:colcon.colcon_core.package_identification:_identify(.) by extensions ['cmake', 'python']
[0.176s] Level 1:colcon.colcon_core.package_identification:_identify(.) by extension 'cmake'
[0.176s] Level 1:colcon.colcon_core.package_identification:_identify(.) by extension 'python'
[0.176s] Level 1:colcon.colcon_core.package_identification:_identify(.) by extensions ['python_setup_py']
[0.176s] Level 1:colcon.colcon_core.package_identification:_identify(.) by extension 'python_setup_py'
[0.176s] Level 1:colcon.colcon_core.package_identification:_identify(build) by extensions ['ignore', 'ignore_ament_install']
[0.176s] Level 1:colcon.colcon_core.package_identification:_identify(build) by extension 'ignore'
[0.176s] Level 1:colcon.colcon_core.package_identification:_identify(build) ignored
[0.176s] Level 1:colcon.colcon_core.package_identification:_identify(install) by extensions ['ignore', 'ignore_ament_install']
[0.176s] Level 1:colcon.colcon_core.package_identification:_identify(install) by extension 'ignore'
[0.177s] Level 1:colcon.colcon_core.package_identification:_identify(install) ignored
[0.177s] Level 1:colcon.colcon_core.package_identification:_identify(log) by extensions ['ignore', 'ignore_ament_install']
[0.177s] Level 1:colcon.colcon_core.package_identification:_identify(log) by extension 'ignore'
[0.177s] Level 1:colcon.colcon_core.package_identification:_identify(log) ignored
[0.177s] Level 1:colcon.colcon_core.package_identification:_identify(src) by extensions ['ignore', 'ignore_ament_install']
[0.177s] Level 1:colcon.colcon_core.package_identification:_identify(src) by extension 'ignore'
[0.177s] Level 1:colcon.colcon_core.package_identification:_identify(src) by extension 'ignore_ament_install'
[0.177s] Level 1:colcon.colcon_core.package_identification:_identify(src) by extensions ['ros']
[0.177s] Level 1:colcon.colcon_core.package_identification:_identify(src) by extension 'ros'
[0.177s] Level 1:colcon.colcon_core.package_identification:_identify(src) by extensions ['cmake', 'python']
[0.177s] Level 1:colcon.colcon_core.package_identification:_identify(src) by extension 'cmake'
[0.177s] Level 1:colcon.colcon_core.package_identification:_identify(src) by extension 'python'
[0.177s] Level 1:colcon.colcon_core.package_identification:_identify(src) by extensions ['python_setup_py']
[0.177s] Level 1:colcon.colcon_core.package_identification:_identify(src) by extension 'python_setup_py'
[0.177s] Level 1:colcon.colcon_core.package_identification:_identify(src/epuck_ros2) by extensions ['ignore', 'ignore_ament_install']
[0.178s] Level 1:colcon.colcon_core.package_identification:_identify(src/epuck_ros2) by extension 'ignore'
[0.178s] Level 1:colcon.colcon_core.package_identification:_identify(src/epuck_ros2) by extension 'ignore_ament_install'
[0.178s] Level 1:colcon.colcon_core.package_identification:_identify(src/epuck_ros2) by extensions ['ros']
[0.178s] Level 1:colcon.colcon_core.package_identification:_identify(src/epuck_ros2) by extension 'ros'
[0.197s] DEBUG:colcon.colcon_core.package_identification:Package 'src/epuck_ros2' with type 'ros.ament_cmake' and name 'epuck_ros2'
[0.197s] Level 1:colcon.colcon_core.package_discovery:discover_packages(recursive) using defaults
[0.197s] Level 1:colcon.colcon_core.package_discovery:discover_packages(path) discover
[0.197s] Level 1:colcon.colcon_core.package_discovery:discover_packages(path) using defaults
[0.236s] Level 5:colcon.colcon_core.verb:set package 'epuck_ros2' build argument 'cmake_args' from command line to 'None'
[0.236s] Level 5:colcon.colcon_core.verb:set package 'epuck_ros2' build argument 'cmake_target' from command line to 'None'
[0.236s] Level 5:colcon.colcon_core.verb:set package 'epuck_ros2' build argument 'cmake_target_skip_unavailable' from command line to 'False'
[0.236s] Level 5:colcon.colcon_core.verb:set package 'epuck_ros2' build argument 'cmake_clean_cache' from command line to 'False'
[0.236s] Level 5:colcon.colcon_core.verb:set package 'epuck_ros2' build argument 'cmake_clean_first' from command line to 'False'
[0.236s] Level 5:colcon.colcon_core.verb:set package 'epuck_ros2' build argument 'cmake_force_configure' from command line to 'False'
[0.236s] Level 5:colcon.colcon_core.verb:set package 'epuck_ros2' build argument 'ament_cmake_args' from command line to 'None'
[0.236s] Level 5:colcon.colcon_core.verb:set package 'epuck_ros2' build argument 'catkin_cmake_args' from command line to 'None'
[0.236s] Level 5:colcon.colcon_core.verb:set package 'epuck_ros2' build argument 'catkin_skip_building_tests' from command line to 'False'
[0.236s] DEBUG:colcon.colcon_core.verb:Building package 'epuck_ros2' with the following arguments: {'ament_cmake_args': None, 'build_base': '/home/roy/Desktop/Project806/build/epuck_ros2', 'catkin_cmake_args': None, 'catkin_skip_building_tests': False, 'cmake_args': None, 'cmake_clean_cache': False, 'cmake_clean_first': False, 'cmake_force_configure': False, 'cmake_target': None, 'cmake_target_skip_unavailable': False, 'install_base': '/home/roy/Desktop/Project806/install/epuck_ros2', 'merge_install': False, 'path': '/home/roy/Desktop/Project806/src/epuck_ros2', 'symlink_install': False, 'test_result_base': None}
[0.239s] WARNING:colcon.colcon_core.verb:Some selected packages are already built in one or more underlay workspaces:
	'epuck_ros2' is in: /home/roy/Desktop/Project806/install/epuck_ros2
If a package in a merged underlay workspace is overridden and it installs headers, then all packages in the overlay must sort their include directories by workspace order. Failure to do so may result in build failures or undefined behavior at run time.
If the overridden package is used by another package in any underlay, then the overriding package in the overlay must be API and ABI compatible or undefined behavior at run time may occur.

If you understand the risks and want to override a package anyways, add the following to the command line:
	--allow-overriding epuck_ros2

This may be promoted to an error in a future release of colcon-core.
[0.239s] INFO:colcon.colcon_core.executor:Executing jobs using 'sequential' executor
[0.241s] DEBUG:colcon.colcon_core.executor.sequential:run_until_complete 'epuck_ros2'
[0.241s] INFO:colcon.colcon_ros.task.ament_cmake.build:Building ROS package in '/home/roy/Desktop/Project806/src/epuck_ros2' with build type 'ament_cmake'
[0.241s] INFO:colcon.colcon_cmake.task.cmake.build:Building CMake package in '/home/roy/Desktop/Project806/src/epuck_ros2'
[0.253s] INFO:colcon.colcon_core.plugin_system:Skipping extension 'colcon_core.shell.bat': Not used on non-Windows systems
[0.254s] DEBUG:colcon.colcon_core.shell:Skip shell extension 'dsv' for command environment
[0.269s] DEBUG:colcon.colcon_core.event_handler.log_command:Invoking command in '/home/roy/Desktop/Project806/build/epuck_ros2': CMAKE_PREFIX_PATH=${CMAKE_PREFIX_PATH}:/opt/ros/foxy COMP_WORDBREAKS=
"'><=;|&( /usr/bin/cmake --build /home/roy/Desktop/Project806/build/epuck_ros2 -- -j8 -l8
[0.397s] DEBUG:colcon.colcon_core.event_handler.log_command:Invoked command in '/home/roy/Desktop/Project806/build/epuck_ros2' returned '0': CMAKE_PREFIX_PATH=${CMAKE_PREFIX_PATH}:/opt/ros/foxy COMP_WORDBREAKS=
"'><=;|&( /usr/bin/cmake --build /home/roy/Desktop/Project806/build/epuck_ros2 -- -j8 -l8
[0.443s] DEBUG:colcon.colcon_core.event_handler.log_command:Invoking command in '/home/roy/Desktop/Project806/build/epuck_ros2': CMAKE_PREFIX_PATH=${CMAKE_PREFIX_PATH}:/opt/ros/foxy COMP_WORDBREAKS=
"'><=;|&( /usr/bin/cmake --install /home/roy/Desktop/Project806/build/epuck_ros2
[0.539s] Level 1:colcon.colcon_core.environment:create_environment_scripts_only(epuck_ros2)
[0.539s] DEBUG:colcon.colcon_core.event_handler.log_command:Invoked command in '/home/roy/Desktop/Project806/build/epuck_ros2' returned '0': CMAKE_PREFIX_PATH=${CMAKE_PREFIX_PATH}:/opt/ros/foxy COMP_WORDBREAKS=
"'><=;|&( /usr/bin/cmake --install /home/roy/Desktop/Project806/build/epuck_ros2
[0.543s] Level 1:colcon.colcon_core.environment:checking '/home/roy/Desktop/Project806/install/epuck_ros2' for CMake module files
[0.543s] Level 1:colcon.colcon_core.environment:checking '/home/roy/Desktop/Project806/install/epuck_ros2' for CMake config files
[0.543s] Level 1:colcon.colcon_core.shell:create_environment_hook('epuck_ros2', 'cmake_prefix_path')
[0.544s] INFO:colcon.colcon_core.shell:Creating environment descriptor '/home/roy/Desktop/Project806/install/epuck_ros2/share/epuck_ros2/hook/cmake_prefix_path.dsv'
[0.544s] INFO:colcon.colcon_core.shell:Creating environment hook '/home/roy/Desktop/Project806/install/epuck_ros2/share/epuck_ros2/hook/cmake_prefix_path.sh'
[0.545s] Level 1:colcon.colcon_core.environment:checking '/home/roy/Desktop/Project806/install/epuck_ros2/lib'
[0.546s] Level 1:colcon.colcon_core.environment:checking '/home/roy/Desktop/Project806/install/epuck_ros2/bin'
[0.546s] Level 1:colcon.colcon_core.environment:checking '/home/roy/Desktop/Project806/install/epuck_ros2/lib/pkgconfig/epuck_ros2.pc'
[0.546s] Level 1:colcon.colcon_core.environment:checking '/home/roy/Desktop/Project806/install/epuck_ros2/lib/python3.8/site-packages'
[0.546s] Level 1:colcon.colcon_core.shell:create_environment_hook('epuck_ros2', 'pythonpath')
[0.546s] INFO:colcon.colcon_core.shell:Creating environment descriptor '/home/roy/Desktop/Project806/install/epuck_ros2/share/epuck_ros2/hook/pythonpath.dsv'
[0.546s] INFO:colcon.colcon_core.shell:Creating environment hook '/home/roy/Desktop/Project806/install/epuck_ros2/share/epuck_ros2/hook/pythonpath.sh'
[0.548s] INFO:colcon.colcon_core.shell:Creating package descriptor '/home/roy/Desktop/Project806/install/epuck_ros2/share/epuck_ros2/package.dsv'
[0.555s] INFO:colcon.colcon_core.shell:Creating package script '/home/roy/Desktop/Project806/install/epuck_ros2/share/epuck_ros2/package.sh'
[0.556s] Level 1:colcon.colcon_core.environment:create_file_with_runtime_dependencies(/home/roy/Desktop/Project806/install/epuck_ros2/share/colcon-core/packages/epuck_ros2)
[0.590s] Level 1:colcon.colcon_core.environment:create_environment_scripts_only(epuck_ros2)
[0.590s] Level 1:colcon.colcon_core.environment:checking '/home/roy/Desktop/Project806/install/epuck_ros2' for CMake module files
[0.591s] Level 1:colcon.colcon_core.environment:checking '/home/roy/Desktop/Project806/install/epuck_ros2' for CMake config files
[0.591s] Level 1:colcon.colcon_core.shell:create_environment_hook('epuck_ros2', 'cmake_prefix_path')
[0.591s] INFO:colcon.colcon_core.shell:Creating environment descriptor '/home/roy/Desktop/Project806/install/epuck_ros2/share/epuck_ros2/hook/cmake_prefix_path.dsv'
[0.592s] INFO:colcon.colcon_core.shell:Creating environment hook '/home/roy/Desktop/Project806/install/epuck_ros2/share/epuck_ros2/hook/cmake_prefix_path.sh'
[0.592s] Level 1:colcon.colcon_core.environment:checking '/home/roy/Desktop/Project806/install/epuck_ros2/lib'
[0.592s] Level 1:colcon.colcon_core.environment:checking '/home/roy/Desktop/Project806/install/epuck_ros2/bin'
[0.592s] Level 1:colcon.colcon_core.environment:checking '/home/roy/Desktop/Project806/install/epuck_ros2/lib/pkgconfig/epuck_ros2.pc'
[0.592s] Level 1:colcon.colcon_core.environment:checking '/home/roy/Desktop/Project806/install/epuck_ros2/lib/python3.8/site-packages'
[0.592s] Level 1:colcon.colcon_core.shell:create_environment_hook('epuck_ros2', 'pythonpath')
[0.592s] INFO:colcon.colcon_core.shell:Creating environment descriptor '/home/roy/Desktop/Project806/install/epuck_ros2/share/epuck_ros2/hook/pythonpath.dsv'
[0.593s] INFO:colcon.colcon_core.shell:Creating environment hook '/home/roy/Desktop/Project806/install/epuck_ros2/share/epuck_ros2/hook/pythonpath.sh'
[0.593s] INFO:colcon.colcon_core.shell:Creating package descriptor '/home/roy/Desktop/Project806/install/epuck_ros2/share/epuck_ros2/package.dsv'
[0.594s] INFO:colcon.colcon_core.shell:Creating package script '/home/roy/Desktop/Project806/install/epuck_ros2/share/epuck_ros2/package.sh'
[0.594s] Level 1:colcon.colcon_core.environment:create_file_with_runtime_dependencies(/home/roy/Desktop/Project806/install/epuck_ros2/share/colcon-core/packages/epuck_ros2)
[0.594s] DEBUG:colcon.colcon_core.executor.sequential:run_until_complete 'epuck_ros2' finished with '0'
[0.595s] DEBUG:colcon.colcon_core.executor.sequential:closing loop
[0.596s] DEBUG:colcon.colcon_core.executor.sequential:loop closed
[0.597s] DEBUG:colcon.colcon_core.event_reactor:joining thread
[0.600s] DEBUG:colcon.colcon_core.event_reactor:joined thread
[0.602s] INFO:colcon.colcon_core.shell:Creating prefix script '/home/roy/Desktop/Project806/install/local_setup.sh'
[0.602s] INFO:colcon.colcon_core.shell:Creating prefix util module '/home/roy/Desktop/Project806/install/_local_setup_util_sh.py'
[0.604s] INFO:colcon.colcon_core.shell:Creating prefix chain script '/home/roy/Desktop/Project806/install/setup.sh'
