\relax 
\providecommand\babel@aux[2]{}
\@nameuse{bbl@beforestart}
\catcode `"\active 
\babel@aux{ngerman}{}
\@writefile{toc}{\contentsline {section}{\numberline {1}Realisierung}{1}{}\protected@file@percent }
\@writefile{lof}{\contentsline {figure}{\numberline {1}{\ignorespaces Abtastung der RX-Leitung}}{1}{}\protected@file@percent }
\newlabel{fig:RX_Abtastung}{{1}{1}}
\@writefile{lof}{\contentsline {figure}{\numberline {2}{\ignorespaces Zustandsdiagramm Startbiterkennung und Taktgenerierung}}{2}{}\protected@file@percent }
\newlabel{fig:RX_Taktgenerierung}{{2}{2}}
\@writefile{lof}{\contentsline {figure}{\numberline {3}{\ignorespaces Simulation: fehlerhaftes Startbit}}{3}{}\protected@file@percent }
\newlabel{fig:Fehlerfall_quelle}{{3}{3}}
\@writefile{lof}{\contentsline {figure}{\numberline {4}{\ignorespaces Simulation: Fehlerfall}}{3}{}\protected@file@percent }
\newlabel{fig:Fehlerfall}{{4}{3}}
\gdef \@abspage@last{4}
