\relax 
\providecommand\babel@aux[2]{}
\@nameuse{bbl@beforestart}
\catcode `"\active 
\babel@aux{ngerman}{}
\@writefile{toc}{\contentsline {section}{\numberline {1}Realisierung}{1}{}\protected@file@percent }
\@writefile{lof}{\contentsline {figure}{\numberline {1}{\ignorespaces Simulation der Hardware}}{1}{}\protected@file@percent }
\newlabel{fig:signale}{{1}{1}}
\@writefile{lof}{\contentsline {figure}{\numberline {2}{\ignorespaces Struktogramm des C-Programms}}{2}{}\protected@file@percent }
\newlabel{fig:Steuerungssoftware}{{2}{2}}
\@writefile{lof}{\contentsline {figure}{\numberline {3}{\ignorespaces Ausgabe}}{2}{}\protected@file@percent }
\newlabel{fig:putty}{{3}{2}}
\gdef \@abspage@last{3}
