\contentsline {section}{\numberline {1}Vorbereitung}{1}{}%
\contentsline {subsection}{\numberline {1.1}Zustandsdiagramm: Vorüberlegungen}{1}{}%
\contentsline {subsection}{\numberline {1.2}Ausgangssignale: Vorüberlegungen}{1}{}%
\contentsline {section}{\numberline {2}Realisierung}{2}{}%
\contentsline {subsection}{\numberline {2.1}Zustandsdiagramm}{2}{}%
