\relax 
\providecommand\babel@aux[2]{}
\@nameuse{bbl@beforestart}
\catcode `"\active 
\babel@aux{ngerman}{}
\@writefile{toc}{\contentsline {section}{\numberline {1}Vorbereitung}{1}{}\protected@file@percent }
\@writefile{toc}{\contentsline {subsection}{\numberline {1.1}Zustandsdiagramm: Vorüberlegungen}{1}{}\protected@file@percent }
\@writefile{lof}{\contentsline {figure}{\numberline {1}{\ignorespaces Erster Entwurf eines UART-TX-Zustandsdiagramms}}{1}{}\protected@file@percent }
\newlabel{fig:stm_vorbereitung}{{1}{1}}
\@writefile{toc}{\contentsline {subsection}{\numberline {1.2}Ausgangssignale: Vorüberlegungen}{2}{}\protected@file@percent }
\@writefile{lof}{\contentsline {figure}{\numberline {2}{\ignorespaces Ausgangssignale: Vorbereitung}}{2}{}\protected@file@percent }
\newlabel{fig:sign_vorbereitung}{{2}{2}}
\@writefile{toc}{\contentsline {section}{\numberline {2}Realisierung}{3}{}\protected@file@percent }
\@writefile{toc}{\contentsline {subsection}{\numberline {2.1}Zustandsdiagramm}{3}{}\protected@file@percent }
\@writefile{lof}{\contentsline {figure}{\numberline {3}{\ignorespaces Endgültiges UART-TX-Zustandsdiagramm}}{3}{}\protected@file@percent }
\newlabel{fig:stm_real}{{3}{3}}
\gdef \@abspage@last{4}
