{
	"info": {
		"_postman_id": "b93c7470-f27d-462f-beac-21b00c1b4d1e",
		"name": "Training express v2.0",
		"schema": "https://schema.getpostman.com/json/collection/v2.1.0/collection.json",
		"_exporter_id": "14570998"
	},
	"item": [
		{
			"name": "Casa de discuri",
			"item": [
				{
					"name": "Get all case de discuri",
					"request": {
						"method": "GET",
						"header": [],
						"url": {
							"raw": "http://localhost:8080/api/caseDeDiscuri",
							"protocol": "http",
							"host": [
								"localhost"
							],
							"port": "8080",
							"path": [
								"api",
								"caseDeDiscuri"
							]
						}
					},
					"response": []
				},
				{
					"name": "Add casa de discuri 1",
					"request": {
						"method": "POST",
						"header": [],
						"body": {
							"mode": "raw",
							"raw": "{\n    \"denumire\": \"Pe Sistem Records\"\n}",
							"options": {
								"raw": {
									"language": "json"
								}
							}
						},
						"url": {
							"raw": "http://localhost:8080/api/caseDeDiscuri",
							"protocol": "http",
							"host": [
								"localhost"
							],
							"port": "8080",
							"path": [
								"api",
								"caseDeDiscuri"
							]
						}
					},
					"response": []
				},
				{
					"name": "Add casa de discuri 2",
					"request": {
						"method": "POST",
						"header": [],
						"body": {
							"mode": "raw",
							"raw": "{\n    \"denumire\": \"Manele mentolate\"\n}",
							"options": {
								"raw": {
									"language": "json"
								}
							}
						},
						"url": {
							"raw": "http://localhost:8080/api/caseDeDiscuri",
							"protocol": "http",
							"host": [
								"localhost"
							],
							"port": "8080",
							"path": [
								"api",
								"caseDeDiscuri"
							]
						}
					},
					"response": []
				}
			]
		},
		{
			"name": "Manea",
			"item": [
				{
					"name": "Get all manele",
					"request": {
						"method": "GET",
						"header": [],
						"url": {
							"raw": "http://localhost:8080/api/manele",
							"protocol": "http",
							"host": [
								"localhost"
							],
							"port": "8080",
							"path": [
								"api",
								"manele"
							]
						}
					},
					"response": []
				},
				{
					"name": "Get manea by id",
					"request": {
						"method": "GET",
						"header": [],
						"url": {
							"raw": "http://localhost:8080/api/manele/1",
							"protocol": "http",
							"host": [
								"localhost"
							],
							"port": "8080",
							"path": [
								"api",
								"manele",
								"1"
							]
						}
					},
					"response": []
				},
				{
					"name": "Add manea 1",
					"request": {
						"method": "POST",
						"header": [],
						"body": {
							"mode": "raw",
							"raw": "{\n    \"casaDeDiscuriId\": 1,\n    \"denumire\": \"A iesit soarele din nori\",\n    \"artist\": \"Florin Salam\"\n}",
							"options": {
								"raw": {
									"language": "json"
								}
							}
						},
						"url": {
							"raw": "http://localhost:8080/api/manele",
							"protocol": "http",
							"host": [
								"localhost"
							],
							"port": "8080",
							"path": [
								"api",
								"manele"
							]
						}
					},
					"response": []
				},
				{
					"name": "Add manea 2",
					"request": {
						"method": "POST",
						"header": [],
						"body": {
							"mode": "raw",
							"raw": "{\n    \"casaDeDiscuriId\": 2,\n    \"denumire\": \"Toate pozele cu tine\",\n    \"artist\": \"Nicolae Guta\"\n}",
							"options": {
								"raw": {
									"language": "json"
								}
							}
						},
						"url": {
							"raw": "http://localhost:8080/api/manele",
							"protocol": "http",
							"host": [
								"localhost"
							],
							"port": "8080",
							"path": [
								"api",
								"manele"
							]
						}
					},
					"response": []
				},
				{
					"name": "Update manea",
					"request": {
						"method": "PUT",
						"header": [],
						"body": {
							"mode": "raw",
							"raw": "{\n    \"denumire\": \"Esti bomba\"\n}",
							"options": {
								"raw": {
									"language": "json"
								}
							}
						},
						"url": {
							"raw": "http://localhost:8080/api/manele/1",
							"protocol": "http",
							"host": [
								"localhost"
							],
							"port": "8080",
							"path": [
								"api",
								"manele",
								"1"
							]
						}
					},
					"response": []
				}
			]
		},
		{
			"name": "Resetare baza de date",
			"request": {
				"method": "GET",
				"header": [],
				"url": {
					"raw": "http://localhost:8080/api/reset",
					"protocol": "http",
					"host": [
						"localhost"
					],
					"port": "8080",
					"path": [
						"api",
						"reset"
					]
				}
			},
			"response": []
		}
	]
}