"Freq [GHz]","$ep_mut []","mag(S(1,1)) []"
10,1,0.67929792283762
10,1.1,0.674287244501035
10,1.2,0.669139356588079
10,1.3,0.663850451828872
10,1.4,0.658420400742341
10,1.5,0.652839065105469
10,1.6,0.647109072599447
10,1.7,0.641216697497908
10,1.8,0.635170364123417
10,1.9,0.628958894475988
10,2,0.622582499786054
10,2.1,0.61602960596178
10,2.2,0.609305725482969
10,2.3,0.602399218168758
10,2.4,0.595311597097389
10,2.5,0.588040379514512
10,2.6,0.580577637103956
10,2.7,0.57291784562489
10,2.8,0.565066502393154
10,2.9,0.557011670947672
10,3,0.548760660932192
10,3.1,0.540305688865451
10,3.2,0.531649681912969
10,3.3,0.52278975074699
10,3.4,0.513725351889203
10,3.5,0.504449478866519
10,3.6,0.494972227593234
10,3.7,0.485292921317607
10,3.8,0.475419694940025
10,3.9,0.465352915343815
10,4,0.45508767721379
10,4.1,0.444651292966306
10,4.2,0.434038007448936
10,4.3,0.423253265253769
10,4.4,0.412325363096185
10,4.5,0.401260450893642
10,4.6,0.390078593344073
10,4.7,0.378795848189726
10,4.8,0.367439064852375
10,4.9,0.356042169748862
10,5,0.344633344995765
10,5.1,0.33323663332332
10,5.2,0.321905728182694
10,5.3,0.310694991146788
10,5.4,0.299655286738834
10,5.5,0.288856989929514
10,5.6,0.278365644059277
10,5.7,0.268246614761997
10,5.8,0.258619844791881
10,5.9,0.249552867717759
10,6,0.241209432174376
10,6.1,0.233650710722815
10,6.2,0.226992468256613
10,6.3,0.221394831597882
10,6.4,0.216893406739194
10,6.5,0.213675285233954
10,6.6,0.211768398294554
10,6.7,0.211247680286462
10,6.8,0.212127614715274
10,6.9,0.214361749910866
10,7,0.217945551152124
10,7.1,0.222765979169916
10,7.2,0.228749191780127
10,7.3,0.235777653863401
10,7.4,0.243746876156914
10,7.5,0.252518878153492
10,7.6,0.261986478269595
10,7.7,0.272065444737192
10,7.8,0.282638237044873
10,7.9,0.293578629429717
10,8,0.304873094373427
10,8.1,0.316417315256947
10,8.2,0.328117729122552
10,8.3,0.339920294366528
10,8.4,0.35180220366654
10,8.5,0.363666342365621
10,8.6,0.375585350366927
10,8.7,0.38738165446175
10,8.8,0.39909936401262
10,8.9,0.410747608867921
10,9,0.42221085939417
10,9.1,0.433603471396493
10,9.2,0.444704536945738
10,9.3,0.455707883780904
10,9.4,0.46649985347061
10,9.5,0.477090670972564
10,9.6,0.487428811160107
10,9.7,0.497525884101433
10,9.8,0.507431709095352
10,9.9,0.517094180014498
10,10,0.526497040633251
10,10.1,0.535703282002795
10,10.2,0.544631851842688
10,10.3,0.553330438111066
10,10.4,0.561813960293517
10,10.5,0.570115382585909
10,10.6,0.57813826467444
10,10.7,0.58585209659656
10,10.8,0.593405057943666
10,10.9,0.600632812225257
10,11,0.607716164207286
10,11.1,0.614556959495569
10,11.2,0.621212544528571
10,11.3,0.627572003133577
10,11.4,0.633804805423351
10,11.5,0.639753732275338
10,11.6,0.645558757308567
10,11.7,0.651119640755779
10,11.8,0.656523120663155
10,11.9,0.661718584072962
10,12,0.666741305765506
10,12.1,0.67156300411739
10,12.2,0.676203984910673
10,12.3,0.680652504322731
10,12.4,0.684968740416751
10,12.5,0.689114852686713
10,12.6,0.69308075792816
10,12.7,0.696862597058175
10,12.8,0.70050968860555
10,12.9,0.704049953898704
10,13,0.707397191595741
10,13.1,0.710617725184451
10,13.2,0.713669438562976
10,13.3,0.716604219700953
10,13.4,0.71940509906964
10,13.5,0.722058347620217
10,13.6,0.724586166990093
10,13.7,0.726996948109556
10,13.8,0.729256348502345
10,13.9,0.731418236760475
10,14,0.733428926064097
10,14.1,0.735348968643652
10,14.2,0.737127724693744
10,14.3,0.738824226035836
10,14.4,0.740400114301071
10,14.5,0.741861360252743
10,14.6,0.743206114717072
10,14.7,0.744435832939653
10,14.8,0.745590516429584
10,14.9,0.746608257813034
10,15,0.747537564470692
10,15.1,0.748375019157778
10,15.2,0.749106179440602
10,15.3,0.749727223112738
10,15.4,0.750270423673196
10,15.5,0.750695341826076
10,15.6,0.751025563692101
10,15.7,0.751254244711134
10,15.8,0.751394661668075
10,15.9,0.751435836890764
10,16,0.751381504800327
10,16.1,0.751225090910814
10,16.2,0.750965267123393
10,16.3,0.750627569152875
10,16.4,0.750191657759584
10,16.5,0.74966376051361
10,16.6,0.7490360807658
10,16.7,0.748312653312578
10,16.8,0.747495471476864
10,16.9,0.746581404412234
10,17,0.745565260546161
10,17.1,0.744461329275291
10,17.2,0.743253617509046
10,17.3,0.741961423398745
10,17.4,0.740551713252989
10,17.5,0.739051686986535
10,17.6,0.737451732496675
10,17.7,0.735760004250989
10,17.8,0.733966108178756
10,17.9,0.732074686027485
10,18,0.730076119474367
10,18.1,0.72798396851027
10,18.2,0.725782025191993
10,18.3,0.723476987060245
10,18.4,0.72107954996539
10,18.5,0.718538092070413
10,18.6,0.715926306531608
10,18.7,0.713196201751414
10,18.8,0.710362666725449
10,18.9,0.707421110562486
10,19,0.704378118861373
10,19.1,0.701216602511669
10,19.2,0.697956152729172
10,19.3,0.694581194824788
10,19.4,0.691128089953168
10,19.5,0.687519694130059
10,19.6,0.68383120742531
10,19.7,0.680018686908032
10,19.8,0.676096427116244
10,19.9,0.672077508949757
10,20,0.667930630927703
