"Freq [GHz]","$ep_mut []","mag(S(1,1)) []"
10,1,0.740605886302334
10,1.1,0.733346050712576
10,1.2,0.725858818802996
10,1.3,0.718173416792674
10,1.4,0.71027852407433
10,1.5,0.702161265117247
10,1.6,0.693825292214622
10,1.7,0.685272394950009
10,1.8,0.676499248083151
10,1.9,0.667496586729238
10,2,0.658269834338872
10,2.1,0.64882317455843
10,2.2,0.639148958760319
10,2.3,0.629250196358384
10,2.4,0.619128022147836
10,2.5,0.608784078275242
10,2.6,0.598219565166101
10,2.7,0.587441663816601
10,2.8,0.576451495346892
10,2.9,0.565266353502991
10,3,0.553863727038768
10,3.1,0.542283319034835
10,3.2,0.530517484508591
10,3.3,0.518578475373867
10,3.4,0.506481866952898
10,3.5,0.494236078292521
10,3.6,0.481855031730127
10,3.7,0.469360298311617
10,3.8,0.456780808297807
10,3.9,0.444095088449991
10,4,0.431364113410553
10,4.1,0.418597379884271
10,4.2,0.405827664099871
10,4.3,0.393083680948265
10,4.4,0.380389186275208
10,4.5,0.367784686363446
10,4.6,0.355310865341527
10,4.7,0.343010450445012
10,4.8,0.330924402346538
10,4.9,0.319107392220498
10,5,0.307609179397776
10,5.1,0.296492381227432
10,5.2,0.285819885922593
10,5.3,0.275655630690062
10,5.4,0.266076530902652
10,5.5,0.257166416395234
10,5.6,0.248988042967459
10,5.7,0.241628400301774
10,5.8,0.235158984343666
10,5.9,0.229657515175805
10,6,0.22517370319556
10,6.1,0.22176190632272
10,6.2,0.219457735450146
10,6.3,0.218274681906842
10,6.4,0.218201151360068
10,6.5,0.21921227648409
10,6.6,0.221265719303193
10,6.7,0.224298149438688
10,6.8,0.228235823610562
10,6.9,0.233006052791924
10,7,0.238511894193336
10,7.1,0.244673296387409
10,7.2,0.251409747901341
10,7.3,0.258633566322734
10,7.4,0.266272259074129
10,7.5,0.274262077914371
10,7.6,0.282539192008933
10,7.7,0.291046161031452
10,7.8,0.299725881193078
10,7.9,0.308539542261117
10,8,0.317450961039104
10,8.1,0.32641564867115
10,8.2,0.335422452164077
10,8.3,0.344415976223148
10,8.4,0.353393302172857
10,8.5,0.362334185773873
10,8.6,0.371226494915118
10,8.7,0.380039117462989
10,8.8,0.388760973575693
10,8.9,0.397390151072386
10,9,0.405915033782228
10,9.1,0.414325046337628
10,9.2,0.422613407252808
10,9.3,0.430773521036468
10,9.4,0.438816526165492
10,9.5,0.446714468841038
10,9.6,0.454484291004761
10,9.7,0.462109374753191
10,9.8,0.469601462839802
10,9.9,0.476948573043851
10,10,0.484156980981467
10,10.1,0.491224204810476
10,10.2,0.49815120252614
10,10.3,0.504933854754664
10,10.4,0.511581449041139
10,10.5,0.518093476637744
10,10.6,0.524465407087599
10,10.7,0.530703087522271
10,10.8,0.536803600554092
10,10.9,0.542779218212065
10,11,0.548622102494952
10,11.1,0.554337027674526
10,11.2,0.55993068009421
10,11.3,0.565393629981913
10,11.4,0.570741606057822
10,11.5,0.575973283514938
10,11.6,0.581075966651892
10,11.7,0.586079126113403
10,11.8,0.590961792062428
10,11.9,0.595732353696216
10,12,0.600402438450341
10,12.1,0.604965292515604
10,12.2,0.609422683842814
10,12.3,0.613778896518543
10,12.4,0.618031655552066
10,12.5,0.622198729495001
10,12.6,0.626265166690958
10,12.7,0.630241514082661
10,12.8,0.634126508760373
10,12.9,0.6379237985985
10,13,0.641636873062224
10,13.1,0.645264872562986
10,13.2,0.64880783598199
10,13.3,0.652272687474252
10,13.4,0.655660095757177
10,13.5,0.65897282459603
10,13.6,0.662208790513773
10,13.7,0.665371690182555
10,13.8,0.668460533450537
10,13.9,0.671483433302332
10,14,0.674437268693516
10,14.1,0.677324794133186
10,14.2,0.680147848151511
10,14.3,0.68290725728322
10,14.4,0.685606108073618
10,14.5,0.688244243922209
10,14.6,0.690820956632619
10,14.7,0.693341490014306
10,14.8,0.695803561090393
10,14.9,0.698214824485588
10,15,0.700569525890845
10,15.1,0.702874280337632
10,15.2,0.705126201290542
10,15.3,0.707326441871885
10,15.4,0.709479058491879
10,15.5,0.711584639724779
10,15.6,0.713641776869929
10,15.7,0.715656224964924
10,15.8,0.71762226529173
10,15.9,0.719543244728229
10,16,0.721422350903304
10,16.1,0.723262198297965
10,16.2,0.725059661201169
10,16.3,0.726816776870501
10,16.4,0.728534356083275
10,16.5,0.730215648632532
10,16.6,0.731856483213369
10,16.7,0.733462818411891
10,16.8,0.735032123722885
10,16.9,0.736567911677351
10,17,0.738067362976435
10,17.1,0.739531343466277
10,17.2,0.740964349449965
10,17.3,0.742364615595252
10,17.4,0.743733447971927
10,17.5,0.745072128740107
10,17.6,0.746378599264973
10,17.7,0.747656123752524
10,17.8,0.74890412026899
10,17.9,0.750122462790317
10,18,0.751313905444929
10,18.1,0.752476913802528
10,18.2,0.753613125634439
10,18.3,0.754722562581181
10,18.4,0.755806259899377
10,18.5,0.75686582549491
10,18.6,0.757897927487783
10,18.7,0.758906206885323
10,18.8,0.759889503253456
10,18.9,0.760849043178047
10,19,0.761785505589998
10,19.1,0.76270058195604
10,19.2,0.763592227877724
10,19.3,0.764461196482845
10,19.4,0.765308981935159
10,19.5,0.766133566115966
10,19.6,0.766938644490115
10,19.7,0.767722292074722
10,19.8,0.768486253519183
10,19.9,0.769230133266564
10,20,0.76995366655825
