[gd_scene load_steps=6 format=2]

[ext_resource path="res://Scripts/Components/Asteroid.gd" type="Script" id=1]
[ext_resource path="res://Assets/GFX/Sprites/Asteroid/Asteroid.png" type="Texture" id=2]

[sub_resource type="ParticlesMaterial" id=2]

render_priority = 0
trail_divisor = 1
emission_shape = 0
flag_align_y = false
flag_rotate_y = false
flag_disable_z = true
spread = 45.0
flatness = 0.0
gravity = Vector3( 0, 98, 0 )
initial_velocity = 1.0
initial_velocity_random = 0.0
angular_velocity = 9.29526e+18
angular_velocity_random = 0.0
orbit_velocity = 0.0
orbit_velocity_random = 0.0
linear_accel = 0.0
linear_accel_random = 0.0
radial_accel = 0.0
radial_accel_random = 0.0
tangential_accel = 0.0
tangential_accel_random = 0.0
damping = 0.0
damping_random = 0.0
angle = 0.0
angle_random = 0.0
scale = 1.0
scale_random = 0.0
color = Color( 1, 1, 1, 1 )
hue_variation = 0.0
hue_variation_random = 0.0
anim_speed = 0.0
anim_speed_random = 0.0
anim_offset = 0.0
anim_offset_random = 0.0
anim_loop = false

[sub_resource type="SpriteFrames" id=1]

animations = [ {
"frames": [ ExtResource( 2 ) ],
"loop": true,
"name": "default",
"speed": 5.0
} ]

[sub_resource type="ConcavePolygonShape2D" id=3]

custom_solver_bias = 0.0
segments = PoolVector2Array(  )

[node name="Asteroid" type="RigidBody2D"]

input_pickable = false
collision_layer = 1
collision_mask = 1
mode = 0
mass = 1.0
friction = 1.0
bounce = 0.0
gravity_scale = 1.0
custom_integrator = false
continuous_cd = 0
contacts_reported = 0
contact_monitor = false
sleeping = false
can_sleep = true
linear_velocity = Vector2( 0, 0 )
linear_damp = -1.0
angular_velocity = 0.0
angular_damp = -1.0
script = ExtResource( 1 )
speed = 100

[node name="Collision" type="CollisionPolygon2D" parent="."]

build_mode = 0
polygon = PoolVector2Array( -42.545, 27.0092, -3.4032, 39.6142, 43.6996, 30.9897, 62.2754, 11.0871, 63.6023, -5.49842, 57.6315, -22.0839, -7.38373, -39.9963, -38.5645, -30.7084, -61.1208, -4.17158 )

[node name="CollisionPolygon2D4" type="CollisionPolygon2D" parent="."]

build_mode = 0
polygon = PoolVector2Array( -12.085, 1.508, -18.085, -11.492, -14.085, -27.492, -0.0849915, -36.492, 19.915, -38.492, 28.915, -36.492, 37.915, -23.492, 39.915, -15.492, 35.915, -6.492, 24.915, 2.508, 0.915009, 3.508 )
disabled = true

[node name="CollisionPolygon2D5" type="CollisionPolygon2D" parent="."]

build_mode = 0
polygon = PoolVector2Array( -12.085, 1.508, -18.085, -11.492, -14.085, -27.492, -0.0849915, -36.492, 19.915, -38.492, 28.915, -36.492, 37.915, -23.492, 39.915, -15.492, 35.915, -6.492, 24.915, 2.508, 0.915009, 3.508 )
disabled = true

[node name="CollisionPolygon2D7" type="CollisionPolygon2D" parent="."]

build_mode = 0
polygon = PoolVector2Array( -12.085, 1.508, -18.085, -11.492, -14.085, -27.492, -0.0849915, -36.492, 19.915, -38.492, 28.915, -36.492, 37.915, -23.492, 39.915, -15.492, 35.915, -6.492, 24.915, 2.508, 0.915009, 3.508 )
disabled = true

[node name="CollisionPolygon2D8" type="CollisionPolygon2D" parent="."]

build_mode = 0
polygon = PoolVector2Array( -12.085, 1.508, -18.085, -11.492, -14.085, -27.492, -0.0849915, -36.492, 19.915, -38.492, 28.915, -36.492, 37.915, -23.492, 39.915, -15.492, 35.915, -6.492, 24.915, 2.508, 0.915009, 3.508 )
disabled = true

[node name="CollisionPolygon2D9" type="CollisionPolygon2D" parent="."]

build_mode = 0
polygon = PoolVector2Array( -12.085, 1.508, -18.085, -11.492, -14.085, -27.492, -0.0849915, -36.492, 19.915, -38.492, 28.915, -36.492, 37.915, -23.492, 39.915, -15.492, 35.915, -6.492, 24.915, 2.508, 0.915009, 3.508 )
disabled = true

[node name="CollisionPolygon2D10" type="CollisionPolygon2D" parent="."]

build_mode = 0
polygon = PoolVector2Array( -12.085, 1.508, -18.085, -11.492, -14.085, -27.492, -0.0849915, -36.492, 19.915, -38.492, 28.915, -36.492, 37.915, -23.492, 39.915, -15.492, 35.915, -6.492, 24.915, 2.508, 0.915009, 3.508 )
disabled = true

[node name="CollisionPolygon2D6" type="CollisionPolygon2D" parent="."]

build_mode = 0
polygon = PoolVector2Array( -12.085, 1.508, -18.085, -11.492, -14.085, -27.492, -0.0849915, -36.492, 19.915, -38.492, 28.915, -36.492, 37.915, -23.492, 39.915, -15.492, 35.915, -6.492, 24.915, 2.508, 0.915009, 3.508 )
disabled = true

[node name="CollisionPolygon2D3" type="CollisionPolygon2D" parent="."]

build_mode = 0
polygon = PoolVector2Array( -20.085, 25.508, -22.085, 16.508, -19.085, -8.492, -11.085, -22.492, 10.915, -28.492, 32.915, -25.492, 47.915, -17.492, 48.915, -1.492, 46.915, 11.508, 35.915, 23.508, 17.915, 28.508, 1.91501, 30.508, -3.08499, 30.508 )
disabled = true

[node name="CollisionPolygon2D2" type="CollisionPolygon2D" parent="."]

build_mode = 0
polygon = PoolVector2Array( -31.085, -3.492, -41.085, -29.492, -38.085, -49.492, -7.08499, -60.492, 31.915, -54.492, 50.915, -40.492, 57.915, -20.492, 93.915, 43.508, 93.915, 51.508, 74.915, 60.508, 33.915, 58.508, -17.085, 56.508, -39.085, 55.508, -43.085, 43.508, -45.085, 26.508, -35.085, 8.508 )
disabled = true

[node name="CollisionPolygon2D" type="CollisionPolygon2D" parent="."]

build_mode = 0
polygon = PoolVector2Array( -30.085, 26.508, -6.08499, -50.492, 63.915, -38.492, 60.915, 7.508, 26.915, 64.508, -9.08499, 57.508, -27.085, 37.508 )
disabled = true

[node name="Node" type="Node" parent="."]

[node name="Particles2D" type="Particles2D" parent="."]

emitting = false
amount = 40
lifetime = 1.0
one_shot = false
preprocess = 0.0
speed_scale = 1.0
explosiveness = 0.0
randomness = 0.0
fixed_fps = 0
fract_delta = true
visibility_rect = Rect2( -100, -100, 200, 200 )
local_coords = true
draw_order = 0
process_material = SubResource( 2 )
texture = null
normal_map = null
h_frames = 1
v_frames = 1
_sections_unfolded = [ "Material", "Process Material", "Time" ]

[node name="Sprite" type="AnimatedSprite" parent="."]

frames = SubResource( 1 )
animation = "default"

[node name="AudioStreamPlayer" type="AudioStreamPlayer" parent="."]

stream = null
volume_db = 0.0
autoplay = false
mix_target = 0
bus = "Master"

[node name="Timer" type="Timer" parent="."]

process_mode = 1
wait_time = 1.0
one_shot = false
autostart = false

[node name="CollisionShape2D" type="CollisionShape2D" parent="."]

position = Vector2( 3.09176, -1.90261 )
shape = SubResource( 3 )


