OpenGL ES 3.0 Renderer: GeForce GT 720M/PCIe/SSE2
GLES3: max ubo light: 409
GLES3: max ubo reflections: 455, ubo size: 144
ARVR: Registered interface: Native mobile
vertex uses function: hash
vertex uses function: rand_from_seed
**ERROR**: FATAL: Indexp_index=0 out of size (size()=0)
   At: core/vector.h:146:operator[]() - FATAL: Indexp_index=0 out of size (size()=0)
