; Engine configuration file.
; It's best edited using the editor UI and not directly,
; since the parameters that go here are not all obvious.
;
; Format:
;   [section] ; section goes between []
;   param=value ; assign values to parameters

config_version=3

[application]

config/name="RigidBenchmarkOMatic"
run/main_scene="res://Assets/Screens/Main.tscn"
config/icon="res://icon.png"

[display]

window/size/width=1366
window/size/height=768
window/size/resizable=false
window/stretch/mode="2d"

[gdnative]

singletons=[  ]

[physics]

2d/default_gravity=0

[rendering]

environment/default_environment="res://default_env.tres"
