float OUTPUT_SCALE = 16.17887;
float OUTPUT_OFFSET = -0.00186;
float INPUT_1_SCALE = 2.0;
float INPUT_1_OFFSET = -1.0;
float INPUT_2_SCALE = 0.15;
float INPUT_2_OFFSET = 0.023;
float INPUT_3_SCALE = 0.154;
float INPUT_3_OFFSET = 0.023;
