BASE MODEL TEST MAE = 0.023°
BASE MODEL MAX ERROR = 0.546°
QUANT MODEL TEST MAE = 0.104°
QUANT MODEL MAX ERROR = 1.951°
QUANT TF LITE TEST MAE = 0.106°
QUANT TF LITE MAX ERROR = 1.874°
TF LITE TEST MAE = 0.181°
TF LITE MAX ERROR = 1.874°
