(kicad_sch
	(version 20231120)
	(generator "eeschema")
	(generator_version "8.0")
	(uuid "5a44dcb9-4fc3-4263-b7ee-8bef38a9319f")
	(paper "A4")
	(lib_symbols
		(symbol "Connector_Generic:Conn_01x02"
			(pin_names
				(offset 1.016) hide)
			(exclude_from_sim no)
			(in_bom yes)
			(on_board yes)
			(property "Reference" "J"
				(at 0 2.54 0)
				(effects
					(font
						(size 1.27 1.27)
					)
				)
			)
			(property "Value" "Conn_01x02"
				(at 0 -5.08 0)
				(effects
					(font
						(size 1.27 1.27)
					)
				)
			)
			(property "Footprint" ""
				(at 0 0 0)
				(effects
					(font
						(size 1.27 1.27)
					)
					(hide yes)
				)
			)
			(property "Datasheet" "~"
				(at 0 0 0)
				(effects
					(font
						(size 1.27 1.27)
					)
					(hide yes)
				)
			)
			(property "Description" "Generic connector, single row, 01x02, script generated (kicad-library-utils/schlib/autogen/connector/)"
				(at 0 0 0)
				(effects
					(font
						(size 1.27 1.27)
					)
					(hide yes)
				)
			)
			(property "ki_keywords" "connector"
				(at 0 0 0)
				(effects
					(font
						(size 1.27 1.27)
					)
					(hide yes)
				)
			)
			(property "ki_fp_filters" "Connector*:*_1x??_*"
				(at 0 0 0)
				(effects
					(font
						(size 1.27 1.27)
					)
					(hide yes)
				)
			)
			(symbol "Conn_01x02_1_1"
				(rectangle
					(start -1.27 -2.413)
					(end 0 -2.667)
					(stroke
						(width 0.1524)
						(type default)
					)
					(fill
						(type none)
					)
				)
				(rectangle
					(start -1.27 0.127)
					(end 0 -0.127)
					(stroke
						(width 0.1524)
						(type default)
					)
					(fill
						(type none)
					)
				)
				(rectangle
					(start -1.27 1.27)
					(end 1.27 -3.81)
					(stroke
						(width 0.254)
						(type default)
					)
					(fill
						(type background)
					)
				)
				(pin passive line
					(at -5.08 0 0)
					(length 3.81)
					(name "Pin_1"
						(effects
							(font
								(size 1.27 1.27)
							)
						)
					)
					(number "1"
						(effects
							(font
								(size 1.27 1.27)
							)
						)
					)
				)
				(pin passive line
					(at -5.08 -2.54 0)
					(length 3.81)
					(name "Pin_2"
						(effects
							(font
								(size 1.27 1.27)
							)
						)
					)
					(number "2"
						(effects
							(font
								(size 1.27 1.27)
							)
						)
					)
				)
			)
		)
		(symbol "Connector_Generic:Conn_01x04"
			(pin_names
				(offset 1.016) hide)
			(exclude_from_sim no)
			(in_bom yes)
			(on_board yes)
			(property "Reference" "J"
				(at 0 5.08 0)
				(effects
					(font
						(size 1.27 1.27)
					)
				)
			)
			(property "Value" "Conn_01x04"
				(at 0 -7.62 0)
				(effects
					(font
						(size 1.27 1.27)
					)
				)
			)
			(property "Footprint" ""
				(at 0 0 0)
				(effects
					(font
						(size 1.27 1.27)
					)
					(hide yes)
				)
			)
			(property "Datasheet" "~"
				(at 0 0 0)
				(effects
					(font
						(size 1.27 1.27)
					)
					(hide yes)
				)
			)
			(property "Description" "Generic connector, single row, 01x04, script generated (kicad-library-utils/schlib/autogen/connector/)"
				(at 0 0 0)
				(effects
					(font
						(size 1.27 1.27)
					)
					(hide yes)
				)
			)
			(property "ki_keywords" "connector"
				(at 0 0 0)
				(effects
					(font
						(size 1.27 1.27)
					)
					(hide yes)
				)
			)
			(property "ki_fp_filters" "Connector*:*_1x??_*"
				(at 0 0 0)
				(effects
					(font
						(size 1.27 1.27)
					)
					(hide yes)
				)
			)
			(symbol "Conn_01x04_1_1"
				(rectangle
					(start -1.27 -4.953)
					(end 0 -5.207)
					(stroke
						(width 0.1524)
						(type default)
					)
					(fill
						(type none)
					)
				)
				(rectangle
					(start -1.27 -2.413)
					(end 0 -2.667)
					(stroke
						(width 0.1524)
						(type default)
					)
					(fill
						(type none)
					)
				)
				(rectangle
					(start -1.27 0.127)
					(end 0 -0.127)
					(stroke
						(width 0.1524)
						(type default)
					)
					(fill
						(type none)
					)
				)
				(rectangle
					(start -1.27 2.667)
					(end 0 2.413)
					(stroke
						(width 0.1524)
						(type default)
					)
					(fill
						(type none)
					)
				)
				(rectangle
					(start -1.27 3.81)
					(end 1.27 -6.35)
					(stroke
						(width 0.254)
						(type default)
					)
					(fill
						(type background)
					)
				)
				(pin passive line
					(at -5.08 2.54 0)
					(length 3.81)
					(name "Pin_1"
						(effects
							(font
								(size 1.27 1.27)
							)
						)
					)
					(number "1"
						(effects
							(font
								(size 1.27 1.27)
							)
						)
					)
				)
				(pin passive line
					(at -5.08 0 0)
					(length 3.81)
					(name "Pin_2"
						(effects
							(font
								(size 1.27 1.27)
							)
						)
					)
					(number "2"
						(effects
							(font
								(size 1.27 1.27)
							)
						)
					)
				)
				(pin passive line
					(at -5.08 -2.54 0)
					(length 3.81)
					(name "Pin_3"
						(effects
							(font
								(size 1.27 1.27)
							)
						)
					)
					(number "3"
						(effects
							(font
								(size 1.27 1.27)
							)
						)
					)
				)
				(pin passive line
					(at -5.08 -5.08 0)
					(length 3.81)
					(name "Pin_4"
						(effects
							(font
								(size 1.27 1.27)
							)
						)
					)
					(number "4"
						(effects
							(font
								(size 1.27 1.27)
							)
						)
					)
				)
			)
		)
		(symbol "Device:R"
			(pin_numbers hide)
			(pin_names
				(offset 0)
			)
			(exclude_from_sim no)
			(in_bom yes)
			(on_board yes)
			(property "Reference" "R"
				(at 2.032 0 90)
				(effects
					(font
						(size 1.27 1.27)
					)
				)
			)
			(property "Value" "R"
				(at 0 0 90)
				(effects
					(font
						(size 1.27 1.27)
					)
				)
			)
			(property "Footprint" ""
				(at -1.778 0 90)
				(effects
					(font
						(size 1.27 1.27)
					)
					(hide yes)
				)
			)
			(property "Datasheet" "~"
				(at 0 0 0)
				(effects
					(font
						(size 1.27 1.27)
					)
					(hide yes)
				)
			)
			(property "Description" "Resistor"
				(at 0 0 0)
				(effects
					(font
						(size 1.27 1.27)
					)
					(hide yes)
				)
			)
			(property "ki_keywords" "R res resistor"
				(at 0 0 0)
				(effects
					(font
						(size 1.27 1.27)
					)
					(hide yes)
				)
			)
			(property "ki_fp_filters" "R_*"
				(at 0 0 0)
				(effects
					(font
						(size 1.27 1.27)
					)
					(hide yes)
				)
			)
			(symbol "R_0_1"
				(rectangle
					(start -1.016 -2.54)
					(end 1.016 2.54)
					(stroke
						(width 0.254)
						(type default)
					)
					(fill
						(type none)
					)
				)
			)
			(symbol "R_1_1"
				(pin passive line
					(at 0 3.81 270)
					(length 1.27)
					(name "~"
						(effects
							(font
								(size 1.27 1.27)
							)
						)
					)
					(number "1"
						(effects
							(font
								(size 1.27 1.27)
							)
						)
					)
				)
				(pin passive line
					(at 0 -3.81 90)
					(length 1.27)
					(name "~"
						(effects
							(font
								(size 1.27 1.27)
							)
						)
					)
					(number "2"
						(effects
							(font
								(size 1.27 1.27)
							)
						)
					)
				)
			)
		)
		(symbol "RR0_parts_lib:TEENSY_4.1"
			(exclude_from_sim no)
			(in_bom yes)
			(on_board yes)
			(property "Reference" "IC"
				(at 49.53 7.62 0)
				(effects
					(font
						(size 1.27 1.27)
					)
					(justify left top)
				)
			)
			(property "Value" "TEENSY_4.1"
				(at 49.53 5.08 0)
				(effects
					(font
						(size 1.27 1.27)
					)
					(justify left top)
				)
			)
			(property "Footprint" "TEENSY41"
				(at 49.53 -94.92 0)
				(effects
					(font
						(size 1.27 1.27)
					)
					(justify left top)
					(hide yes)
				)
			)
			(property "Datasheet" "https://www.pjrc.com/store/teensy41.html"
				(at 49.53 -194.92 0)
				(effects
					(font
						(size 1.27 1.27)
					)
					(justify left top)
					(hide yes)
				)
			)
			(property "Description" "Teensy 4.1 Development Board"
				(at 0 0 0)
				(effects
					(font
						(size 1.27 1.27)
					)
					(hide yes)
				)
			)
			(property "Height" ""
				(at 49.53 -394.92 0)
				(effects
					(font
						(size 1.27 1.27)
					)
					(justify left top)
					(hide yes)
				)
			)
			(property "Manufacturer_Name" "PJRC"
				(at 49.53 -494.92 0)
				(effects
					(font
						(size 1.27 1.27)
					)
					(justify left top)
					(hide yes)
				)
			)
			(property "Manufacturer_Part_Number" "TEENSY 4.1"
				(at 49.53 -594.92 0)
				(effects
					(font
						(size 1.27 1.27)
					)
					(justify left top)
					(hide yes)
				)
			)
			(property "Mouser Part Number" ""
				(at 49.53 -694.92 0)
				(effects
					(font
						(size 1.27 1.27)
					)
					(justify left top)
					(hide yes)
				)
			)
			(property "Mouser Price/Stock" ""
				(at 49.53 -794.92 0)
				(effects
					(font
						(size 1.27 1.27)
					)
					(justify left top)
					(hide yes)
				)
			)
			(property "Arrow Part Number" ""
				(at 49.53 -894.92 0)
				(effects
					(font
						(size 1.27 1.27)
					)
					(justify left top)
					(hide yes)
				)
			)
			(property "Arrow Price/Stock" ""
				(at 49.53 -994.92 0)
				(effects
					(font
						(size 1.27 1.27)
					)
					(justify left top)
					(hide yes)
				)
			)
			(symbol "TEENSY_4.1_1_1"
				(rectangle
					(start 5.08 2.54)
					(end 48.26 -76.2)
					(stroke
						(width 0.254)
						(type default)
					)
					(fill
						(type background)
					)
				)
				(pin passive line
					(at 0 0 0)
					(length 5.08)
					(name "TX1"
						(effects
							(font
								(size 1.27 1.27)
							)
						)
					)
					(number "1"
						(effects
							(font
								(size 1.27 1.27)
							)
						)
					)
				)
				(pin passive line
					(at 0 -22.86 0)
					(length 5.08)
					(name "CS_1"
						(effects
							(font
								(size 1.27 1.27)
							)
						)
					)
					(number "10"
						(effects
							(font
								(size 1.27 1.27)
							)
						)
					)
				)
				(pin passive line
					(at 0 -25.4 0)
					(length 5.08)
					(name "MOSI"
						(effects
							(font
								(size 1.27 1.27)
							)
						)
					)
					(number "11"
						(effects
							(font
								(size 1.27 1.27)
							)
						)
					)
				)
				(pin passive line
					(at 0 -27.94 0)
					(length 5.08)
					(name "MISO"
						(effects
							(font
								(size 1.27 1.27)
							)
						)
					)
					(number "12"
						(effects
							(font
								(size 1.27 1.27)
							)
						)
					)
				)
				(pin passive line
					(at 0 -30.48 0)
					(length 5.08)
					(name "SCK"
						(effects
							(font
								(size 1.27 1.27)
							)
						)
					)
					(number "13"
						(effects
							(font
								(size 1.27 1.27)
							)
						)
					)
				)
				(pin passive line
					(at 0 -33.02 0)
					(length 5.08)
					(name "A0"
						(effects
							(font
								(size 1.27 1.27)
							)
						)
					)
					(number "14"
						(effects
							(font
								(size 1.27 1.27)
							)
						)
					)
				)
				(pin passive line
					(at 0 -35.56 0)
					(length 5.08)
					(name "A1"
						(effects
							(font
								(size 1.27 1.27)
							)
						)
					)
					(number "15"
						(effects
							(font
								(size 1.27 1.27)
							)
						)
					)
				)
				(pin passive line
					(at 0 -38.1 0)
					(length 5.08)
					(name "A2"
						(effects
							(font
								(size 1.27 1.27)
							)
						)
					)
					(number "16"
						(effects
							(font
								(size 1.27 1.27)
							)
						)
					)
				)
				(pin passive line
					(at 0 -40.64 0)
					(length 5.08)
					(name "A3"
						(effects
							(font
								(size 1.27 1.27)
							)
						)
					)
					(number "17"
						(effects
							(font
								(size 1.27 1.27)
							)
						)
					)
				)
				(pin passive line
					(at 0 -43.18 0)
					(length 5.08)
					(name "A4"
						(effects
							(font
								(size 1.27 1.27)
							)
						)
					)
					(number "18"
						(effects
							(font
								(size 1.27 1.27)
							)
						)
					)
				)
				(pin passive line
					(at 0 -45.72 0)
					(length 5.08)
					(name "A5"
						(effects
							(font
								(size 1.27 1.27)
							)
						)
					)
					(number "19"
						(effects
							(font
								(size 1.27 1.27)
							)
						)
					)
				)
				(pin passive line
					(at 0 -2.54 0)
					(length 5.08)
					(name "OUT2"
						(effects
							(font
								(size 1.27 1.27)
							)
						)
					)
					(number "2"
						(effects
							(font
								(size 1.27 1.27)
							)
						)
					)
				)
				(pin passive line
					(at 0 -48.26 0)
					(length 5.08)
					(name "A6"
						(effects
							(font
								(size 1.27 1.27)
							)
						)
					)
					(number "20"
						(effects
							(font
								(size 1.27 1.27)
							)
						)
					)
				)
				(pin passive line
					(at 0 -50.8 0)
					(length 5.08)
					(name "A7"
						(effects
							(font
								(size 1.27 1.27)
							)
						)
					)
					(number "21"
						(effects
							(font
								(size 1.27 1.27)
							)
						)
					)
				)
				(pin passive line
					(at 0 -53.34 0)
					(length 5.08)
					(name "A8"
						(effects
							(font
								(size 1.27 1.27)
							)
						)
					)
					(number "22"
						(effects
							(font
								(size 1.27 1.27)
							)
						)
					)
				)
				(pin passive line
					(at 0 -55.88 0)
					(length 5.08)
					(name "A9"
						(effects
							(font
								(size 1.27 1.27)
							)
						)
					)
					(number "23"
						(effects
							(font
								(size 1.27 1.27)
							)
						)
					)
				)
				(pin passive line
					(at 0 -58.42 0)
					(length 5.08)
					(name "A10"
						(effects
							(font
								(size 1.27 1.27)
							)
						)
					)
					(number "24"
						(effects
							(font
								(size 1.27 1.27)
							)
						)
					)
				)
				(pin passive line
					(at 0 -60.96 0)
					(length 5.08)
					(name "A11"
						(effects
							(font
								(size 1.27 1.27)
							)
						)
					)
					(number "25"
						(effects
							(font
								(size 1.27 1.27)
							)
						)
					)
				)
				(pin passive line
					(at 0 -63.5 0)
					(length 5.08)
					(name "A12"
						(effects
							(font
								(size 1.27 1.27)
							)
						)
					)
					(number "26"
						(effects
							(font
								(size 1.27 1.27)
							)
						)
					)
				)
				(pin passive line
					(at 0 -66.04 0)
					(length 5.08)
					(name "A13"
						(effects
							(font
								(size 1.27 1.27)
							)
						)
					)
					(number "27"
						(effects
							(font
								(size 1.27 1.27)
							)
						)
					)
				)
				(pin passive line
					(at 0 -68.58 0)
					(length 5.08)
					(name "RX7"
						(effects
							(font
								(size 1.27 1.27)
							)
						)
					)
					(number "28"
						(effects
							(font
								(size 1.27 1.27)
							)
						)
					)
				)
				(pin passive line
					(at 0 -71.12 0)
					(length 5.08)
					(name "TX7"
						(effects
							(font
								(size 1.27 1.27)
							)
						)
					)
					(number "29"
						(effects
							(font
								(size 1.27 1.27)
							)
						)
					)
				)
				(pin passive line
					(at 0 -5.08 0)
					(length 5.08)
					(name "LRCLK2"
						(effects
							(font
								(size 1.27 1.27)
							)
						)
					)
					(number "3"
						(effects
							(font
								(size 1.27 1.27)
							)
						)
					)
				)
				(pin passive line
					(at 0 -73.66 0)
					(length 5.08)
					(name "CRX3"
						(effects
							(font
								(size 1.27 1.27)
							)
						)
					)
					(number "30"
						(effects
							(font
								(size 1.27 1.27)
							)
						)
					)
				)
				(pin passive line
					(at 53.34 0 180)
					(length 5.08)
					(name "CTX3"
						(effects
							(font
								(size 1.27 1.27)
							)
						)
					)
					(number "31"
						(effects
							(font
								(size 1.27 1.27)
							)
						)
					)
				)
				(pin passive line
					(at 53.34 -2.54 180)
					(length 5.08)
					(name "OUT1B"
						(effects
							(font
								(size 1.27 1.27)
							)
						)
					)
					(number "32"
						(effects
							(font
								(size 1.27 1.27)
							)
						)
					)
				)
				(pin passive line
					(at 53.34 -5.08 180)
					(length 5.08)
					(name "MCLK2"
						(effects
							(font
								(size 1.27 1.27)
							)
						)
					)
					(number "33"
						(effects
							(font
								(size 1.27 1.27)
							)
						)
					)
				)
				(pin passive line
					(at 53.34 -7.62 180)
					(length 5.08)
					(name "RX8"
						(effects
							(font
								(size 1.27 1.27)
							)
						)
					)
					(number "34"
						(effects
							(font
								(size 1.27 1.27)
							)
						)
					)
				)
				(pin passive line
					(at 53.34 -10.16 180)
					(length 5.08)
					(name "TX8"
						(effects
							(font
								(size 1.27 1.27)
							)
						)
					)
					(number "35"
						(effects
							(font
								(size 1.27 1.27)
							)
						)
					)
				)
				(pin passive line
					(at 53.34 -12.7 180)
					(length 5.08)
					(name "CS_2"
						(effects
							(font
								(size 1.27 1.27)
							)
						)
					)
					(number "36"
						(effects
							(font
								(size 1.27 1.27)
							)
						)
					)
				)
				(pin passive line
					(at 53.34 -15.24 180)
					(length 5.08)
					(name "CS_3"
						(effects
							(font
								(size 1.27 1.27)
							)
						)
					)
					(number "37"
						(effects
							(font
								(size 1.27 1.27)
							)
						)
					)
				)
				(pin passive line
					(at 53.34 -17.78 180)
					(length 5.08)
					(name "A14"
						(effects
							(font
								(size 1.27 1.27)
							)
						)
					)
					(number "38"
						(effects
							(font
								(size 1.27 1.27)
							)
						)
					)
				)
				(pin passive line
					(at 53.34 -20.32 180)
					(length 5.08)
					(name "A15"
						(effects
							(font
								(size 1.27 1.27)
							)
						)
					)
					(number "39"
						(effects
							(font
								(size 1.27 1.27)
							)
						)
					)
				)
				(pin passive line
					(at 0 -7.62 0)
					(length 5.08)
					(name "BCLK2"
						(effects
							(font
								(size 1.27 1.27)
							)
						)
					)
					(number "4"
						(effects
							(font
								(size 1.27 1.27)
							)
						)
					)
				)
				(pin passive line
					(at 53.34 -22.86 180)
					(length 5.08)
					(name "A16"
						(effects
							(font
								(size 1.27 1.27)
							)
						)
					)
					(number "40"
						(effects
							(font
								(size 1.27 1.27)
							)
						)
					)
				)
				(pin passive line
					(at 53.34 -25.4 180)
					(length 5.08)
					(name "A17"
						(effects
							(font
								(size 1.27 1.27)
							)
						)
					)
					(number "41"
						(effects
							(font
								(size 1.27 1.27)
							)
						)
					)
				)
				(pin passive line
					(at 53.34 -27.94 180)
					(length 5.08)
					(name "3.3V_1"
						(effects
							(font
								(size 1.27 1.27)
							)
						)
					)
					(number "42"
						(effects
							(font
								(size 1.27 1.27)
							)
						)
					)
				)
				(pin passive line
					(at 53.34 -30.48 180)
					(length 5.08)
					(name "VBAT"
						(effects
							(font
								(size 1.27 1.27)
							)
						)
					)
					(number "43"
						(effects
							(font
								(size 1.27 1.27)
							)
						)
					)
				)
				(pin passive line
					(at 53.34 -33.02 180)
					(length 5.08)
					(name "3.3V_2"
						(effects
							(font
								(size 1.27 1.27)
							)
						)
					)
					(number "44"
						(effects
							(font
								(size 1.27 1.27)
							)
						)
					)
				)
				(pin passive line
					(at 53.34 -35.56 180)
					(length 5.08)
					(name "GND_1"
						(effects
							(font
								(size 1.27 1.27)
							)
						)
					)
					(number "45"
						(effects
							(font
								(size 1.27 1.27)
							)
						)
					)
				)
				(pin passive line
					(at 53.34 -38.1 180)
					(length 5.08)
					(name "PROGRAM"
						(effects
							(font
								(size 1.27 1.27)
							)
						)
					)
					(number "46"
						(effects
							(font
								(size 1.27 1.27)
							)
						)
					)
				)
				(pin passive line
					(at 53.34 -40.64 180)
					(length 5.08)
					(name "ON/OFF"
						(effects
							(font
								(size 1.27 1.27)
							)
						)
					)
					(number "47"
						(effects
							(font
								(size 1.27 1.27)
							)
						)
					)
				)
				(pin passive line
					(at 53.34 -43.18 180)
					(length 5.08)
					(name "GND_2"
						(effects
							(font
								(size 1.27 1.27)
							)
						)
					)
					(number "48"
						(effects
							(font
								(size 1.27 1.27)
							)
						)
					)
				)
				(pin passive line
					(at 53.34 -45.72 180)
					(length 5.08)
					(name "GND_3"
						(effects
							(font
								(size 1.27 1.27)
							)
						)
					)
					(number "49"
						(effects
							(font
								(size 1.27 1.27)
							)
						)
					)
				)
				(pin passive line
					(at 0 -10.16 0)
					(length 5.08)
					(name "IN2"
						(effects
							(font
								(size 1.27 1.27)
							)
						)
					)
					(number "5"
						(effects
							(font
								(size 1.27 1.27)
							)
						)
					)
				)
				(pin passive line
					(at 53.34 -48.26 180)
					(length 5.08)
					(name "D+"
						(effects
							(font
								(size 1.27 1.27)
							)
						)
					)
					(number "50"
						(effects
							(font
								(size 1.27 1.27)
							)
						)
					)
				)
				(pin passive line
					(at 53.34 -50.8 180)
					(length 5.08)
					(name "D-"
						(effects
							(font
								(size 1.27 1.27)
							)
						)
					)
					(number "51"
						(effects
							(font
								(size 1.27 1.27)
							)
						)
					)
				)
				(pin passive line
					(at 53.34 -53.34 180)
					(length 5.08)
					(name "+5V"
						(effects
							(font
								(size 1.27 1.27)
							)
						)
					)
					(number "52"
						(effects
							(font
								(size 1.27 1.27)
							)
						)
					)
				)
				(pin passive line
					(at 53.34 -55.88 180)
					(length 5.08)
					(name "3.3V_(250_M_A_MAX)"
						(effects
							(font
								(size 1.27 1.27)
							)
						)
					)
					(number "53"
						(effects
							(font
								(size 1.27 1.27)
							)
						)
					)
				)
				(pin passive line
					(at 53.34 -58.42 180)
					(length 5.08)
					(name "VIN_(3.6_TO_5.5_VOLTS)"
						(effects
							(font
								(size 1.27 1.27)
							)
						)
					)
					(number "55"
						(effects
							(font
								(size 1.27 1.27)
							)
						)
					)
				)
				(pin passive line
					(at 53.34 -60.96 180)
					(length 5.08)
					(name "RX1"
						(effects
							(font
								(size 1.27 1.27)
							)
						)
					)
					(number "57"
						(effects
							(font
								(size 1.27 1.27)
							)
						)
					)
				)
				(pin passive line
					(at 0 -12.7 0)
					(length 5.08)
					(name "OUT1D"
						(effects
							(font
								(size 1.27 1.27)
							)
						)
					)
					(number "6"
						(effects
							(font
								(size 1.27 1.27)
							)
						)
					)
				)
				(pin passive line
					(at 53.34 -63.5 180)
					(length 5.08)
					(name "VUSB"
						(effects
							(font
								(size 1.27 1.27)
							)
						)
					)
					(number "68"
						(effects
							(font
								(size 1.27 1.27)
							)
						)
					)
				)
				(pin passive line
					(at 53.34 -66.04 180)
					(length 5.08)
					(name "GND_4"
						(effects
							(font
								(size 1.27 1.27)
							)
						)
					)
					(number "69"
						(effects
							(font
								(size 1.27 1.27)
							)
						)
					)
				)
				(pin passive line
					(at 0 -15.24 0)
					(length 5.08)
					(name "RX2"
						(effects
							(font
								(size 1.27 1.27)
							)
						)
					)
					(number "7"
						(effects
							(font
								(size 1.27 1.27)
							)
						)
					)
				)
				(pin passive line
					(at 53.34 -68.58 180)
					(length 5.08)
					(name "GND_5"
						(effects
							(font
								(size 1.27 1.27)
							)
						)
					)
					(number "70"
						(effects
							(font
								(size 1.27 1.27)
							)
						)
					)
				)
				(pin passive line
					(at 53.34 -71.12 180)
					(length 5.08)
					(name "GND_6"
						(effects
							(font
								(size 1.27 1.27)
							)
						)
					)
					(number "71"
						(effects
							(font
								(size 1.27 1.27)
							)
						)
					)
				)
				(pin passive line
					(at 0 -17.78 0)
					(length 5.08)
					(name "TX2"
						(effects
							(font
								(size 1.27 1.27)
							)
						)
					)
					(number "8"
						(effects
							(font
								(size 1.27 1.27)
							)
						)
					)
				)
				(pin passive line
					(at 0 -20.32 0)
					(length 5.08)
					(name "OUT1C"
						(effects
							(font
								(size 1.27 1.27)
							)
						)
					)
					(number "9"
						(effects
							(font
								(size 1.27 1.27)
							)
						)
					)
				)
			)
		)
		(symbol "Simulation_SPICE:0"
			(power)
			(pin_numbers hide)
			(pin_names
				(offset 0) hide)
			(exclude_from_sim no)
			(in_bom yes)
			(on_board yes)
			(property "Reference" "#GND"
				(at 0 -5.08 0)
				(effects
					(font
						(size 1.27 1.27)
					)
					(hide yes)
				)
			)
			(property "Value" "0"
				(at 0 -2.54 0)
				(effects
					(font
						(size 1.27 1.27)
					)
				)
			)
			(property "Footprint" ""
				(at 0 0 0)
				(effects
					(font
						(size 1.27 1.27)
					)
					(hide yes)
				)
			)
			(property "Datasheet" "https://ngspice.sourceforge.io/docs/ngspice-html-manual/manual.xhtml#subsec_Circuit_elements__device"
				(at 0 -10.16 0)
				(effects
					(font
						(size 1.27 1.27)
					)
					(hide yes)
				)
			)
			(property "Description" "0V reference potential for simulation"
				(at 0 -7.62 0)
				(effects
					(font
						(size 1.27 1.27)
					)
					(hide yes)
				)
			)
			(property "ki_keywords" "simulation"
				(at 0 0 0)
				(effects
					(font
						(size 1.27 1.27)
					)
					(hide yes)
				)
			)
			(symbol "0_0_1"
				(polyline
					(pts
						(xy -1.27 0) (xy 0 -1.27) (xy 1.27 0) (xy -1.27 0)
					)
					(stroke
						(width 0)
						(type default)
					)
					(fill
						(type none)
					)
				)
			)
			(symbol "0_1_1"
				(pin power_in line
					(at 0 0 0)
					(length 0)
					(name "~"
						(effects
							(font
								(size 1.016 1.016)
							)
						)
					)
					(number "1"
						(effects
							(font
								(size 1.016 1.016)
							)
						)
					)
				)
			)
		)
	)
	(junction
		(at 101.6 96.52)
		(diameter 0)
		(color 0 0 0 0)
		(uuid "3cef44ad-e805-4729-8b13-e74517e40db2")
	)
	(junction
		(at 210.82 124.46)
		(diameter 0)
		(color 0 0 0 0)
		(uuid "52738ec7-9019-431e-a553-e14dca10f145")
	)
	(junction
		(at 210.82 127)
		(diameter 0)
		(color 0 0 0 0)
		(uuid "7047b5dc-0843-4fd4-9539-2803674c3263")
	)
	(junction
		(at 87.63 99.06)
		(diameter 0)
		(color 0 0 0 0)
		(uuid "7f4beca9-4b8a-4062-9943-59d480f3f56c")
	)
	(junction
		(at 210.82 101.6)
		(diameter 0)
		(color 0 0 0 0)
		(uuid "82db70e6-0de7-46ab-919a-ebbd87029a28")
	)
	(junction
		(at 73.66 101.6)
		(diameter 0)
		(color 0 0 0 0)
		(uuid "9db5c8af-51d0-43f2-8cbb-69ee43be257e")
	)
	(junction
		(at 210.82 129.54)
		(diameter 0)
		(color 0 0 0 0)
		(uuid "a2a29345-f760-47ac-915f-55f0bebafac4")
	)
	(junction
		(at 210.82 104.14)
		(diameter 0)
		(color 0 0 0 0)
		(uuid "b55cc24b-74f7-4273-811a-1e1fd6ab24f1")
	)
	(junction
		(at 74.93 119.38)
		(diameter 0)
		(color 0 0 0 0)
		(uuid "c5435a64-a46f-4bc4-b2c1-6a3ecfb808f2")
	)
	(junction
		(at 95.25 116.84)
		(diameter 0)
		(color 0 0 0 0)
		(uuid "ca950a54-a24c-4368-9131-33a6664b46c9")
	)
	(junction
		(at 57.15 104.14)
		(diameter 0)
		(color 0 0 0 0)
		(uuid "e9db6416-49c6-4b1b-8de1-8ec24ec2b306")
	)
	(wire
		(pts
			(xy 74.93 110.49) (xy 74.93 111.76)
		)
		(stroke
			(width 0)
			(type default)
		)
		(uuid "13e134d5-d2ef-444d-b119-a028abfa1a8e")
	)
	(wire
		(pts
			(xy 57.15 104.14) (xy 111.76 104.14)
		)
		(stroke
			(width 0)
			(type default)
		)
		(uuid "2589bcb2-0a51-4b8a-bb7a-6252d1a76099")
	)
	(wire
		(pts
			(xy 57.15 96.52) (xy 57.15 104.14)
		)
		(stroke
			(width 0)
			(type default)
		)
		(uuid "2ccca56a-4d2b-437c-a1fd-b61f349f13dd")
	)
	(wire
		(pts
			(xy 43.18 40.64) (xy 43.18 36.83)
		)
		(stroke
			(width 0)
			(type default)
		)
		(uuid "351747a3-373e-4ca4-bb98-a3cc60536a07")
	)
	(wire
		(pts
			(xy 88.9 116.84) (xy 95.25 116.84)
		)
		(stroke
			(width 0)
			(type default)
		)
		(uuid "3a7e34a9-296d-4493-9702-db8990cf5c70")
	)
	(wire
		(pts
			(xy 45.72 36.83) (xy 45.72 40.64)
		)
		(stroke
			(width 0)
			(type default)
		)
		(uuid "418bc9bb-a8e1-4a45-95bf-f07dc971762b")
	)
	(wire
		(pts
			(xy 68.58 119.38) (xy 74.93 119.38)
		)
		(stroke
			(width 0)
			(type default)
		)
		(uuid "4963bf4e-8240-49be-9f8d-c9d3dde690fb")
	)
	(wire
		(pts
			(xy 95.25 116.84) (xy 111.76 116.84)
		)
		(stroke
			(width 0)
			(type default)
		)
		(uuid "50590ccb-a539-47f5-918f-633051425f58")
	)
	(wire
		(pts
			(xy 87.63 91.44) (xy 87.63 99.06)
		)
		(stroke
			(width 0)
			(type default)
		)
		(uuid "60fc6ae3-7352-4586-a4f7-f219a77fc65e")
	)
	(wire
		(pts
			(xy 95.25 107.95) (xy 95.25 109.22)
		)
		(stroke
			(width 0)
			(type default)
		)
		(uuid "6547aedc-bb12-4254-944c-f80abf9c188b")
	)
	(wire
		(pts
			(xy 87.63 36.83) (xy 87.63 40.64)
		)
		(stroke
			(width 0)
			(type default)
		)
		(uuid "6d90301e-7030-4eaa-a7da-dc284bb5faf8")
	)
	(wire
		(pts
			(xy 186.69 104.14) (xy 210.82 104.14)
		)
		(stroke
			(width 0)
			(type default)
		)
		(uuid "6daaeab1-60cf-46bd-8f49-d24332eb419d")
	)
	(wire
		(pts
			(xy 186.69 127) (xy 210.82 127)
		)
		(stroke
			(width 0)
			(type default)
		)
		(uuid "72d0cd09-d7e9-4d78-a9f0-64495e6f90a3")
	)
	(wire
		(pts
			(xy 186.69 129.54) (xy 210.82 129.54)
		)
		(stroke
			(width 0)
			(type default)
		)
		(uuid "72fcca4f-8b1c-4faa-b57b-917c3f215d14")
	)
	(wire
		(pts
			(xy 50.8 104.14) (xy 57.15 104.14)
		)
		(stroke
			(width 0)
			(type default)
		)
		(uuid "769a26c8-ea7f-46ef-aea5-b2d45bb58904")
	)
	(wire
		(pts
			(xy 210.82 104.14) (xy 210.82 124.46)
		)
		(stroke
			(width 0)
			(type default)
		)
		(uuid "7a61f6c2-2d6e-4855-8990-35026c80daa5")
	)
	(wire
		(pts
			(xy 95.25 96.52) (xy 101.6 96.52)
		)
		(stroke
			(width 0)
			(type default)
		)
		(uuid "7aaa0cba-f409-44c4-ac4a-018c9e29d495")
	)
	(wire
		(pts
			(xy 210.82 124.46) (xy 210.82 127)
		)
		(stroke
			(width 0)
			(type default)
		)
		(uuid "814f5ac0-8765-4ab1-8907-70d6bc9309ca")
	)
	(wire
		(pts
			(xy 101.6 74.93) (xy 101.6 82.55)
		)
		(stroke
			(width 0)
			(type default)
		)
		(uuid "90a06444-66a5-4d3d-8cfc-ad1a35d7e9c1")
	)
	(wire
		(pts
			(xy 186.69 93.98) (xy 210.82 93.98)
		)
		(stroke
			(width 0)
			(type default)
		)
		(uuid "912f4709-3c84-45f8-bee3-d6d9079ed5eb")
	)
	(wire
		(pts
			(xy 186.69 101.6) (xy 210.82 101.6)
		)
		(stroke
			(width 0)
			(type default)
		)
		(uuid "917f4aa1-6ea7-403f-916e-eaefcf75b85d")
	)
	(wire
		(pts
			(xy 48.26 40.64) (xy 48.26 36.83)
		)
		(stroke
			(width 0)
			(type default)
		)
		(uuid "96bb55f4-2a00-431f-a2e1-9f5a7f132d36")
	)
	(wire
		(pts
			(xy 210.82 93.98) (xy 210.82 101.6)
		)
		(stroke
			(width 0)
			(type default)
		)
		(uuid "97e3bffa-d19f-4e1c-92ac-36bbf6ab46c1")
	)
	(wire
		(pts
			(xy 101.6 90.17) (xy 101.6 96.52)
		)
		(stroke
			(width 0)
			(type default)
		)
		(uuid "a7b3a4bd-843d-4069-a2ef-0024033bb108")
	)
	(wire
		(pts
			(xy 231.14 36.83) (xy 231.14 43.18)
		)
		(stroke
			(width 0)
			(type default)
		)
		(uuid "ab698024-7de5-4b5d-9816-8d95f3af36a5")
	)
	(wire
		(pts
			(xy 64.77 101.6) (xy 73.66 101.6)
		)
		(stroke
			(width 0)
			(type default)
		)
		(uuid "af9a3e64-e105-416d-bc1f-822e465386d9")
	)
	(wire
		(pts
			(xy 111.76 101.6) (xy 73.66 101.6)
		)
		(stroke
			(width 0)
			(type default)
		)
		(uuid "b1c0094f-0e15-4f38-9bdd-9b40769630ae")
	)
	(wire
		(pts
			(xy 87.63 77.47) (xy 87.63 83.82)
		)
		(stroke
			(width 0)
			(type default)
		)
		(uuid "bda3b478-ee0d-466d-a8d1-a85aa18195d6")
	)
	(wire
		(pts
			(xy 210.82 101.6) (xy 210.82 104.14)
		)
		(stroke
			(width 0)
			(type default)
		)
		(uuid "bdc5ad3d-5468-4ccf-ad59-39b0e954e092")
	)
	(wire
		(pts
			(xy 186.69 124.46) (xy 210.82 124.46)
		)
		(stroke
			(width 0)
			(type default)
		)
		(uuid "c321be2a-7a30-497d-b6de-d64a9c7ce597")
	)
	(wire
		(pts
			(xy 101.6 96.52) (xy 111.76 96.52)
		)
		(stroke
			(width 0)
			(type default)
		)
		(uuid "d5926dad-d943-4afb-992a-0f07be7aaabf")
	)
	(wire
		(pts
			(xy 73.66 82.55) (xy 73.66 88.9)
		)
		(stroke
			(width 0)
			(type default)
		)
		(uuid "d7f8a879-cd58-449f-bcee-b2a76f6d607b")
	)
	(wire
		(pts
			(xy 74.93 119.38) (xy 111.76 119.38)
		)
		(stroke
			(width 0)
			(type default)
		)
		(uuid "deada91b-cf0b-4456-b9c6-24e304850819")
	)
	(wire
		(pts
			(xy 81.28 99.06) (xy 87.63 99.06)
		)
		(stroke
			(width 0)
			(type default)
		)
		(uuid "e00e7fa3-20b5-400a-81d8-6dd743e0dcc2")
	)
	(wire
		(pts
			(xy 57.15 85.09) (xy 57.15 88.9)
		)
		(stroke
			(width 0)
			(type default)
		)
		(uuid "e49e1de1-2b80-48f2-ad54-13225a383f06")
	)
	(wire
		(pts
			(xy 87.63 99.06) (xy 111.76 99.06)
		)
		(stroke
			(width 0)
			(type default)
		)
		(uuid "e551028a-dce8-49e9-b66e-5e2362437f19")
	)
	(wire
		(pts
			(xy 210.82 127) (xy 210.82 129.54)
		)
		(stroke
			(width 0)
			(type default)
		)
		(uuid "ec9b8c47-451a-41a3-a9fc-eb6c22ffc863")
	)
	(wire
		(pts
			(xy 210.82 129.54) (xy 210.82 134.62)
		)
		(stroke
			(width 0)
			(type default)
		)
		(uuid "f853eeee-14da-471a-88d4-6531f7c4e9b8")
	)
	(wire
		(pts
			(xy 73.66 96.52) (xy 73.66 101.6)
		)
		(stroke
			(width 0)
			(type default)
		)
		(uuid "fa3301a0-f97a-4450-8997-b9633565b8dd")
	)
	(wire
		(pts
			(xy 67.31 36.83) (xy 67.31 40.64)
		)
		(stroke
			(width 0)
			(type default)
		)
		(uuid "fe516927-e8fe-44e2-9dc8-f21bc145d29f")
	)
	(label "A5"
		(at 133.35 104.14 180)
		(fields_autoplaced yes)
		(effects
			(font
				(size 1.27 1.27)
			)
			(justify right bottom)
		)
		(uuid "04e0e5ba-0428-4581-8460-31498f261559")
	)
	(label "CRX3"
		(at 133.35 132.08 180)
		(fields_autoplaced yes)
		(effects
			(font
				(size 1.27 1.27)
			)
			(justify right bottom)
		)
		(uuid "0ab43435-de91-4b10-b569-15652a32e05c")
	)
	(label "A6"
		(at 133.35 106.68 180)
		(fields_autoplaced yes)
		(effects
			(font
				(size 1.27 1.27)
			)
			(justify right bottom)
		)
		(uuid "0b00ff37-27e2-4b73-9a08-1a6083e04077")
	)
	(label "A16"
		(at 186.69 81.28 0)
		(fields_autoplaced yes)
		(effects
			(font
				(size 1.27 1.27)
			)
			(justify left bottom)
		)
		(uuid "100afbb2-78ae-46ff-b55d-3ec624f4a5ac")
	)
	(label "GND_6"
		(at 210.82 129.54 0)
		(fields_autoplaced yes)
		(effects
			(font
				(size 1.27 1.27)
			)
			(justify left bottom)
		)
		(uuid "14af3d02-442e-4267-97c0-03de50a56e1b")
	)
	(label "A5"
		(at 111.76 104.14 180)
		(fields_autoplaced yes)
		(effects
			(font
				(size 1.27 1.27)
			)
			(justify right bottom)
		)
		(uuid "151e4d68-b79c-46a4-982c-93b92bd0532b")
	)
	(label "SCK"
		(at 133.35 88.9 180)
		(fields_autoplaced yes)
		(effects
			(font
				(size 1.27 1.27)
			)
			(justify right bottom)
		)
		(uuid "15c5d78b-04b0-4f37-8a69-0c513399899c")
	)
	(label "SDA1"
		(at 81.28 99.06 90)
		(fields_autoplaced yes)
		(effects
			(font
				(size 1.27 1.27)
			)
			(justify left bottom)
		)
		(uuid "15d84859-df45-4a94-a95c-ae69b6286aea")
	)
	(label "TX8"
		(at 186.69 68.58 0)
		(fields_autoplaced yes)
		(effects
			(font
				(size 1.27 1.27)
			)
			(justify left bottom)
		)
		(uuid "17b6612c-28aa-4937-a8a7-ae04224303c4")
	)
	(label "3.3V_(250_M_A_MAX)"
		(at 62.23 36.83 270)
		(fields_autoplaced yes)
		(effects
			(font
				(size 1.27 1.27)
			)
			(justify right bottom)
		)
		(uuid "1889c2c4-05f3-40a9-b337-88a701b69e40")
		(property "Netclass" ""
			(at 63.5 36.83 90)
			(effects
				(font
					(size 1.27 1.27)
					(italic yes)
				)
				(justify right)
			)
		)
	)
	(label "3.3V_(250_M_A_MAX)"
		(at 40.64 36.83 270)
		(fields_autoplaced yes)
		(effects
			(font
				(size 1.27 1.27)
			)
			(justify right bottom)
		)
		(uuid "1cc36a50-50b6-4d10-81d9-5ef4c9bf1c18")
		(property "Netclass" ""
			(at 41.91 36.83 90)
			(effects
				(font
					(size 1.27 1.27)
					(italic yes)
				)
				(justify right)
			)
		)
	)
	(label "VIN_(3.6_TO_5.5_VOLTS)"
		(at 186.69 116.84 0)
		(fields_autoplaced yes)
		(effects
			(font
				(size 1.27 1.27)
			)
			(justify left bottom)
		)
		(uuid "1de7e1f7-22f6-4109-9208-15d1d52332c4")
	)
	(label "3.3V_(250_M_A_MAX)"
		(at 95.25 107.95 180)
		(fields_autoplaced yes)
		(effects
			(font
				(size 1.27 1.27)
			)
			(justify right bottom)
		)
		(uuid "20445e48-617f-4cb5-b45c-d668687e91a4")
		(property "Netclass" ""
			(at 95.25 109.22 0)
			(effects
				(font
					(size 1.27 1.27)
					(italic yes)
				)
				(justify right)
			)
		)
	)
	(label "A11"
		(at 111.76 119.38 180)
		(fields_autoplaced yes)
		(effects
			(font
				(size 1.27 1.27)
			)
			(justify right bottom)
		)
		(uuid "20fca953-a295-427a-815a-af4dce3b812a")
	)
	(label "3.3V_(250_M_A_MAX)"
		(at 186.69 91.44 0)
		(fields_autoplaced yes)
		(effects
			(font
				(size 1.27 1.27)
			)
			(justify left bottom)
		)
		(uuid "227f1bcb-f97f-4be6-af7c-11432ee2c3b4")
	)
	(label "A3"
		(at 111.76 99.06 180)
		(fields_autoplaced yes)
		(effects
			(font
				(size 1.27 1.27)
			)
			(justify right bottom)
		)
		(uuid "2493bc57-27a9-4bf4-b86e-0cbb18207230")
	)
	(label "A14"
		(at 186.69 76.2 0)
		(fields_autoplaced yes)
		(effects
			(font
				(size 1.27 1.27)
			)
			(justify left bottom)
		)
		(uuid "2d968ac0-0d57-45aa-ad43-b5f8eed5435c")
	)
	(label "TX2"
		(at 133.35 76.2 180)
		(fields_autoplaced yes)
		(effects
			(font
				(size 1.27 1.27)
			)
			(justify right bottom)
		)
		(uuid "30618329-4f74-40ff-8dce-d6542876b89d")
	)
	(label "ON/OFF"
		(at 186.69 99.06 0)
		(fields_autoplaced yes)
		(effects
			(font
				(size 1.27 1.27)
			)
			(justify left bottom)
		)
		(uuid "343d6214-225a-4e1b-b968-a890c234407a")
	)
	(label "SCL0"
		(at 50.8 104.14 90)
		(fields_autoplaced yes)
		(effects
			(font
				(size 1.27 1.27)
			)
			(justify left bottom)
		)
		(uuid "3b9004a6-3540-41f0-b29a-7339f19754f2")
	)
	(label "GND_3"
		(at 210.82 104.14 0)
		(fields_autoplaced yes)
		(effects
			(font
				(size 1.27 1.27)
			)
			(justify left bottom)
		)
		(uuid "3e810159-0e23-4a04-94d8-af7beca92c39")
	)
	(label "GND_2"
		(at 210.82 101.6 0)
		(fields_autoplaced yes)
		(effects
			(font
				(size 1.27 1.27)
			)
			(justify left bottom)
		)
		(uuid "4117515f-9001-4116-8ae4-9fe55ad69cc2")
	)
	(label "SDA2"
		(at 68.58 119.38 90)
		(fields_autoplaced yes)
		(effects
			(font
				(size 1.27 1.27)
			)
			(justify left bottom)
		)
		(uuid "412ff690-b541-4adf-b7e2-486b11202dd1")
	)
	(label "A0"
		(at 133.35 91.44 180)
		(fields_autoplaced yes)
		(effects
			(font
				(size 1.27 1.27)
			)
			(justify right bottom)
		)
		(uuid "41de0a81-399a-477d-afc7-722deff49d3c")
	)
	(label "GND_4"
		(at 210.82 124.46 0)
		(fields_autoplaced yes)
		(effects
			(font
				(size 1.27 1.27)
			)
			(justify left bottom)
		)
		(uuid "49f14f2d-446a-414a-8225-8794b9f7c84d")
	)
	(label "SCL2"
		(at 88.9 116.84 90)
		(fields_autoplaced yes)
		(effects
			(font
				(size 1.27 1.27)
			)
			(justify left bottom)
		)
		(uuid "4aaf6db8-7774-4c91-8f96-9ae9357eb592")
	)
	(label "A3"
		(at 133.35 99.06 180)
		(fields_autoplaced yes)
		(effects
			(font
				(size 1.27 1.27)
			)
			(justify right bottom)
		)
		(uuid "4cc4b361-7760-4f85-ac53-519fe78758aa")
	)
	(label "CS_2"
		(at 186.69 71.12 0)
		(fields_autoplaced yes)
		(effects
			(font
				(size 1.27 1.27)
			)
			(justify left bottom)
		)
		(uuid "51d022b2-a3b4-4ff5-b338-0bfe6b7f0dc7")
	)
	(label "+5V"
		(at 186.69 111.76 0)
		(fields_autoplaced yes)
		(effects
			(font
				(size 1.27 1.27)
			)
			(justify left bottom)
		)
		(uuid "58388ab5-1565-4f2d-be8e-593a0b798a3f")
	)
	(label "A8"
		(at 133.35 111.76 180)
		(fields_autoplaced yes)
		(effects
			(font
				(size 1.27 1.27)
			)
			(justify right bottom)
		)
		(uuid "595b866c-5560-4030-b131-ca6d52b61d6f")
	)
	(label "3.3V_(250_M_A_MAX)"
		(at 101.6 74.93 180)
		(fields_autoplaced yes)
		(effects
			(font
				(size 1.27 1.27)
			)
			(justify right bottom)
		)
		(uuid "59899102-c055-4bdf-9779-83882cf32d09")
		(property "Netclass" ""
			(at 101.6 76.2 0)
			(effects
				(font
					(size 1.27 1.27)
					(italic yes)
				)
				(justify right)
			)
		)
	)
	(label "IN2"
		(at 133.35 68.58 180)
		(fields_autoplaced yes)
		(effects
			(font
				(size 1.27 1.27)
			)
			(justify right bottom)
		)
		(uuid "59c18a5b-8445-4eb8-81cf-c16c169e3af6")
	)
	(label "GND_1"
		(at 210.82 93.98 0)
		(fields_autoplaced yes)
		(effects
			(font
				(size 1.27 1.27)
			)
			(justify left bottom)
		)
		(uuid "59d3ce7c-e8d5-4164-96ac-a4b7094e0164")
	)
	(label "A9"
		(at 133.35 114.3 180)
		(fields_autoplaced yes)
		(effects
			(font
				(size 1.27 1.27)
			)
			(justify right bottom)
		)
		(uuid "5de2804a-527b-436b-bfde-fdf20e2ecec0")
	)
	(label "3.3V_(250_M_A_MAX)"
		(at 186.69 114.3 0)
		(fields_autoplaced yes)
		(effects
			(font
				(size 1.27 1.27)
			)
			(justify left bottom)
		)
		(uuid "5e7d798c-5d83-4537-8b92-2c1ca07efff3")
	)
	(label "OUT1C"
		(at 133.35 78.74 180)
		(fields_autoplaced yes)
		(effects
			(font
				(size 1.27 1.27)
			)
			(justify right bottom)
		)
		(uuid "685614e7-15aa-4557-9b14-4479493d697f")
	)
	(label "CS_1"
		(at 133.35 81.28 180)
		(fields_autoplaced yes)
		(effects
			(font
				(size 1.27 1.27)
			)
			(justify right bottom)
		)
		(uuid "6e44d14a-fb21-4f29-a451-43d002298507")
	)
	(label "PROGRAM"
		(at 186.69 96.52 0)
		(fields_autoplaced yes)
		(effects
			(font
				(size 1.27 1.27)
			)
			(justify left bottom)
		)
		(uuid "6f2f990c-93aa-42c6-899b-780834255b45")
	)
	(label "A11"
		(at 133.35 119.38 180)
		(fields_autoplaced yes)
		(effects
			(font
				(size 1.27 1.27)
			)
			(justify right bottom)
		)
		(uuid "72f0b0c2-3687-479c-b98e-06e630b2ab86")
	)
	(label "OUT1B"
		(at 186.69 60.96 0)
		(fields_autoplaced yes)
		(effects
			(font
				(size 1.27 1.27)
			)
			(justify left bottom)
		)
		(uuid "732a2bc0-6f7b-4c5d-ad2e-cb61bac03402")
	)
	(label "A4"
		(at 111.76 101.6 180)
		(fields_autoplaced yes)
		(effects
			(font
				(size 1.27 1.27)
			)
			(justify right bottom)
		)
		(uuid "75338fed-c7b3-4a8e-b5d0-3fb882762c30")
	)
	(label "3.3V_(250_M_A_MAX)"
		(at 186.69 86.36 0)
		(fields_autoplaced yes)
		(effects
			(font
				(size 1.27 1.27)
			)
			(justify left bottom)
		)
		(uuid "75c09758-e579-4ab5-ac66-f0d8dc6a6bb0")
	)
	(label "RX1"
		(at 186.69 119.38 0)
		(fields_autoplaced yes)
		(effects
			(font
				(size 1.27 1.27)
			)
			(justify left bottom)
		)
		(uuid "76bb694c-87b0-48e8-bbb4-efe4927177ea")
	)
	(label "RX7"
		(at 133.35 127 180)
		(fields_autoplaced yes)
		(effects
			(font
				(size 1.27 1.27)
			)
			(justify right bottom)
		)
		(uuid "7ba8db55-f768-4fc3-b03c-14ba193c7f90")
	)
	(label "LRCLK2"
		(at 133.35 63.5 180)
		(fields_autoplaced yes)
		(effects
			(font
				(size 1.27 1.27)
			)
			(justify right bottom)
		)
		(uuid "7c2cec1f-126e-4537-ad40-b4f0577940fd")
	)
	(label "A10"
		(at 111.76 116.84 180)
		(fields_autoplaced yes)
		(effects
			(font
				(size 1.27 1.27)
			)
			(justify right bottom)
		)
		(uuid "8191af9e-14f0-4c06-a0d6-554c60c19e30")
	)
	(label "SCL1"
		(at 95.25 96.52 90)
		(fields_autoplaced yes)
		(effects
			(font
				(size 1.27 1.27)
			)
			(justify left bottom)
		)
		(uuid "8a48e7cc-d307-480f-9572-23f0fcd945c2")
	)
	(label "SCL1"
		(at 64.77 36.83 270)
		(fields_autoplaced yes)
		(effects
			(font
				(size 1.27 1.27)
			)
			(justify right bottom)
		)
		(uuid "8cd0857b-c3a1-41e8-9e3b-63d42c7205d1")
	)
	(label "SDA0"
		(at 64.77 101.6 90)
		(fields_autoplaced yes)
		(effects
			(font
				(size 1.27 1.27)
			)
			(justify left bottom)
		)
		(uuid "9034bba5-1a80-4c4a-afd1-c96b903b4137")
	)
	(label "RX8"
		(at 186.69 66.04 0)
		(fields_autoplaced yes)
		(effects
			(font
				(size 1.27 1.27)
			)
			(justify left bottom)
		)
		(uuid "944747c2-9741-406f-b806-0c0f0133874b")
	)
	(label "A4"
		(at 133.35 101.6 180)
		(fields_autoplaced yes)
		(effects
			(font
				(size 1.27 1.27)
			)
			(justify right bottom)
		)
		(uuid "96c548b1-8ac6-4f81-a2cc-7eee4f2096f1")
	)
	(label "MOSI"
		(at 133.35 83.82 180)
		(fields_autoplaced yes)
		(effects
			(font
				(size 1.27 1.27)
			)
			(justify right bottom)
		)
		(uuid "9bce9224-05a3-4551-b337-7f8273b81869")
	)
	(label "SCL2"
		(at 85.09 36.83 270)
		(fields_autoplaced yes)
		(effects
			(font
				(size 1.27 1.27)
			)
			(justify right bottom)
		)
		(uuid "9e696dd0-1c61-4cf6-880a-8dc82f9a1b65")
	)
	(label "3.3V_(250_M_A_MAX)"
		(at 73.66 82.55 180)
		(fields_autoplaced yes)
		(effects
			(font
				(size 1.27 1.27)
			)
			(justify right bottom)
		)
		(uuid "a1f71640-a5b3-441e-b792-67b71d7f27a4")
		(property "Netclass" ""
			(at 73.66 83.82 0)
			(effects
				(font
					(size 1.27 1.27)
					(italic yes)
				)
				(justify right)
			)
		)
	)
	(label "GND_5"
		(at 210.82 127 0)
		(fields_autoplaced yes)
		(effects
			(font
				(size 1.27 1.27)
			)
			(justify left bottom)
		)
		(uuid "a361307b-2e02-4f9e-8e4a-6303ef0a2224")
	)
	(label "3.3V_(250_M_A_MAX)"
		(at 74.93 110.49 180)
		(fields_autoplaced yes)
		(effects
			(font
				(size 1.27 1.27)
			)
			(justify right bottom)
		)
		(uuid "a5629360-8152-4830-98a1-17b22a6c8083")
		(property "Netclass" ""
			(at 74.93 111.76 0)
			(effects
				(font
					(size 1.27 1.27)
					(italic yes)
				)
				(justify right)
			)
		)
	)
	(label "OUT1D"
		(at 133.35 71.12 180)
		(fields_autoplaced yes)
		(effects
			(font
				(size 1.27 1.27)
			)
			(justify right bottom)
		)
		(uuid "a99208c0-75bc-4a5d-9e65-7f637f1de898")
	)
	(label "A1"
		(at 133.35 93.98 180)
		(fields_autoplaced yes)
		(effects
			(font
				(size 1.27 1.27)
			)
			(justify right bottom)
		)
		(uuid "aa5a04db-f66c-4677-80d7-8956a6c9d72b")
	)
	(label "A13"
		(at 133.35 124.46 180)
		(fields_autoplaced yes)
		(effects
			(font
				(size 1.27 1.27)
			)
			(justify right bottom)
		)
		(uuid "acc93e0f-5397-47d3-be48-73a48443bd68")
	)
	(label "A15"
		(at 186.69 78.74 0)
		(fields_autoplaced yes)
		(effects
			(font
				(size 1.27 1.27)
			)
			(justify left bottom)
		)
		(uuid "b1e3dc7d-c045-439f-bf2c-e5a03e632bcb")
	)
	(label "OUT2"
		(at 133.35 60.96 180)
		(fields_autoplaced yes)
		(effects
			(font
				(size 1.27 1.27)
			)
			(justify right bottom)
		)
		(uuid "b1f42ad1-6354-43bf-ba2c-32dbe3a3f34b")
	)
	(label "D+"
		(at 186.69 106.68 0)
		(fields_autoplaced yes)
		(effects
			(font
				(size 1.27 1.27)
			)
			(justify left bottom)
		)
		(uuid "c2505a9a-229a-44be-a1bf-b5dcc16018b4")
	)
	(label "A2"
		(at 133.35 96.52 180)
		(fields_autoplaced yes)
		(effects
			(font
				(size 1.27 1.27)
			)
			(justify right bottom)
		)
		(uuid "c44a7323-c371-4391-b042-a24a4346b9f4")
	)
	(label "3.3V_(250_M_A_MAX)"
		(at 87.63 77.47 180)
		(fields_autoplaced yes)
		(effects
			(font
				(size 1.27 1.27)
			)
			(justify right bottom)
		)
		(uuid "c6de27b7-b743-48ee-b368-88e9a6c55e25")
		(property "Netclass" ""
			(at 87.63 78.74 0)
			(effects
				(font
					(size 1.27 1.27)
					(italic yes)
				)
				(justify right)
			)
		)
	)
	(label "CS_3"
		(at 186.69 73.66 0)
		(fields_autoplaced yes)
		(effects
			(font
				(size 1.27 1.27)
			)
			(justify left bottom)
		)
		(uuid "ca62ed54-d028-447d-ad79-15699f76aae6")
	)
	(label "SCL0"
		(at 43.18 40.64 270)
		(fields_autoplaced yes)
		(effects
			(font
				(size 1.27 1.27)
			)
			(justify right bottom)
		)
		(uuid "d3d0b30d-2ef8-4ee5-bdff-00fd49b1943b")
	)
	(label "SDA1"
		(at 69.85 36.83 0)
		(fields_autoplaced yes)
		(effects
			(font
				(size 1.27 1.27)
			)
			(justify left bottom)
		)
		(uuid "d5bbcaa6-32de-4411-950e-e7f7c05b2a01")
	)
	(label "SDA0"
		(at 48.26 40.64 0)
		(fields_autoplaced yes)
		(effects
			(font
				(size 1.27 1.27)
			)
			(justify left bottom)
		)
		(uuid "de18d998-a162-4411-a93b-8c15242a6826")
	)
	(label "MISO"
		(at 133.35 86.36 180)
		(fields_autoplaced yes)
		(effects
			(font
				(size 1.27 1.27)
			)
			(justify right bottom)
		)
		(uuid "e0f1ed4a-bb29-4085-a6d4-b2785fe51ad2")
	)
	(label "A10"
		(at 133.35 116.84 180)
		(fields_autoplaced yes)
		(effects
			(font
				(size 1.27 1.27)
			)
			(justify right bottom)
		)
		(uuid "e2051448-424e-4995-a39e-53b4bf8cd0d8")
	)
	(label "A7"
		(at 133.35 109.22 180)
		(fields_autoplaced yes)
		(effects
			(font
				(size 1.27 1.27)
			)
			(justify right bottom)
		)
		(uuid "e2f363ea-65bf-43ad-a810-db88a645c8f8")
	)
	(label "3.3V_(250_M_A_MAX)"
		(at 82.55 36.83 270)
		(fields_autoplaced yes)
		(effects
			(font
				(size 1.27 1.27)
			)
			(justify right bottom)
		)
		(uuid "e3c735a3-fbbd-4c35-9848-276d0f8a9e9e")
		(property "Netclass" ""
			(at 83.82 36.83 90)
			(effects
				(font
					(size 1.27 1.27)
					(italic yes)
				)
				(justify right)
			)
		)
	)
	(label "CTX3"
		(at 186.69 58.42 0)
		(fields_autoplaced yes)
		(effects
			(font
				(size 1.27 1.27)
			)
			(justify left bottom)
		)
		(uuid "e85e3927-a3f3-4678-90ed-c73e3839c098")
	)
	(label "VUSB"
		(at 186.69 121.92 0)
		(fields_autoplaced yes)
		(effects
			(font
				(size 1.27 1.27)
			)
			(justify left bottom)
		)
		(uuid "eaf293db-9baa-4d1e-a4e1-2f3cca7c6b62")
	)
	(label "A17"
		(at 186.69 83.82 0)
		(fields_autoplaced yes)
		(effects
			(font
				(size 1.27 1.27)
			)
			(justify left bottom)
		)
		(uuid "eb224761-1e1f-4562-96ba-29184f49250f")
	)
	(label "SDA2"
		(at 90.17 36.83 0)
		(fields_autoplaced yes)
		(effects
			(font
				(size 1.27 1.27)
			)
			(justify left bottom)
		)
		(uuid "edbe6893-e3c0-4e0e-8317-48c2a382ffff")
	)
	(label "D-"
		(at 186.69 109.22 0)
		(fields_autoplaced yes)
		(effects
			(font
				(size 1.27 1.27)
			)
			(justify left bottom)
		)
		(uuid "eec2edcb-261d-4690-8149-4b5fedd475df")
	)
	(label "A12"
		(at 133.35 121.92 180)
		(fields_autoplaced yes)
		(effects
			(font
				(size 1.27 1.27)
			)
			(justify right bottom)
		)
		(uuid "f0b32507-7748-4819-8f45-706a1bf06037")
	)
	(label "3.3V_(250_M_A_MAX)"
		(at 57.15 85.09 180)
		(fields_autoplaced yes)
		(effects
			(font
				(size 1.27 1.27)
			)
			(justify right bottom)
		)
		(uuid "f31dd66b-935a-4e9d-9542-b817db9b82a9")
		(property "Netclass" ""
			(at 57.15 86.36 0)
			(effects
				(font
					(size 1.27 1.27)
					(italic yes)
				)
				(justify right)
			)
		)
	)
	(label "A2"
		(at 111.76 96.52 180)
		(fields_autoplaced yes)
		(effects
			(font
				(size 1.27 1.27)
			)
			(justify right bottom)
		)
		(uuid "f381dcaa-27cc-4ba8-8e60-55b3ffd409ef")
	)
	(label "VIN_(3.6_TO_5.5_VOLTS)"
		(at 228.6 36.83 270)
		(fields_autoplaced yes)
		(effects
			(font
				(size 1.27 1.27)
			)
			(justify right bottom)
		)
		(uuid "f419f894-0fab-4b25-b382-de5e3d14f225")
	)
	(label "BCLK2"
		(at 133.35 66.04 180)
		(fields_autoplaced yes)
		(effects
			(font
				(size 1.27 1.27)
			)
			(justify right bottom)
		)
		(uuid "f52f19eb-3c55-40f9-9bc2-d7b37b9e0a11")
	)
	(label "MCLK2"
		(at 186.69 63.5 0)
		(fields_autoplaced yes)
		(effects
			(font
				(size 1.27 1.27)
			)
			(justify left bottom)
		)
		(uuid "f620b73b-254e-4457-b043-2795fbc2ed22")
	)
	(label "VBAT"
		(at 186.69 88.9 0)
		(fields_autoplaced yes)
		(effects
			(font
				(size 1.27 1.27)
			)
			(justify left bottom)
		)
		(uuid "f86f73d5-8b58-4a7f-b65e-506908aabbf6")
	)
	(label "TX7"
		(at 133.35 129.54 180)
		(fields_autoplaced yes)
		(effects
			(font
				(size 1.27 1.27)
			)
			(justify right bottom)
		)
		(uuid "f95cd716-440b-44f7-aa49-b93f5125231a")
	)
	(label "RX2"
		(at 133.35 73.66 180)
		(fields_autoplaced yes)
		(effects
			(font
				(size 1.27 1.27)
			)
			(justify right bottom)
		)
		(uuid "fa73b3a9-d0d6-4509-a290-edcc1024b750")
	)
	(label "TX1"
		(at 133.35 58.42 180)
		(fields_autoplaced yes)
		(effects
			(font
				(size 1.27 1.27)
			)
			(justify right bottom)
		)
		(uuid "fb02b617-a492-4598-8e37-91f44c40f9d9")
	)
	(symbol
		(lib_id "Simulation_SPICE:0")
		(at 67.31 40.64 0)
		(unit 1)
		(exclude_from_sim no)
		(in_bom yes)
		(on_board yes)
		(dnp no)
		(fields_autoplaced yes)
		(uuid "04f8fa21-47b9-4be7-8408-f46bab3a077c")
		(property "Reference" "#GND02"
			(at 67.31 45.72 0)
			(effects
				(font
					(size 1.27 1.27)
				)
				(hide yes)
			)
		)
		(property "Value" "0"
			(at 67.31 38.1 0)
			(effects
				(font
					(size 1.27 1.27)
				)
			)
		)
		(property "Footprint" ""
			(at 67.31 40.64 0)
			(effects
				(font
					(size 1.27 1.27)
				)
				(hide yes)
			)
		)
		(property "Datasheet" "https://ngspice.sourceforge.io/docs/ngspice-html-manual/manual.xhtml#subsec_Circuit_elements__device"
			(at 67.31 50.8 0)
			(effects
				(font
					(size 1.27 1.27)
				)
				(hide yes)
			)
		)
		(property "Description" "0V reference potential for simulation"
			(at 67.31 48.26 0)
			(effects
				(font
					(size 1.27 1.27)
				)
				(hide yes)
			)
		)
		(pin "1"
			(uuid "57d519fa-2fa7-479f-a166-b68a94eb701c")
		)
		(instances
			(project "teensy_rr0_breakout"
				(path "/5a44dcb9-4fc3-4263-b7ee-8bef38a9319f"
					(reference "#GND02")
					(unit 1)
				)
			)
		)
	)
	(symbol
		(lib_id "Device:R")
		(at 73.66 92.71 0)
		(unit 1)
		(exclude_from_sim no)
		(in_bom yes)
		(on_board yes)
		(dnp no)
		(fields_autoplaced yes)
		(uuid "110cb045-7d82-4000-a2e3-32f7950d335f")
		(property "Reference" "R2"
			(at 76.2 91.4399 0)
			(effects
				(font
					(size 1.27 1.27)
				)
				(justify left)
			)
		)
		(property "Value" "1k"
			(at 76.2 93.9799 0)
			(effects
				(font
					(size 1.27 1.27)
				)
				(justify left)
			)
		)
		(property "Footprint" "Resistor_SMD:R_0805_2012Metric"
			(at 71.882 92.71 90)
			(effects
				(font
					(size 1.27 1.27)
				)
				(hide yes)
			)
		)
		(property "Datasheet" "~"
			(at 73.66 92.71 0)
			(effects
				(font
					(size 1.27 1.27)
				)
				(hide yes)
			)
		)
		(property "Description" "Resistor"
			(at 73.66 92.71 0)
			(effects
				(font
					(size 1.27 1.27)
				)
				(hide yes)
			)
		)
		(pin "1"
			(uuid "7a5364d7-024a-45c7-885a-f608fb2b7896")
		)
		(pin "2"
			(uuid "ee1069f4-2041-460f-9abc-553c70702d0a")
		)
		(instances
			(project "teensy_rr0_breakout"
				(path "/5a44dcb9-4fc3-4263-b7ee-8bef38a9319f"
					(reference "R2")
					(unit 1)
				)
			)
		)
	)
	(symbol
		(lib_id "Connector_Generic:Conn_01x04")
		(at 85.09 31.75 90)
		(unit 1)
		(exclude_from_sim no)
		(in_bom yes)
		(on_board yes)
		(dnp no)
		(fields_autoplaced yes)
		(uuid "1a18ef6b-8bcb-4c5c-905e-ed198ba48855")
		(property "Reference" "J3"
			(at 86.36 25.4 90)
			(effects
				(font
					(size 1.27 1.27)
				)
			)
		)
		(property "Value" "WIRE2"
			(at 86.36 27.94 90)
			(effects
				(font
					(size 1.27 1.27)
				)
			)
		)
		(property "Footprint" "Connector_JST:JST_XH_S4B-XH-A-1_1x04_P2.50mm_Horizontal"
			(at 85.09 31.75 0)
			(effects
				(font
					(size 1.27 1.27)
				)
				(hide yes)
			)
		)
		(property "Datasheet" "~"
			(at 85.09 31.75 0)
			(effects
				(font
					(size 1.27 1.27)
				)
				(hide yes)
			)
		)
		(property "Description" "Generic connector, single row, 01x04, script generated (kicad-library-utils/schlib/autogen/connector/)"
			(at 85.09 31.75 0)
			(effects
				(font
					(size 1.27 1.27)
				)
				(hide yes)
			)
		)
		(pin "2"
			(uuid "e6b5c24e-e097-4c7e-80a0-2b13f3a73b1c")
		)
		(pin "1"
			(uuid "e0ac915c-fd64-487a-b0bb-c3597da169b3")
		)
		(pin "3"
			(uuid "c4e6e020-d994-4bf9-9b91-47fb93cf1127")
		)
		(pin "4"
			(uuid "505984a7-f775-4ad9-9118-6b1cbdc254d2")
		)
		(instances
			(project "teensy_rr0_breakout"
				(path "/5a44dcb9-4fc3-4263-b7ee-8bef38a9319f"
					(reference "J3")
					(unit 1)
				)
			)
		)
	)
	(symbol
		(lib_id "Simulation_SPICE:0")
		(at 87.63 40.64 0)
		(unit 1)
		(exclude_from_sim no)
		(in_bom yes)
		(on_board yes)
		(dnp no)
		(fields_autoplaced yes)
		(uuid "1fd253d8-79e4-4bf4-93f7-76f6c7bb964b")
		(property "Reference" "#GND03"
			(at 87.63 45.72 0)
			(effects
				(font
					(size 1.27 1.27)
				)
				(hide yes)
			)
		)
		(property "Value" "0"
			(at 87.63 38.1 0)
			(effects
				(font
					(size 1.27 1.27)
				)
			)
		)
		(property "Footprint" ""
			(at 87.63 40.64 0)
			(effects
				(font
					(size 1.27 1.27)
				)
				(hide yes)
			)
		)
		(property "Datasheet" "https://ngspice.sourceforge.io/docs/ngspice-html-manual/manual.xhtml#subsec_Circuit_elements__device"
			(at 87.63 50.8 0)
			(effects
				(font
					(size 1.27 1.27)
				)
				(hide yes)
			)
		)
		(property "Description" "0V reference potential for simulation"
			(at 87.63 48.26 0)
			(effects
				(font
					(size 1.27 1.27)
				)
				(hide yes)
			)
		)
		(pin "1"
			(uuid "2eaeee38-040d-40b7-8c87-82c8d99376a5")
		)
		(instances
			(project "teensy_rr0_breakout"
				(path "/5a44dcb9-4fc3-4263-b7ee-8bef38a9319f"
					(reference "#GND03")
					(unit 1)
				)
			)
		)
	)
	(symbol
		(lib_id "Device:R")
		(at 74.93 115.57 0)
		(unit 1)
		(exclude_from_sim no)
		(in_bom yes)
		(on_board yes)
		(dnp no)
		(fields_autoplaced yes)
		(uuid "238b36ce-7bad-4f4e-8aae-0a58c1ec2e6a")
		(property "Reference" "R3"
			(at 77.47 114.2999 0)
			(effects
				(font
					(size 1.27 1.27)
				)
				(justify left)
			)
		)
		(property "Value" "1k"
			(at 77.47 116.8399 0)
			(effects
				(font
					(size 1.27 1.27)
				)
				(justify left)
			)
		)
		(property "Footprint" "Resistor_SMD:R_0805_2012Metric"
			(at 73.152 115.57 90)
			(effects
				(font
					(size 1.27 1.27)
				)
				(hide yes)
			)
		)
		(property "Datasheet" "~"
			(at 74.93 115.57 0)
			(effects
				(font
					(size 1.27 1.27)
				)
				(hide yes)
			)
		)
		(property "Description" "Resistor"
			(at 74.93 115.57 0)
			(effects
				(font
					(size 1.27 1.27)
				)
				(hide yes)
			)
		)
		(pin "2"
			(uuid "6b8973b5-982a-4556-9f21-058d53447796")
		)
		(pin "1"
			(uuid "96e1d7c5-c624-49b1-ad05-eb7ce8089ec0")
		)
		(instances
			(project "teensy_rr0_breakout"
				(path "/5a44dcb9-4fc3-4263-b7ee-8bef38a9319f"
					(reference "R3")
					(unit 1)
				)
			)
		)
	)
	(symbol
		(lib_id "RR0_parts_lib:TEENSY_4.1")
		(at 133.35 58.42 0)
		(unit 1)
		(exclude_from_sim yes)
		(in_bom no)
		(on_board yes)
		(dnp no)
		(fields_autoplaced yes)
		(uuid "25ca2150-8848-4e07-9fee-e10135e52ebb")
		(property "Reference" "IC1"
			(at 160.02 50.8 0)
			(effects
				(font
					(size 1.27 1.27)
				)
			)
		)
		(property "Value" "TEENSY_4.1"
			(at 160.02 53.34 0)
			(effects
				(font
					(size 1.27 1.27)
				)
			)
		)
		(property "Footprint" "TEENSY41"
			(at 182.88 153.34 0)
			(effects
				(font
					(size 1.27 1.27)
				)
				(justify left top)
				(hide yes)
			)
		)
		(property "Datasheet" "https://www.pjrc.com/store/teensy41.html"
			(at 182.88 253.34 0)
			(effects
				(font
					(size 1.27 1.27)
				)
				(justify left top)
				(hide yes)
			)
		)
		(property "Description" "Teensy 4.1 Development Board"
			(at 133.35 58.42 0)
			(effects
				(font
					(size 1.27 1.27)
				)
				(hide yes)
			)
		)
		(property "Height" ""
			(at 182.88 453.34 0)
			(effects
				(font
					(size 1.27 1.27)
				)
				(justify left top)
				(hide yes)
			)
		)
		(property "Manufacturer_Name" "PJRC"
			(at 182.88 553.34 0)
			(effects
				(font
					(size 1.27 1.27)
				)
				(justify left top)
				(hide yes)
			)
		)
		(property "Manufacturer_Part_Number" "TEENSY 4.1"
			(at 182.88 653.34 0)
			(effects
				(font
					(size 1.27 1.27)
				)
				(justify left top)
				(hide yes)
			)
		)
		(property "Mouser Part Number" ""
			(at 182.88 753.34 0)
			(effects
				(font
					(size 1.27 1.27)
				)
				(justify left top)
				(hide yes)
			)
		)
		(property "Mouser Price/Stock" ""
			(at 182.88 853.34 0)
			(effects
				(font
					(size 1.27 1.27)
				)
				(justify left top)
				(hide yes)
			)
		)
		(property "Arrow Part Number" ""
			(at 182.88 953.34 0)
			(effects
				(font
					(size 1.27 1.27)
				)
				(justify left top)
				(hide yes)
			)
		)
		(property "Arrow Price/Stock" ""
			(at 182.88 1053.34 0)
			(effects
				(font
					(size 1.27 1.27)
				)
				(justify left top)
				(hide yes)
			)
		)
		(pin "25"
			(uuid "1d3b67ec-def8-44bb-af82-9238f362c121")
		)
		(pin "19"
			(uuid "fc3d3f59-1473-489d-b011-0207c4fffc27")
		)
		(pin "36"
			(uuid "1b47fc9e-baaa-4dea-a5ae-4c14cebe574e")
		)
		(pin "23"
			(uuid "8065ca16-e24a-4c6e-8b97-610a0904d471")
		)
		(pin "53"
			(uuid "223ebe1b-f9ab-418e-ba4d-9d9fb7be708f")
		)
		(pin "27"
			(uuid "eee794b7-ec4f-4e1d-8968-cf250ec23d87")
		)
		(pin "70"
			(uuid "3fc7f19e-97fd-4e5e-a956-70cacd4c6ecd")
		)
		(pin "8"
			(uuid "4892351b-5c57-4e2f-a00a-49d5ccfbf366")
		)
		(pin "34"
			(uuid "667d7684-0eaf-48f5-ad96-3c73dec2d4d3")
		)
		(pin "32"
			(uuid "e187fe71-0a07-4a97-897e-786ee0f3b603")
		)
		(pin "49"
			(uuid "f6c2e897-b397-404c-9367-d51d38d47dda")
		)
		(pin "39"
			(uuid "fa660017-2f92-41a0-a7c1-c51c6ceaf503")
		)
		(pin "55"
			(uuid "409a06a6-fd48-4d0f-add7-24b107a514c8")
		)
		(pin "9"
			(uuid "cffd2e3e-c764-4940-9112-1e44702f91e8")
		)
		(pin "71"
			(uuid "4df34aab-d110-4089-978b-09ae32ec8635")
		)
		(pin "21"
			(uuid "fbc68190-dbcb-4878-8c7b-2981595567f6")
		)
		(pin "16"
			(uuid "3154729b-4551-4326-9984-a04168ce2d8a")
		)
		(pin "51"
			(uuid "551ee71d-2149-4644-816d-1b5f49a39b81")
		)
		(pin "42"
			(uuid "8687c535-4182-47bf-acf5-bc52e1b65cd0")
		)
		(pin "22"
			(uuid "ff0e482a-769b-4e1b-a8fe-20f368877560")
		)
		(pin "2"
			(uuid "dc36c1a4-b13c-4a31-a7c4-48d52f9b37d8")
		)
		(pin "18"
			(uuid "d0e02d1e-93ed-4ffc-949b-cce2c7d7049d")
		)
		(pin "5"
			(uuid "007c2fb0-df80-46a0-820b-fa9b5b321ba8")
		)
		(pin "40"
			(uuid "599b729e-e3b3-46a9-872d-fe72df1e3a2f")
		)
		(pin "26"
			(uuid "e4223c06-a8e1-46f3-86cf-010a38752c62")
		)
		(pin "50"
			(uuid "bea1aa43-add4-4f3e-8536-e15337b24c17")
		)
		(pin "20"
			(uuid "72cfabb0-fe00-4bfc-989b-139b14cab683")
		)
		(pin "47"
			(uuid "e8c9a01d-198b-470e-aa3b-3e22e2f06727")
		)
		(pin "24"
			(uuid "162044d2-0371-45eb-8917-0c110ff542af")
		)
		(pin "57"
			(uuid "686d3dbc-4778-4ec7-9897-590d696b00ff")
		)
		(pin "41"
			(uuid "8cf38652-9feb-4a00-9bc4-a585191d0688")
		)
		(pin "38"
			(uuid "2477a3de-cff1-41c9-a657-df51b36bf83e")
		)
		(pin "31"
			(uuid "5a4370d4-7557-44bf-adf7-6e53a82490de")
		)
		(pin "17"
			(uuid "9080d831-d113-4bb7-b118-8e5413f841a2")
		)
		(pin "6"
			(uuid "fc7687d7-1a2c-459d-8cb3-670344bff5ba")
		)
		(pin "7"
			(uuid "a24282b0-94af-49e5-95e7-95c30ab4684f")
		)
		(pin "43"
			(uuid "ad5de192-2ace-4288-812e-86cd2b90c466")
		)
		(pin "28"
			(uuid "72b57fe3-9c33-4099-915c-6737a4bb6bc0")
		)
		(pin "37"
			(uuid "1d6aff56-b618-47dd-ab88-ca1f6e91f746")
		)
		(pin "46"
			(uuid "025f6c3f-4a0b-47de-8846-b00701f51aaa")
		)
		(pin "52"
			(uuid "8099b588-9695-4068-a8dc-fa10508c16ea")
		)
		(pin "45"
			(uuid "b8d79b74-95f0-43ed-bc26-084abd622e9f")
		)
		(pin "35"
			(uuid "3eb3b0db-36ac-4868-b499-5786045cec2a")
		)
		(pin "1"
			(uuid "575d0f5a-93bf-417b-b52b-a01b3522432a")
		)
		(pin "29"
			(uuid "ad3c8d5c-9b5b-41db-86ce-d28baf90ec07")
		)
		(pin "3"
			(uuid "677e58e4-eb89-4bae-84f9-a295938216de")
		)
		(pin "68"
			(uuid "8454e38c-14aa-4429-b3c1-c518d0d5e8b9")
		)
		(pin "33"
			(uuid "6136b70c-fe0e-4874-933a-28a898d78097")
		)
		(pin "30"
			(uuid "8a521b7d-e2e6-4c4b-9a11-da112f02ec67")
		)
		(pin "15"
			(uuid "268b6c5b-9bd5-4f56-8189-f12a0383e1b3")
		)
		(pin "14"
			(uuid "bfc7ca0e-95bd-47ed-a083-1c617cbe9b94")
		)
		(pin "13"
			(uuid "d793fd8c-2018-4575-845d-d32ee51bd805")
		)
		(pin "12"
			(uuid "cd1f4d14-30ab-4f7b-8ba9-54b4816649be")
		)
		(pin "11"
			(uuid "50547d02-2433-4643-98eb-624b99e0a554")
		)
		(pin "10"
			(uuid "f8b7b81a-95b3-42ba-b8c0-c08a459b50a1")
		)
		(pin "48"
			(uuid "e839fa61-c4d8-4a78-a3cf-2330e2b572b6")
		)
		(pin "69"
			(uuid "731ddce8-1f92-4563-b4dc-fe99c495935c")
		)
		(pin "4"
			(uuid "bcf4acbe-a307-4edc-a8d3-c09a41f963c7")
		)
		(pin "44"
			(uuid "23aa65b5-e84b-4d73-879e-25b8f5b7b2ed")
		)
		(instances
			(project "teensy_rr0_breakout"
				(path "/5a44dcb9-4fc3-4263-b7ee-8bef38a9319f"
					(reference "IC1")
					(unit 1)
				)
			)
		)
	)
	(symbol
		(lib_id "Connector_Generic:Conn_01x04")
		(at 64.77 31.75 90)
		(unit 1)
		(exclude_from_sim no)
		(in_bom yes)
		(on_board yes)
		(dnp no)
		(fields_autoplaced yes)
		(uuid "4fe26d9b-f867-4b3a-aa65-15cf70614e80")
		(property "Reference" "J2"
			(at 66.04 25.4 90)
			(effects
				(font
					(size 1.27 1.27)
				)
			)
		)
		(property "Value" "WIRE1"
			(at 66.04 27.94 90)
			(effects
				(font
					(size 1.27 1.27)
				)
			)
		)
		(property "Footprint" "Connector_JST:JST_XH_S4B-XH-A-1_1x04_P2.50mm_Horizontal"
			(at 64.77 31.75 0)
			(effects
				(font
					(size 1.27 1.27)
				)
				(hide yes)
			)
		)
		(property "Datasheet" "~"
			(at 64.77 31.75 0)
			(effects
				(font
					(size 1.27 1.27)
				)
				(hide yes)
			)
		)
		(property "Description" "Generic connector, single row, 01x04, script generated (kicad-library-utils/schlib/autogen/connector/)"
			(at 64.77 31.75 0)
			(effects
				(font
					(size 1.27 1.27)
				)
				(hide yes)
			)
		)
		(pin "2"
			(uuid "7f468843-b43c-4b09-a77b-91a9edf30229")
		)
		(pin "1"
			(uuid "eff430c0-7908-48d4-8699-41975637dfae")
		)
		(pin "3"
			(uuid "e0628198-4120-4f59-831a-c1a42f2364a7")
		)
		(pin "4"
			(uuid "e7ba6cb7-dffb-4ed9-8404-ec824a8fc723")
		)
		(instances
			(project "teensy_rr0_breakout"
				(path "/5a44dcb9-4fc3-4263-b7ee-8bef38a9319f"
					(reference "J2")
					(unit 1)
				)
			)
		)
	)
	(symbol
		(lib_id "Simulation_SPICE:0")
		(at 210.82 134.62 0)
		(unit 1)
		(exclude_from_sim no)
		(in_bom yes)
		(on_board yes)
		(dnp no)
		(fields_autoplaced yes)
		(uuid "57523c8f-c0c7-4bc6-99f6-0810fcfe839c")
		(property "Reference" "#GND04"
			(at 210.82 139.7 0)
			(effects
				(font
					(size 1.27 1.27)
				)
				(hide yes)
			)
		)
		(property "Value" "0"
			(at 210.82 132.08 0)
			(effects
				(font
					(size 1.27 1.27)
				)
			)
		)
		(property "Footprint" ""
			(at 210.82 134.62 0)
			(effects
				(font
					(size 1.27 1.27)
				)
				(hide yes)
			)
		)
		(property "Datasheet" "https://ngspice.sourceforge.io/docs/ngspice-html-manual/manual.xhtml#subsec_Circuit_elements__device"
			(at 210.82 144.78 0)
			(effects
				(font
					(size 1.27 1.27)
				)
				(hide yes)
			)
		)
		(property "Description" "0V reference potential for simulation"
			(at 210.82 142.24 0)
			(effects
				(font
					(size 1.27 1.27)
				)
				(hide yes)
			)
		)
		(pin "1"
			(uuid "5bc74115-e7b1-41ad-9518-3c4b75170a3c")
		)
		(instances
			(project "teensy_rr0_breakout"
				(path "/5a44dcb9-4fc3-4263-b7ee-8bef38a9319f"
					(reference "#GND04")
					(unit 1)
				)
			)
		)
	)
	(symbol
		(lib_id "Simulation_SPICE:0")
		(at 45.72 40.64 0)
		(unit 1)
		(exclude_from_sim no)
		(in_bom yes)
		(on_board yes)
		(dnp no)
		(fields_autoplaced yes)
		(uuid "61a83722-eb7c-4a9c-8471-f0c5be23c667")
		(property "Reference" "#GND01"
			(at 45.72 45.72 0)
			(effects
				(font
					(size 1.27 1.27)
				)
				(hide yes)
			)
		)
		(property "Value" "0"
			(at 45.72 38.1 0)
			(effects
				(font
					(size 1.27 1.27)
				)
			)
		)
		(property "Footprint" ""
			(at 45.72 40.64 0)
			(effects
				(font
					(size 1.27 1.27)
				)
				(hide yes)
			)
		)
		(property "Datasheet" "https://ngspice.sourceforge.io/docs/ngspice-html-manual/manual.xhtml#subsec_Circuit_elements__device"
			(at 45.72 50.8 0)
			(effects
				(font
					(size 1.27 1.27)
				)
				(hide yes)
			)
		)
		(property "Description" "0V reference potential for simulation"
			(at 45.72 48.26 0)
			(effects
				(font
					(size 1.27 1.27)
				)
				(hide yes)
			)
		)
		(pin "1"
			(uuid "d37dea56-78e7-4d22-8d40-c29d8ee8bec4")
		)
		(instances
			(project "teensy_rr0_breakout"
				(path "/5a44dcb9-4fc3-4263-b7ee-8bef38a9319f"
					(reference "#GND01")
					(unit 1)
				)
			)
		)
	)
	(symbol
		(lib_id "Device:R")
		(at 95.25 113.03 0)
		(unit 1)
		(exclude_from_sim no)
		(in_bom yes)
		(on_board yes)
		(dnp no)
		(fields_autoplaced yes)
		(uuid "6405f381-e1c5-49a4-81bf-9040ca64b7aa")
		(property "Reference" "R5"
			(at 97.79 111.7599 0)
			(effects
				(font
					(size 1.27 1.27)
				)
				(justify left)
			)
		)
		(property "Value" "1k"
			(at 97.79 114.2999 0)
			(effects
				(font
					(size 1.27 1.27)
				)
				(justify left)
			)
		)
		(property "Footprint" "Resistor_SMD:R_0805_2012Metric"
			(at 93.472 113.03 90)
			(effects
				(font
					(size 1.27 1.27)
				)
				(hide yes)
			)
		)
		(property "Datasheet" "~"
			(at 95.25 113.03 0)
			(effects
				(font
					(size 1.27 1.27)
				)
				(hide yes)
			)
		)
		(property "Description" "Resistor"
			(at 95.25 113.03 0)
			(effects
				(font
					(size 1.27 1.27)
				)
				(hide yes)
			)
		)
		(pin "2"
			(uuid "492a4463-3639-4304-993a-e34d11d0caee")
		)
		(pin "1"
			(uuid "8abaffc8-b26f-4ff7-9188-b497ecb62650")
		)
		(instances
			(project "teensy_rr0_breakout"
				(path "/5a44dcb9-4fc3-4263-b7ee-8bef38a9319f"
					(reference "R5")
					(unit 1)
				)
			)
		)
	)
	(symbol
		(lib_id "Device:R")
		(at 101.6 86.36 0)
		(unit 1)
		(exclude_from_sim no)
		(in_bom yes)
		(on_board yes)
		(dnp no)
		(fields_autoplaced yes)
		(uuid "6ad1069e-8e80-4d60-b909-2cf967016c19")
		(property "Reference" "R6"
			(at 104.14 85.0899 0)
			(effects
				(font
					(size 1.27 1.27)
				)
				(justify left)
			)
		)
		(property "Value" "1k"
			(at 104.14 87.6299 0)
			(effects
				(font
					(size 1.27 1.27)
				)
				(justify left)
			)
		)
		(property "Footprint" "Resistor_SMD:R_0805_2012Metric"
			(at 99.822 86.36 90)
			(effects
				(font
					(size 1.27 1.27)
				)
				(hide yes)
			)
		)
		(property "Datasheet" "~"
			(at 101.6 86.36 0)
			(effects
				(font
					(size 1.27 1.27)
				)
				(hide yes)
			)
		)
		(property "Description" "Resistor"
			(at 101.6 86.36 0)
			(effects
				(font
					(size 1.27 1.27)
				)
				(hide yes)
			)
		)
		(pin "1"
			(uuid "225b7181-f0bc-4b71-87b6-4f14d5c794c7")
		)
		(pin "2"
			(uuid "ef284713-65a7-430d-b16d-f25e032f8a09")
		)
		(instances
			(project "teensy_rr0_breakout"
				(path "/5a44dcb9-4fc3-4263-b7ee-8bef38a9319f"
					(reference "R6")
					(unit 1)
				)
			)
		)
	)
	(symbol
		(lib_id "Device:R")
		(at 87.63 87.63 0)
		(unit 1)
		(exclude_from_sim no)
		(in_bom yes)
		(on_board yes)
		(dnp no)
		(fields_autoplaced yes)
		(uuid "8747e707-8caf-4519-9730-e5cab7277de0")
		(property "Reference" "R4"
			(at 90.17 86.3599 0)
			(effects
				(font
					(size 1.27 1.27)
				)
				(justify left)
			)
		)
		(property "Value" "1k"
			(at 90.17 88.8999 0)
			(effects
				(font
					(size 1.27 1.27)
				)
				(justify left)
			)
		)
		(property "Footprint" "Resistor_SMD:R_0805_2012Metric"
			(at 85.852 87.63 90)
			(effects
				(font
					(size 1.27 1.27)
				)
				(hide yes)
			)
		)
		(property "Datasheet" "~"
			(at 87.63 87.63 0)
			(effects
				(font
					(size 1.27 1.27)
				)
				(hide yes)
			)
		)
		(property "Description" "Resistor"
			(at 87.63 87.63 0)
			(effects
				(font
					(size 1.27 1.27)
				)
				(hide yes)
			)
		)
		(pin "2"
			(uuid "585c959b-5731-4c3e-85d1-84bc46a84511")
		)
		(pin "1"
			(uuid "140b0577-7507-4cfc-add5-fba8f54cf8ce")
		)
		(instances
			(project "teensy_rr0_breakout"
				(path "/5a44dcb9-4fc3-4263-b7ee-8bef38a9319f"
					(reference "R4")
					(unit 1)
				)
			)
		)
	)
	(symbol
		(lib_id "Simulation_SPICE:0")
		(at 231.14 43.18 0)
		(unit 1)
		(exclude_from_sim no)
		(in_bom yes)
		(on_board yes)
		(dnp no)
		(uuid "8ab7303f-4f9f-4ff4-8d9a-a0b5f6e41152")
		(property "Reference" "#GND05"
			(at 231.14 48.26 0)
			(effects
				(font
					(size 1.27 1.27)
				)
				(hide yes)
			)
		)
		(property "Value" "0"
			(at 232.156 40.894 0)
			(effects
				(font
					(size 1.27 1.27)
				)
			)
		)
		(property "Footprint" ""
			(at 231.14 43.18 0)
			(effects
				(font
					(size 1.27 1.27)
				)
				(hide yes)
			)
		)
		(property "Datasheet" "https://ngspice.sourceforge.io/docs/ngspice-html-manual/manual.xhtml#subsec_Circuit_elements__device"
			(at 231.14 53.34 0)
			(effects
				(font
					(size 1.27 1.27)
				)
				(hide yes)
			)
		)
		(property "Description" "0V reference potential for simulation"
			(at 231.14 50.8 0)
			(effects
				(font
					(size 1.27 1.27)
				)
				(hide yes)
			)
		)
		(pin "1"
			(uuid "e8e51769-2667-4c0b-9f54-7b0573216a10")
		)
		(instances
			(project "teensy_rr0_breakout"
				(path "/5a44dcb9-4fc3-4263-b7ee-8bef38a9319f"
					(reference "#GND05")
					(unit 1)
				)
			)
		)
	)
	(symbol
		(lib_id "Device:R")
		(at 57.15 92.71 0)
		(unit 1)
		(exclude_from_sim no)
		(in_bom yes)
		(on_board yes)
		(dnp no)
		(fields_autoplaced yes)
		(uuid "9ed4f29f-deaf-45d3-b9bd-06391bfa7707")
		(property "Reference" "R1"
			(at 59.69 91.4399 0)
			(effects
				(font
					(size 1.27 1.27)
				)
				(justify left)
			)
		)
		(property "Value" "1k"
			(at 59.69 93.9799 0)
			(effects
				(font
					(size 1.27 1.27)
				)
				(justify left)
			)
		)
		(property "Footprint" "Resistor_SMD:R_0805_2012Metric"
			(at 55.372 92.71 90)
			(effects
				(font
					(size 1.27 1.27)
				)
				(hide yes)
			)
		)
		(property "Datasheet" "~"
			(at 57.15 92.71 0)
			(effects
				(font
					(size 1.27 1.27)
				)
				(hide yes)
			)
		)
		(property "Description" "Resistor"
			(at 57.15 92.71 0)
			(effects
				(font
					(size 1.27 1.27)
				)
				(hide yes)
			)
		)
		(pin "2"
			(uuid "8b6a16ba-e32d-476d-9874-ce1a505856c0")
		)
		(pin "1"
			(uuid "22e9b0d0-a7b2-4169-bfde-8fa2eaa8a24e")
		)
		(instances
			(project "teensy_rr0_breakout"
				(path "/5a44dcb9-4fc3-4263-b7ee-8bef38a9319f"
					(reference "R1")
					(unit 1)
				)
			)
		)
	)
	(symbol
		(lib_id "Connector_Generic:Conn_01x02")
		(at 228.6 31.75 90)
		(unit 1)
		(exclude_from_sim no)
		(in_bom yes)
		(on_board yes)
		(dnp no)
		(fields_autoplaced yes)
		(uuid "b5155de8-40b3-4de0-bcab-f78b899d3e5c")
		(property "Reference" "J4"
			(at 233.68 30.4799 90)
			(effects
				(font
					(size 1.27 1.27)
				)
				(justify right)
			)
		)
		(property "Value" "PWR"
			(at 233.68 33.0199 90)
			(effects
				(font
					(size 1.27 1.27)
				)
				(justify right)
			)
		)
		(property "Footprint" "Connector_JST:JST_XH_S2B-XH-A_1x02_P2.50mm_Horizontal"
			(at 228.6 31.75 0)
			(effects
				(font
					(size 1.27 1.27)
				)
				(hide yes)
			)
		)
		(property "Datasheet" "~"
			(at 228.6 31.75 0)
			(effects
				(font
					(size 1.27 1.27)
				)
				(hide yes)
			)
		)
		(property "Description" "Generic connector, single row, 01x02, script generated (kicad-library-utils/schlib/autogen/connector/)"
			(at 228.6 31.75 0)
			(effects
				(font
					(size 1.27 1.27)
				)
				(hide yes)
			)
		)
		(pin "1"
			(uuid "1f0e2cf9-966b-4076-8cd3-7bac4614f6b3")
		)
		(pin "2"
			(uuid "ee691e4e-1a74-444c-a4bf-802ecb710576")
		)
		(instances
			(project "teensy_rr0_breakout"
				(path "/5a44dcb9-4fc3-4263-b7ee-8bef38a9319f"
					(reference "J4")
					(unit 1)
				)
			)
		)
	)
	(symbol
		(lib_id "Connector_Generic:Conn_01x04")
		(at 43.18 31.75 90)
		(unit 1)
		(exclude_from_sim no)
		(in_bom yes)
		(on_board yes)
		(dnp no)
		(fields_autoplaced yes)
		(uuid "eb17ed79-272b-4d4c-8558-bb4111b3fdf5")
		(property "Reference" "J1"
			(at 44.45 25.4 90)
			(effects
				(font
					(size 1.27 1.27)
				)
			)
		)
		(property "Value" "WIRE0"
			(at 44.45 27.94 90)
			(effects
				(font
					(size 1.27 1.27)
				)
			)
		)
		(property "Footprint" "Connector_JST:JST_XH_S4B-XH-A-1_1x04_P2.50mm_Horizontal"
			(at 43.18 31.75 0)
			(effects
				(font
					(size 1.27 1.27)
				)
				(hide yes)
			)
		)
		(property "Datasheet" "~"
			(at 43.18 31.75 0)
			(effects
				(font
					(size 1.27 1.27)
				)
				(hide yes)
			)
		)
		(property "Description" "Generic connector, single row, 01x04, script generated (kicad-library-utils/schlib/autogen/connector/)"
			(at 43.18 31.75 0)
			(effects
				(font
					(size 1.27 1.27)
				)
				(hide yes)
			)
		)
		(pin "2"
			(uuid "e429d1c2-2f4d-4f78-aaac-9859a5d1cb59")
		)
		(pin "1"
			(uuid "ada0b468-abfa-403e-8705-ca8fc4580767")
		)
		(pin "3"
			(uuid "dfae0eb9-e342-443a-80a0-385ae083c469")
		)
		(pin "4"
			(uuid "0345d799-e9f3-40b8-abc8-0d342fa7db54")
		)
		(instances
			(project "teensy_rr0_breakout"
				(path "/5a44dcb9-4fc3-4263-b7ee-8bef38a9319f"
					(reference "J1")
					(unit 1)
				)
			)
		)
	)
	(sheet_instances
		(path "/"
			(page "1")
		)
	)
)