PCBNEW-LibModule-V1  2024-03-29 19:30:15
# encoding utf-8
Units mm
$INDEX
TEENSY41
$EndINDEX
$MODULE TEENSY41
Po 0 0 0 15 660716c7 00000000 ~~
Li TEENSY41
Cd TEENSY 4.1-5
Kw Integrated Circuit
Sc 0
At STD
AR 
Op 0 0 0
T0 24.130 -7.62 1.27 1.27 0 0.254 N V 21 N "IC**"
T1 24.130 -7.62 1.27 1.27 0 0.254 N I 21 N "TEENSY41"
DS -6.35 1.27 54.61 1.27 0.1 24
DS 54.61 1.27 54.61 -16.51 0.1 24
DS 54.61 -16.51 -6.35 -16.51 0.1 24
DS -6.35 -16.51 -6.35 1.27 0.1 24
DS -7.35 -17.51 55.61 -17.51 0.1 24
DS 55.61 -17.51 55.61 2.27 0.1 24
DS 55.61 2.27 -7.35 2.27 0.1 24
DS -7.35 2.27 -7.35 -17.51 0.1 24
DS -6.35 1.27 54.61 1.27 0.2 21
DS 54.61 1.27 54.61 -16.51 0.2 21
DS 54.61 -16.51 -6.35 -16.51 0.2 21
DS -6.35 -16.51 -6.35 1.27 0.2 21
DS 0 1.9 0 1.9 0.2 21
DS 0.1 1.9 0.1 1.9 0.2 21
DS 0 1.9 0 1.9 0.2 21
DA 0.05 1.9 0.000 1.9 -1800 0.2 21
DA 0.05 1.9 0.100 1.9 -1800 0.2 21
DA 0.05 1.9 0.000 1.9 -1800 0.2 21
$PAD
Po 0.000 -0
Sh "1" C 1.665 1.665 0 0 900
Dr 1.11 0 0
At STD N 00E0FFFF
Ne 0 ""
$EndPAD
$PAD
Po 2.540 -0
Sh "2" C 1.665 1.665 0 0 900
Dr 1.11 0 0
At STD N 00E0FFFF
Ne 0 ""
$EndPAD
$PAD
Po 5.080 -0
Sh "3" C 1.665 1.665 0 0 900
Dr 1.11 0 0
At STD N 00E0FFFF
Ne 0 ""
$EndPAD
$PAD
Po 7.620 -0
Sh "4" C 1.665 1.665 0 0 900
Dr 1.11 0 0
At STD N 00E0FFFF
Ne 0 ""
$EndPAD
$PAD
Po 10.160 -0
Sh "5" C 1.665 1.665 0 0 900
Dr 1.11 0 0
At STD N 00E0FFFF
Ne 0 ""
$EndPAD
$PAD
Po 12.700 -0
Sh "6" C 1.665 1.665 0 0 900
Dr 1.11 0 0
At STD N 00E0FFFF
Ne 0 ""
$EndPAD
$PAD
Po 15.240 -0
Sh "7" C 1.665 1.665 0 0 900
Dr 1.11 0 0
At STD N 00E0FFFF
Ne 0 ""
$EndPAD
$PAD
Po 17.780 -0
Sh "8" C 1.665 1.665 0 0 900
Dr 1.11 0 0
At STD N 00E0FFFF
Ne 0 ""
$EndPAD
$PAD
Po 20.320 -0
Sh "9" C 1.665 1.665 0 0 900
Dr 1.11 0 0
At STD N 00E0FFFF
Ne 0 ""
$EndPAD
$PAD
Po 22.860 -0
Sh "10" C 1.665 1.665 0 0 900
Dr 1.11 0 0
At STD N 00E0FFFF
Ne 0 ""
$EndPAD
$PAD
Po 25.400 -0
Sh "11" C 1.665 1.665 0 0 900
Dr 1.11 0 0
At STD N 00E0FFFF
Ne 0 ""
$EndPAD
$PAD
Po 27.940 -0
Sh "12" C 1.665 1.665 0 0 900
Dr 1.11 0 0
At STD N 00E0FFFF
Ne 0 ""
$EndPAD
$PAD
Po 27.940 -15.24
Sh "13" C 1.665 1.665 0 0 900
Dr 1.11 0 0
At STD N 00E0FFFF
Ne 0 ""
$EndPAD
$PAD
Po 25.400 -15.24
Sh "14" C 1.665 1.665 0 0 900
Dr 1.11 0 0
At STD N 00E0FFFF
Ne 0 ""
$EndPAD
$PAD
Po 22.860 -15.24
Sh "15" C 1.665 1.665 0 0 900
Dr 1.11 0 0
At STD N 00E0FFFF
Ne 0 ""
$EndPAD
$PAD
Po 20.320 -15.24
Sh "16" C 1.665 1.665 0 0 900
Dr 1.11 0 0
At STD N 00E0FFFF
Ne 0 ""
$EndPAD
$PAD
Po 17.780 -15.24
Sh "17" C 1.665 1.665 0 0 900
Dr 1.11 0 0
At STD N 00E0FFFF
Ne 0 ""
$EndPAD
$PAD
Po 15.240 -15.24
Sh "18" C 1.665 1.665 0 0 900
Dr 1.11 0 0
At STD N 00E0FFFF
Ne 0 ""
$EndPAD
$PAD
Po 12.700 -15.24
Sh "19" C 1.665 1.665 0 0 900
Dr 1.11 0 0
At STD N 00E0FFFF
Ne 0 ""
$EndPAD
$PAD
Po 10.160 -15.24
Sh "20" C 1.665 1.665 0 0 900
Dr 1.11 0 0
At STD N 00E0FFFF
Ne 0 ""
$EndPAD
$PAD
Po 7.620 -15.24
Sh "21" C 1.665 1.665 0 0 900
Dr 1.11 0 0
At STD N 00E0FFFF
Ne 0 ""
$EndPAD
$PAD
Po 5.080 -15.24
Sh "22" C 1.665 1.665 0 0 900
Dr 1.11 0 0
At STD N 00E0FFFF
Ne 0 ""
$EndPAD
$PAD
Po 2.540 -15.24
Sh "23" C 1.665 1.665 0 0 900
Dr 1.11 0 0
At STD N 00E0FFFF
Ne 0 ""
$EndPAD
$PAD
Po 33.020 -0
Sh "24" C 1.665 1.665 0 0 900
Dr 1.11 0 0
At STD N 00E0FFFF
Ne 0 ""
$EndPAD
$PAD
Po 35.560 -0
Sh "25" C 1.665 1.665 0 0 900
Dr 1.11 0 0
At STD N 00E0FFFF
Ne 0 ""
$EndPAD
$PAD
Po 38.100 -0
Sh "26" C 1.665 1.665 0 0 900
Dr 1.11 0 0
At STD N 00E0FFFF
Ne 0 ""
$EndPAD
$PAD
Po 40.640 -0
Sh "27" C 1.665 1.665 0 0 900
Dr 1.11 0 0
At STD N 00E0FFFF
Ne 0 ""
$EndPAD
$PAD
Po 43.180 -0
Sh "28" C 1.665 1.665 0 0 900
Dr 1.11 0 0
At STD N 00E0FFFF
Ne 0 ""
$EndPAD
$PAD
Po 45.720 -0
Sh "29" C 1.665 1.665 0 0 900
Dr 1.11 0 0
At STD N 00E0FFFF
Ne 0 ""
$EndPAD
$PAD
Po 48.260 -0
Sh "30" C 1.665 1.665 0 0 900
Dr 1.11 0 0
At STD N 00E0FFFF
Ne 0 ""
$EndPAD
$PAD
Po 50.800 -0
Sh "31" C 1.665 1.665 0 0 900
Dr 1.11 0 0
At STD N 00E0FFFF
Ne 0 ""
$EndPAD
$PAD
Po 53.340 -0
Sh "32" C 1.665 1.665 0 0 900
Dr 1.11 0 0
At STD N 00E0FFFF
Ne 0 ""
$EndPAD
$PAD
Po 53.340 -15.24
Sh "33" C 1.665 1.665 0 0 900
Dr 1.11 0 0
At STD N 00E0FFFF
Ne 0 ""
$EndPAD
$PAD
Po 50.800 -15.24
Sh "34" C 1.665 1.665 0 0 900
Dr 1.11 0 0
At STD N 00E0FFFF
Ne 0 ""
$EndPAD
$PAD
Po 48.260 -15.24
Sh "35" C 1.665 1.665 0 0 900
Dr 1.11 0 0
At STD N 00E0FFFF
Ne 0 ""
$EndPAD
$PAD
Po 45.720 -15.24
Sh "36" C 1.665 1.665 0 0 900
Dr 1.11 0 0
At STD N 00E0FFFF
Ne 0 ""
$EndPAD
$PAD
Po 43.180 -15.24
Sh "37" C 1.665 1.665 0 0 900
Dr 1.11 0 0
At STD N 00E0FFFF
Ne 0 ""
$EndPAD
$PAD
Po 40.640 -15.24
Sh "38" C 1.665 1.665 0 0 900
Dr 1.11 0 0
At STD N 00E0FFFF
Ne 0 ""
$EndPAD
$PAD
Po 38.100 -15.24
Sh "39" C 1.665 1.665 0 0 900
Dr 1.11 0 0
At STD N 00E0FFFF
Ne 0 ""
$EndPAD
$PAD
Po 35.560 -15.24
Sh "40" C 1.665 1.665 0 0 900
Dr 1.11 0 0
At STD N 00E0FFFF
Ne 0 ""
$EndPAD
$PAD
Po 33.020 -15.24
Sh "41" C 1.665 1.665 0 0 900
Dr 1.11 0 0
At STD N 00E0FFFF
Ne 0 ""
$EndPAD
$PAD
Po 30.480 -0
Sh "42" C 1.665 1.665 0 0 900
Dr 1.11 0 0
At STD N 00E0FFFF
Ne 0 ""
$EndPAD
$PAD
Po 40.640 -2.54
Sh "43" C 1.665 1.665 0 0 900
Dr 1.11 0 0
At STD N 00E0FFFF
Ne 0 ""
$EndPAD
$PAD
Po 40.640 -5.08
Sh "44" C 1.665 1.665 0 0 900
Dr 1.11 0 0
At STD N 00E0FFFF
Ne 0 ""
$EndPAD
$PAD
Po 40.640 -7.62
Sh "45" C 1.665 1.665 0 0 900
Dr 1.11 0 0
At STD N 00E0FFFF
Ne 0 ""
$EndPAD
$PAD
Po 40.640 -10.16
Sh "46" C 1.665 1.665 0 0 900
Dr 1.11 0 0
At STD N 00E0FFFF
Ne 0 ""
$EndPAD
$PAD
Po 40.640 -12.7
Sh "47" C 1.665 1.665 0 0 900
Dr 1.11 0 0
At STD N 00E0FFFF
Ne 0 ""
$EndPAD
$PAD
Po 11.430 -3.05
Sh "48" C 1.665 1.665 0 0 900
Dr 1.11 0 0
At STD N 00E0FFFF
Ne 0 ""
$EndPAD
$PAD
Po 8.890 -3.05
Sh "49" C 1.665 1.665 0 0 900
Dr 1.11 0 0
At STD N 00E0FFFF
Ne 0 ""
$EndPAD
$PAD
Po 6.350 -3.05
Sh "50" C 1.665 1.665 0 0 900
Dr 1.11 0 0
At STD N 00E0FFFF
Ne 0 ""
$EndPAD
$PAD
Po 3.810 -3.05
Sh "51" C 1.665 1.665 0 0 900
Dr 1.11 0 0
At STD N 00E0FFFF
Ne 0 ""
$EndPAD
$PAD
Po 1.270 -3.05
Sh "52" C 1.665 1.665 0 0 900
Dr 1.11 0 0
At STD N 00E0FFFF
Ne 0 ""
$EndPAD
$PAD
Po 0.000 -15.24
Sh "53" C 1.665 1.665 0 0 900
Dr 1.11 0 0
At STD N 00E0FFFF
Ne 0 ""
$EndPAD
$PAD
Po -5.080 -15.24
Sh "55" C 1.665 1.665 0 0 900
Dr 1.11 0 0
At STD N 00E0FFFF
Ne 0 ""
$EndPAD
$PAD
Po -2.540 -0
Sh "57" C 1.665 1.665 0 0 900
Dr 1.11 0 0
At STD N 00E0FFFF
Ne 0 ""
$EndPAD
$PAD
Po -2.540 -12.7
Sh "68" C 1.665 1.665 0 0 900
Dr 1.11 0 0
At STD N 00E0FFFF
Ne 0 ""
$EndPAD
$PAD
Po 30.480 -15.24
Sh "69" C 1.665 1.665 0 0 900
Dr 1.11 0 0
At STD N 00E0FFFF
Ne 0 ""
$EndPAD
$PAD
Po -2.540 -15.24
Sh "70" C 1.665 1.665 0 0 900
Dr 1.11 0 0
At STD N 00E0FFFF
Ne 0 ""
$EndPAD
$PAD
Po -5.080 -0
Sh "71" C 1.665 1.665 0 0 900
Dr 1.11 0 0
At STD N 00E0FFFF
Ne 0 ""
$EndPAD
$EndMODULE TEENSY41
$EndLIBRARY
