<?xml version="1.0" encoding="utf-8"?>
<!--/13611771/1293658/2.50/59/4/Integrated Circuit/-->
<!DOCTYPE curve SYSTEM "eagle.dtd">
<eagle version="7.7.0">
<drawing>
<settings>
<setting alwaysvectorfont="no"/>
<setting verticaltext="up"/>
</settings>
<grid distance="0.1" unitdist="inch" unit="inch" style="lines" multiple="1" display="no" altdistance="0.01" altunitdist="inch" altunit="inch"/>
<layers>
<layer number="1" name="Top" color="4" fill="1" visible="yes" active="yes"/>
<layer number="16" name="Bottom" color="1" fill="1" visible="yes" active="yes"/>
<layer number="17" name="Pads" color="2" fill="1" visible="yes" active="yes"/>
<layer number="18" name="Vias" color="2" fill="1" visible="yes" active="yes"/>
<layer number="19" name="Unrouted" color="6" fill="1" visible="yes" active="yes"/>
<layer number="20" name="Dimension" color="15" fill="1" visible="yes" active="yes"/>
<layer number="21" name="tPlace" color="7" fill="1" visible="yes" active="yes"/>
<layer number="22" name="bPlace" color="7" fill="1" visible="yes" active="yes"/>
<layer number="23" name="tOrigins" color="15" fill="1" visible="yes" active="yes"/>
<layer number="24" name="bOrigins" color="15" fill="1" visible="yes" active="yes"/>
<layer number="25" name="tNames" color="7" fill="1" visible="yes" active="yes"/>
<layer number="26" name="bNames" color="7" fill="1" visible="yes" active="yes"/>
<layer number="27" name="tValues" color="7" fill="1" visible="yes" active="yes"/>
<layer number="28" name="bValues" color="7" fill="1" visible="yes" active="yes"/>
<layer number="29" name="tStop" color="7" fill="3" visible="no" active="yes"/>
<layer number="30" name="bStop" color="7" fill="6" visible="no" active="yes"/>
<layer number="31" name="tCream" color="7" fill="4" visible="no" active="yes"/>
<layer number="32" name="bCream" color="7" fill="5" visible="no" active="yes"/>
<layer number="33" name="tFinish" color="6" fill="3" visible="no" active="yes"/>
<layer number="34" name="bFinish" color="6" fill="6" visible="no" active="yes"/>
<layer number="35" name="tGlue" color="7" fill="4" visible="no" active="yes"/>
<layer number="36" name="bGlue" color="7" fill="5" visible="no" active="yes"/>
<layer number="37" name="tTest" color="7" fill="1" visible="no" active="yes"/>
<layer number="38" name="bTest" color="7" fill="1" visible="no" active="yes"/>
<layer number="39" name="tKeepout" color="4" fill="11" visible="yes" active="yes"/>
<layer number="40" name="bKeepout" color="1" fill="11" visible="yes" active="yes"/>
<layer number="41" name="tRestrict" color="4" fill="10" visible="yes" active="yes"/>
<layer number="42" name="bRestrict" color="1" fill="10" visible="yes" active="yes"/>
<layer number="43" name="vRestrict" color="2" fill="10" visible="yes" active="yes"/>
<layer number="44" name="Drills" color="7" fill="1" visible="no" active="yes"/>
<layer number="45" name="Holes" color="7" fill="1" visible="no" active="yes"/>
<layer number="46" name="Milling" color="3" fill="1" visible="no" active="yes"/>
<layer number="47" name="Measures" color="7" fill="1" visible="no" active="yes"/>
<layer number="48" name="Document" color="7" fill="1" visible="yes" active="yes"/>
<layer number="49" name="Reference" color="7" fill="1" visible="yes" active="yes"/>
<layer number="51" name="tDocu" color="7" fill="1" visible="yes" active="yes"/>
<layer number="52" name="bDocu" color="7" fill="1" visible="yes" active="yes"/>
<layer number="90" name="Modules" color="5" fill="1" visible="yes" active="yes"/>
<layer number="91" name="Nets" color="2" fill="1" visible="yes" active="yes"/>
<layer number="92" name="Busses" color="1" fill="1" visible="yes" active="yes"/>
<layer number="93" name="Pins" color="2" fill="1" visible="no" active="yes"/>
<layer number="94" name="Symbols" color="4" fill="1" visible="yes" active="yes"/>
<layer number="95" name="Names" color="7" fill="1" visible="yes" active="yes"/>
<layer number="96" name="Values" color="7" fill="1" visible="yes" active="yes"/>
<layer number="97" name="Info" color="7" fill="1" visible="yes" active="yes"/>
<layer number="98" name="Guide" color="6" fill="1" visible="yes" active="yes"/>
</layers>
<library>
<description>&lt;Teensy 4.1 Development Board&lt;/b&gt;&lt;p&gt;
&lt;author&gt;Created by SamacSys&lt;/author&gt;</description>
<packages>
<package name="TEENSY41">
<description>&lt;b&gt;TEENSY 4.1-5&lt;/b&gt;&lt;br&gt;
</description>
<pad name="1" x="0.000" y="0.000" drill="1.11" diameter="1.665"/>
<pad name="2" x="2.540" y="0.000" drill="1.11" diameter="1.665"/>
<pad name="3" x="5.080" y="0.000" drill="1.11" diameter="1.665"/>
<pad name="4" x="7.620" y="0.000" drill="1.11" diameter="1.665"/>
<pad name="5" x="10.160" y="0.000" drill="1.11" diameter="1.665"/>
<pad name="6" x="12.700" y="0.000" drill="1.11" diameter="1.665"/>
<pad name="7" x="15.240" y="0.000" drill="1.11" diameter="1.665"/>
<pad name="8" x="17.780" y="0.000" drill="1.11" diameter="1.665"/>
<pad name="9" x="20.320" y="0.000" drill="1.11" diameter="1.665"/>
<pad name="10" x="22.860" y="0.000" drill="1.11" diameter="1.665"/>
<pad name="11" x="25.400" y="0.000" drill="1.11" diameter="1.665"/>
<pad name="12" x="27.940" y="0.000" drill="1.11" diameter="1.665"/>
<pad name="13" x="27.940" y="15.240" drill="1.11" diameter="1.665"/>
<pad name="14" x="25.400" y="15.240" drill="1.11" diameter="1.665"/>
<pad name="15" x="22.860" y="15.240" drill="1.11" diameter="1.665"/>
<pad name="16" x="20.320" y="15.240" drill="1.11" diameter="1.665"/>
<pad name="17" x="17.780" y="15.240" drill="1.11" diameter="1.665"/>
<pad name="18" x="15.240" y="15.240" drill="1.11" diameter="1.665"/>
<pad name="19" x="12.700" y="15.240" drill="1.11" diameter="1.665"/>
<pad name="20" x="10.160" y="15.240" drill="1.11" diameter="1.665"/>
<pad name="21" x="7.620" y="15.240" drill="1.11" diameter="1.665"/>
<pad name="22" x="5.080" y="15.240" drill="1.11" diameter="1.665"/>
<pad name="23" x="2.540" y="15.240" drill="1.11" diameter="1.665"/>
<pad name="24" x="33.020" y="0.000" drill="1.11" diameter="1.665"/>
<pad name="25" x="35.560" y="0.000" drill="1.11" diameter="1.665"/>
<pad name="26" x="38.100" y="0.000" drill="1.11" diameter="1.665"/>
<pad name="27" x="40.640" y="0.000" drill="1.11" diameter="1.665"/>
<pad name="28" x="43.180" y="0.000" drill="1.11" diameter="1.665"/>
<pad name="29" x="45.720" y="0.000" drill="1.11" diameter="1.665"/>
<pad name="30" x="48.260" y="0.000" drill="1.11" diameter="1.665"/>
<pad name="31" x="50.800" y="0.000" drill="1.11" diameter="1.665"/>
<pad name="32" x="53.340" y="0.000" drill="1.11" diameter="1.665"/>
<pad name="33" x="53.340" y="15.240" drill="1.11" diameter="1.665"/>
<pad name="34" x="50.800" y="15.240" drill="1.11" diameter="1.665"/>
<pad name="35" x="48.260" y="15.240" drill="1.11" diameter="1.665"/>
<pad name="36" x="45.720" y="15.240" drill="1.11" diameter="1.665"/>
<pad name="37" x="43.180" y="15.240" drill="1.11" diameter="1.665"/>
<pad name="38" x="40.640" y="15.240" drill="1.11" diameter="1.665"/>
<pad name="39" x="38.100" y="15.240" drill="1.11" diameter="1.665"/>
<pad name="40" x="35.560" y="15.240" drill="1.11" diameter="1.665"/>
<pad name="41" x="33.020" y="15.240" drill="1.11" diameter="1.665"/>
<pad name="42" x="30.480" y="0.000" drill="1.11" diameter="1.665"/>
<pad name="43" x="40.640" y="2.540" drill="1.11" diameter="1.665"/>
<pad name="44" x="40.640" y="5.080" drill="1.11" diameter="1.665"/>
<pad name="45" x="40.640" y="7.620" drill="1.11" diameter="1.665"/>
<pad name="46" x="40.640" y="10.160" drill="1.11" diameter="1.665"/>
<pad name="47" x="40.640" y="12.700" drill="1.11" diameter="1.665"/>
<pad name="48" x="11.430" y="3.050" drill="1.11" diameter="1.665"/>
<pad name="49" x="8.890" y="3.050" drill="1.11" diameter="1.665"/>
<pad name="50" x="6.350" y="3.050" drill="1.11" diameter="1.665"/>
<pad name="51" x="3.810" y="3.050" drill="1.11" diameter="1.665"/>
<pad name="52" x="1.270" y="3.050" drill="1.11" diameter="1.665"/>
<pad name="53" x="0.000" y="15.240" drill="1.11" diameter="1.665"/>
<pad name="55" x="-5.080" y="15.240" drill="1.11" diameter="1.665"/>
<pad name="57" x="-2.540" y="0.000" drill="1.11" diameter="1.665"/>
<pad name="68" x="-2.540" y="12.700" drill="1.11" diameter="1.665"/>
<pad name="69" x="30.480" y="15.240" drill="1.11" diameter="1.665"/>
<pad name="70" x="-2.540" y="15.240" drill="1.11" diameter="1.665"/>
<pad name="71" x="-5.080" y="0.000" drill="1.11" diameter="1.665"/>
<text x="24.130" y="7.620" align="center" size="1.27" layer="25" rot="R0" >&gt;NAME</text>
<text x="24.130" y="7.620" align="center" size="1.27" layer="27" rot="R0" >&gt;VALUE</text>
<wire x1="-6.35" y1="-1.27" x2="54.61" y2="-1.27" width="0.1" layer="51"/>
<wire x1="54.61" y1="-1.27" x2="54.61" y2="16.51" width="0.1" layer="51"/>
<wire x1="54.61" y1="16.51" x2="-6.35" y2="16.51" width="0.1" layer="51"/>
<wire x1="-6.35" y1="16.51" x2="-6.35" y2="-1.27" width="0.1" layer="51"/>
<wire x1="-7.35" y1="17.51" x2="55.61" y2="17.51" width="0.1" layer="51"/>
<wire x1="55.61" y1="17.51" x2="55.61" y2="-2.27" width="0.1" layer="51"/>
<wire x1="55.61" y1="-2.27" x2="-7.35" y2="-2.27" width="0.1" layer="51"/>
<wire x1="-7.35" y1="-2.27" x2="-7.35" y2="17.51" width="0.1" layer="51"/>
<wire x1="-6.35" y1="-1.27" x2="54.61" y2="-1.27" width="0.2" layer="21"/>
<wire x1="54.61" y1="-1.27" x2="54.61" y2="16.51" width="0.2" layer="21"/>
<wire x1="54.61" y1="16.51" x2="-6.35" y2="16.51" width="0.2" layer="21"/>
<wire x1="-6.35" y1="16.51" x2="-6.35" y2="-1.27" width="0.2" layer="21"/>
<wire x1="0" y1="-1.9" x2="0" y2="-1.9" width="0.2" layer="21"/>
<wire x1="0.000" y1="-1.900" x2="0.100" y2="-1.900" width="0.2" layer="21" curve="180.0"/>
<wire x1="0.1" y1="-1.9" x2="0.1" y2="-1.9" width="0.2" layer="21"/>
<wire x1="0.100" y1="-1.900" x2="0.000" y2="-1.900" width="0.2" layer="21" curve="180.0"/>
<wire x1="0" y1="-1.9" x2="0" y2="-1.9" width="0.2" layer="21"/>
<wire x1="0.000" y1="-1.900" x2="0.100" y2="-1.900" width="0.2" layer="21" curve="180.0"/>
</package>
</packages>
<symbols>
<symbol name="TEENSY_4.1">
<wire x1="5.08" y1="2.54" x2="48.26" y2="2.54" width="0.254" layer="94"/>
<wire x1="48.26" y1="-76.2" x2="48.26" y2="2.54" width="0.254" layer="94"/>
<wire x1="48.26" y1="-76.2" x2="5.08" y2="-76.2" width="0.254" layer="94"/>
<wire x1="5.08" y1="2.54" x2="5.08" y2="-76.2" width="0.254" layer="94"/>
<text x="49.53" y="7.62" align="center-left" size="1.778" layer="95">&gt;NAME</text>
<text x="49.53" y="5.08" align="center-left" size="1.778" layer="96">&gt;VALUE</text>
<pin name="TX1" x="0" y="0" length="middle" direction="io" rot="R0"/>
<pin name="OUT2" x="0" y="-2.54" length="middle" direction="io" rot="R0"/>
<pin name="LRCLK2" x="0" y="-5.08" length="middle" direction="io" rot="R0"/>
<pin name="BCLK2" x="0" y="-7.62" length="middle" direction="io" rot="R0"/>
<pin name="IN2" x="0" y="-10.16" length="middle" direction="io" rot="R0"/>
<pin name="OUT1D" x="0" y="-12.7" length="middle" direction="io" rot="R0"/>
<pin name="RX2" x="0" y="-15.24" length="middle" direction="io" rot="R0"/>
<pin name="TX2" x="0" y="-17.78" length="middle" direction="io" rot="R0"/>
<pin name="OUT1C" x="0" y="-20.32" length="middle" direction="io" rot="R0"/>
<pin name="CS_1" x="0" y="-22.86" length="middle" direction="io" rot="R0"/>
<pin name="MOSI" x="0" y="-25.4" length="middle" direction="io" rot="R0"/>
<pin name="MISO" x="0" y="-27.94" length="middle" direction="io" rot="R0"/>
<pin name="SCK" x="0" y="-30.48" length="middle" direction="io" rot="R0"/>
<pin name="A0" x="0" y="-33.02" length="middle" direction="io" rot="R0"/>
<pin name="A1" x="0" y="-35.56" length="middle" direction="io" rot="R0"/>
<pin name="A2" x="0" y="-38.1" length="middle" direction="io" rot="R0"/>
<pin name="A3" x="0" y="-40.64" length="middle" direction="io" rot="R0"/>
<pin name="A4" x="0" y="-43.18" length="middle" direction="io" rot="R0"/>
<pin name="A5" x="0" y="-45.72" length="middle" direction="io" rot="R0"/>
<pin name="A6" x="0" y="-48.26" length="middle" direction="io" rot="R0"/>
<pin name="A7" x="0" y="-50.8" length="middle" direction="io" rot="R0"/>
<pin name="A8" x="0" y="-53.34" length="middle" direction="io" rot="R0"/>
<pin name="A9" x="0" y="-55.88" length="middle" direction="io" rot="R0"/>
<pin name="A10" x="0" y="-58.42" length="middle" direction="io" rot="R0"/>
<pin name="A11" x="0" y="-60.96" length="middle" direction="io" rot="R0"/>
<pin name="A12" x="0" y="-63.5" length="middle" direction="io" rot="R0"/>
<pin name="A13" x="0" y="-66.04" length="middle" direction="io" rot="R0"/>
<pin name="RX7" x="0" y="-68.58" length="middle" direction="io" rot="R0"/>
<pin name="TX7" x="0" y="-71.12" length="middle" direction="io" rot="R0"/>
<pin name="CRX3" x="0" y="-73.66" length="middle" direction="io" rot="R0"/>
<pin name="CTX3" x="53.34" y="0" length="middle" direction="io" rot="R180"/>
<pin name="OUT1B" x="53.34" y="-2.54" length="middle" direction="io" rot="R180"/>
<pin name="MCLK2" x="53.34" y="-5.08" length="middle" direction="io" rot="R180"/>
<pin name="RX8" x="53.34" y="-7.62" length="middle" direction="io" rot="R180"/>
<pin name="TX8" x="53.34" y="-10.16" length="middle" direction="io" rot="R180"/>
<pin name="CS_2" x="53.34" y="-12.7" length="middle" direction="io" rot="R180"/>
<pin name="CS_3" x="53.34" y="-15.24" length="middle" direction="io" rot="R180"/>
<pin name="A14" x="53.34" y="-17.78" length="middle" direction="io" rot="R180"/>
<pin name="A15" x="53.34" y="-20.32" length="middle" direction="io" rot="R180"/>
<pin name="A16" x="53.34" y="-22.86" length="middle" direction="io" rot="R180"/>
<pin name="A17" x="53.34" y="-25.4" length="middle" direction="io" rot="R180"/>
<pin name="3.3V_1" x="53.34" y="-27.94" length="middle" direction="io" rot="R180"/>
<pin name="VBAT" x="53.34" y="-30.48" length="middle" direction="io" rot="R180"/>
<pin name="3.3V_2" x="53.34" y="-33.02" length="middle" direction="io" rot="R180"/>
<pin name="GND_1" x="53.34" y="-35.56" length="middle" direction="io" rot="R180"/>
<pin name="PROGRAM" x="53.34" y="-38.1" length="middle" direction="io" rot="R180"/>
<pin name="ON/OFF" x="53.34" y="-40.64" length="middle" direction="io" rot="R180"/>
<pin name="GND_2" x="53.34" y="-43.18" length="middle" direction="io" rot="R180"/>
<pin name="GND_3" x="53.34" y="-45.72" length="middle" direction="io" rot="R180"/>
<pin name="D+" x="53.34" y="-48.26" length="middle" direction="io" rot="R180"/>
<pin name="D-" x="53.34" y="-50.8" length="middle" direction="io" rot="R180"/>
<pin name="+5V" x="53.34" y="-53.34" length="middle" direction="io" rot="R180"/>
<pin name="3.3V_(250_M_A_MAX)" x="53.34" y="-55.88" length="middle" direction="io" rot="R180"/>
<pin name="VIN_(3.6_TO_5.5_VOLTS)" x="53.34" y="-58.42" length="middle" direction="io" rot="R180"/>
<pin name="RX1" x="53.34" y="-60.96" length="middle" direction="io" rot="R180"/>
<pin name="VUSB" x="53.34" y="-63.5" length="middle" direction="io" rot="R180"/>
<pin name="GND_4" x="53.34" y="-66.04" length="middle" direction="io" rot="R180"/>
<pin name="GND_5" x="53.34" y="-68.58" length="middle" direction="io" rot="R180"/>
<pin name="GND_6" x="53.34" y="-71.12" length="middle" direction="io" rot="R180"/>
</symbol>
</symbols>
<devicesets>
<deviceset name="TEENSY_4.1" prefix="IC">
<description>&lt;b&gt;Teensy 4.1 Development Board&lt;/b&gt;&lt;p&gt;
Source: &lt;a href="https://www.pjrc.com/store/teensy41.html"&gt; Datasheet &lt;/a&gt;</description>
<gates>
<gate name="G$1" symbol="TEENSY_4.1" x="0" y="0"/>
</gates>
<devices>
<device name="" package="TEENSY41">
<connects>
<connect gate="G$1" pin="TX1" pad="1"/>
<connect gate="G$1" pin="OUT2" pad="2"/>
<connect gate="G$1" pin="LRCLK2" pad="3"/>
<connect gate="G$1" pin="BCLK2" pad="4"/>
<connect gate="G$1" pin="IN2" pad="5"/>
<connect gate="G$1" pin="OUT1D" pad="6"/>
<connect gate="G$1" pin="RX2" pad="7"/>
<connect gate="G$1" pin="TX2" pad="8"/>
<connect gate="G$1" pin="OUT1C" pad="9"/>
<connect gate="G$1" pin="CS_1" pad="10"/>
<connect gate="G$1" pin="MOSI" pad="11"/>
<connect gate="G$1" pin="MISO" pad="12"/>
<connect gate="G$1" pin="SCK" pad="13"/>
<connect gate="G$1" pin="A0" pad="14"/>
<connect gate="G$1" pin="A1" pad="15"/>
<connect gate="G$1" pin="A2" pad="16"/>
<connect gate="G$1" pin="A3" pad="17"/>
<connect gate="G$1" pin="A4" pad="18"/>
<connect gate="G$1" pin="A5" pad="19"/>
<connect gate="G$1" pin="A6" pad="20"/>
<connect gate="G$1" pin="A7" pad="21"/>
<connect gate="G$1" pin="A8" pad="22"/>
<connect gate="G$1" pin="A9" pad="23"/>
<connect gate="G$1" pin="A10" pad="24"/>
<connect gate="G$1" pin="A11" pad="25"/>
<connect gate="G$1" pin="A12" pad="26"/>
<connect gate="G$1" pin="A13" pad="27"/>
<connect gate="G$1" pin="RX7" pad="28"/>
<connect gate="G$1" pin="TX7" pad="29"/>
<connect gate="G$1" pin="CRX3" pad="30"/>
<connect gate="G$1" pin="CTX3" pad="31"/>
<connect gate="G$1" pin="OUT1B" pad="32"/>
<connect gate="G$1" pin="MCLK2" pad="33"/>
<connect gate="G$1" pin="RX8" pad="34"/>
<connect gate="G$1" pin="TX8" pad="35"/>
<connect gate="G$1" pin="CS_2" pad="36"/>
<connect gate="G$1" pin="CS_3" pad="37"/>
<connect gate="G$1" pin="A14" pad="38"/>
<connect gate="G$1" pin="A15" pad="39"/>
<connect gate="G$1" pin="A16" pad="40"/>
<connect gate="G$1" pin="A17" pad="41"/>
<connect gate="G$1" pin="3.3V_1" pad="42"/>
<connect gate="G$1" pin="VBAT" pad="43"/>
<connect gate="G$1" pin="3.3V_2" pad="44"/>
<connect gate="G$1" pin="GND_1" pad="45"/>
<connect gate="G$1" pin="PROGRAM" pad="46"/>
<connect gate="G$1" pin="ON/OFF" pad="47"/>
<connect gate="G$1" pin="GND_2" pad="48"/>
<connect gate="G$1" pin="GND_3" pad="49"/>
<connect gate="G$1" pin="D+" pad="50"/>
<connect gate="G$1" pin="D-" pad="51"/>
<connect gate="G$1" pin="+5V" pad="52"/>
<connect gate="G$1" pin="3.3V_(250_M_A_MAX)" pad="53"/>
<connect gate="G$1" pin="VIN_(3.6_TO_5.5_VOLTS)" pad="55"/>
<connect gate="G$1" pin="RX1" pad="57"/>
<connect gate="G$1" pin="VUSB" pad="68"/>
<connect gate="G$1" pin="GND_4" pad="69"/>
<connect gate="G$1" pin="GND_5" pad="70"/>
<connect gate="G$1" pin="GND_6" pad="71"/>
</connects>
<technologies>
<technology name="">
<attribute name="Manufacturer_Name" value="PJRC" constant="no"/>
<attribute name="Manufacturer_Part_Number" value="TEENSY 4.1" constant="no"/>
<attribute name="Mouser_Part_Number" value="" constant="no"/>
<attribute name="Mouser_Price-Stock" value="" constant="no"/>
<attribute name="Arrow_Part_Number" value="" constant="no"/>
<attribute name="Arrow_Price-Stock" value="" constant="no"/>
<attribute name="Description" value="Teensy 4.1 Development Board" constant="no"/>
<attribute name="Height" value="mm" constant="no"/>
</technology>
</technologies>
</device>
</devices>
</deviceset>
</devicesets>
</library>
</drawing>
</eagle>
