%TF.GenerationSoftware,KiCad,Pcbnew,8.0.1-8.0.1-0~ubuntu20.04.1*%
%TF.CreationDate,2024-03-30T18:44:03-05:00*%
%TF.ProjectId,teensy_rr0_breakout,7465656e-7379-45f7-9272-305f62726561,rev?*%
%TF.SameCoordinates,Original*%
%TF.FileFunction,Copper,L2,Bot*%
%TF.FilePolarity,Positive*%
%FSLAX46Y46*%
G04 Gerber Fmt 4.6, Leading zero omitted, Abs format (unit mm)*
G04 Created by KiCad (PCBNEW 8.0.1-8.0.1-0~ubuntu20.04.1) date 2024-03-30 18:44:03*
%MOMM*%
%LPD*%
G01*
G04 APERTURE LIST*
G04 Aperture macros list*
%AMRoundRect*
0 Rectangle with rounded corners*
0 $1 Rounding radius*
0 $2 $3 $4 $5 $6 $7 $8 $9 X,Y pos of 4 corners*
0 Add a 4 corners polygon primitive as box body*
4,1,4,$2,$3,$4,$5,$6,$7,$8,$9,$2,$3,0*
0 Add four circle primitives for the rounded corners*
1,1,$1+$1,$2,$3*
1,1,$1+$1,$4,$5*
1,1,$1+$1,$6,$7*
1,1,$1+$1,$8,$9*
0 Add four rect primitives between the rounded corners*
20,1,$1+$1,$2,$3,$4,$5,0*
20,1,$1+$1,$4,$5,$6,$7,0*
20,1,$1+$1,$6,$7,$8,$9,0*
20,1,$1+$1,$8,$9,$2,$3,0*%
G04 Aperture macros list end*
%TA.AperFunction,ComponentPad*%
%ADD10RoundRect,0.250000X0.725000X-0.600000X0.725000X0.600000X-0.725000X0.600000X-0.725000X-0.600000X0*%
%TD*%
%TA.AperFunction,ComponentPad*%
%ADD11O,1.950000X1.700000*%
%TD*%
%TA.AperFunction,ComponentPad*%
%ADD12RoundRect,0.250000X-0.750000X0.600000X-0.750000X-0.600000X0.750000X-0.600000X0.750000X0.600000X0*%
%TD*%
%TA.AperFunction,ComponentPad*%
%ADD13O,2.000000X1.700000*%
%TD*%
%TA.AperFunction,ComponentPad*%
%ADD14C,1.665000*%
%TD*%
%TA.AperFunction,ComponentPad*%
%ADD15RoundRect,0.250000X-0.725000X0.600000X-0.725000X-0.600000X0.725000X-0.600000X0.725000X0.600000X0*%
%TD*%
%TA.AperFunction,ComponentPad*%
%ADD16RoundRect,0.250000X-0.600000X-0.725000X0.600000X-0.725000X0.600000X0.725000X-0.600000X0.725000X0*%
%TD*%
%TA.AperFunction,ComponentPad*%
%ADD17O,1.700000X1.950000*%
%TD*%
G04 APERTURE END LIST*
D10*
%TO.P,J2,1,Pin_1*%
%TO.N,/3.3V_(250_M_A_MAX)*%
X157650000Y-94500000D03*
D11*
%TO.P,J2,2,Pin_2*%
%TO.N,/A2*%
X157650000Y-92000000D03*
%TO.P,J2,3,Pin_3*%
%TO.N,0*%
X157650000Y-89500000D03*
%TO.P,J2,4,Pin_4*%
%TO.N,/A3*%
X157650000Y-87000000D03*
%TD*%
D12*
%TO.P,J4,1,Pin_1*%
%TO.N,/VIN_(3.6_TO_5.5_VOLTS)*%
X123950000Y-65250000D03*
D13*
%TO.P,J4,2,Pin_2*%
%TO.N,0*%
X123950000Y-67750000D03*
%TD*%
D14*
%TO.P,USB FACES THIS WAY,1,TX1*%
%TO.N,/TX1*%
X132880000Y-64370000D03*
%TO.P,USB FACES THIS WAY,2,OUT2*%
%TO.N,/OUT2*%
X132880000Y-66910000D03*
%TO.P,USB FACES THIS WAY,3,LRCLK2*%
%TO.N,/LRCLK2*%
X132880000Y-69450000D03*
%TO.P,USB FACES THIS WAY,4,BCLK2*%
%TO.N,/BCLK2*%
X132880000Y-71990000D03*
%TO.P,USB FACES THIS WAY,5,IN2*%
%TO.N,/IN2*%
X132880000Y-74530000D03*
%TO.P,USB FACES THIS WAY,6,OUT1D*%
%TO.N,/OUT1D*%
X132880000Y-77070000D03*
%TO.P,USB FACES THIS WAY,7,RX2*%
%TO.N,/RX2*%
X132880000Y-79610000D03*
%TO.P,USB FACES THIS WAY,8,TX2*%
%TO.N,/TX2*%
X132880000Y-82150000D03*
%TO.P,USB FACES THIS WAY,9,OUT1C*%
%TO.N,/OUT1C*%
X132880000Y-84690000D03*
%TO.P,USB FACES THIS WAY,10,CS_1*%
%TO.N,/CS_1*%
X132880000Y-87230000D03*
%TO.P,USB FACES THIS WAY,11,MOSI*%
%TO.N,/MOSI*%
X132880000Y-89770000D03*
%TO.P,USB FACES THIS WAY,12,MISO*%
%TO.N,/MISO*%
X132880000Y-92310000D03*
%TO.P,USB FACES THIS WAY,13,SCK*%
%TO.N,/SCK*%
X148120000Y-92310000D03*
%TO.P,USB FACES THIS WAY,14,A0*%
%TO.N,/A0*%
X148120000Y-89770000D03*
%TO.P,USB FACES THIS WAY,15,A1*%
%TO.N,/A1*%
X148120000Y-87230000D03*
%TO.P,USB FACES THIS WAY,16,A2*%
%TO.N,/A2*%
X148120000Y-84690000D03*
%TO.P,USB FACES THIS WAY,17,A3*%
%TO.N,/A3*%
X148120000Y-82150000D03*
%TO.P,USB FACES THIS WAY,18,A4*%
%TO.N,/A4*%
X148120000Y-79610000D03*
%TO.P,USB FACES THIS WAY,19,A5*%
%TO.N,/A5*%
X148120000Y-77070000D03*
%TO.P,USB FACES THIS WAY,20,A6*%
%TO.N,/A6*%
X148120000Y-74530000D03*
%TO.P,USB FACES THIS WAY,21,A7*%
%TO.N,/A7*%
X148120000Y-71990000D03*
%TO.P,USB FACES THIS WAY,22,A8*%
%TO.N,/A8*%
X148120000Y-69450000D03*
%TO.P,USB FACES THIS WAY,23,A9*%
%TO.N,/A9*%
X148120000Y-66910000D03*
%TO.P,USB FACES THIS WAY,24,A10*%
%TO.N,/A10*%
X132880000Y-97390000D03*
%TO.P,USB FACES THIS WAY,25,A11*%
%TO.N,/A11*%
X132880000Y-99930000D03*
%TO.P,USB FACES THIS WAY,26,A12*%
%TO.N,/A12*%
X132880000Y-102470000D03*
%TO.P,USB FACES THIS WAY,27,A13*%
%TO.N,/A13*%
X132880000Y-105010000D03*
%TO.P,USB FACES THIS WAY,28,RX7*%
%TO.N,/RX7*%
X132880000Y-107550000D03*
%TO.P,USB FACES THIS WAY,29,TX7*%
%TO.N,/TX7*%
X132880000Y-110090000D03*
%TO.P,USB FACES THIS WAY,30,CRX3*%
%TO.N,/CRX3*%
X132880000Y-112630000D03*
%TO.P,USB FACES THIS WAY,31,CTX3*%
%TO.N,/CTX3*%
X132880000Y-115170000D03*
%TO.P,USB FACES THIS WAY,32,OUT1B*%
%TO.N,/OUT1B*%
X132880000Y-117710000D03*
%TO.P,USB FACES THIS WAY,33,MCLK2*%
%TO.N,/MCLK2*%
X148120000Y-117710000D03*
%TO.P,USB FACES THIS WAY,34,RX8*%
%TO.N,/RX8*%
X148120000Y-115170000D03*
%TO.P,USB FACES THIS WAY,35,TX8*%
%TO.N,/TX8*%
X148120000Y-112630000D03*
%TO.P,USB FACES THIS WAY,36,CS_2*%
%TO.N,/CS_2*%
X148120000Y-110090000D03*
%TO.P,USB FACES THIS WAY,37,CS_3*%
%TO.N,/CS_3*%
X148120000Y-107550000D03*
%TO.P,USB FACES THIS WAY,38,A14*%
%TO.N,/A14*%
X148120000Y-105010000D03*
%TO.P,USB FACES THIS WAY,39,A15*%
%TO.N,/A15*%
X148120000Y-102470000D03*
%TO.P,USB FACES THIS WAY,40,A16*%
%TO.N,/A16*%
X148120000Y-99930000D03*
%TO.P,USB FACES THIS WAY,41,A17*%
%TO.N,/A17*%
X148120000Y-97390000D03*
%TO.P,USB FACES THIS WAY,42,3.3V_1*%
%TO.N,/3.3V_(250_M_A_MAX)*%
X132880000Y-94850000D03*
%TO.P,USB FACES THIS WAY,53,3.3V_(250_M_A_MAX)*%
X148120000Y-64370000D03*
%TO.P,USB FACES THIS WAY,55,VIN_(3.6_TO_5.5_VOLTS)*%
%TO.N,/VIN_(3.6_TO_5.5_VOLTS)*%
X148120000Y-59290000D03*
%TO.P,USB FACES THIS WAY,57,RX1*%
%TO.N,/RX1*%
X132880000Y-61830000D03*
%TO.P,USB FACES THIS WAY,69,GND_4*%
%TO.N,0*%
X148120000Y-94850000D03*
%TO.P,USB FACES THIS WAY,70,GND_5*%
X148120000Y-61830000D03*
%TO.P,USB FACES THIS WAY,71,GND_6*%
X132880000Y-59290000D03*
%TD*%
D11*
%TO.P,J1,4,Pin_4*%
%TO.N,/A4*%
X123000000Y-94500000D03*
%TO.P,J1,3,Pin_3*%
%TO.N,0*%
X123000000Y-92000000D03*
%TO.P,J1,2,Pin_2*%
%TO.N,/A5*%
X123000000Y-89500000D03*
D15*
%TO.P,J1,1,Pin_1*%
%TO.N,/3.3V_(250_M_A_MAX)*%
X123000000Y-87000000D03*
%TD*%
D16*
%TO.P,J3,1,Pin_1*%
%TO.N,/3.3V_(250_M_A_MAX)*%
X138250000Y-127500000D03*
D17*
%TO.P,J3,2,Pin_2*%
%TO.N,/A10*%
X140750000Y-127500000D03*
%TO.P,J3,3,Pin_3*%
%TO.N,0*%
X143250000Y-127500000D03*
%TO.P,J3,4,Pin_4*%
%TO.N,/A11*%
X145750000Y-127500000D03*
%TD*%
%TA.AperFunction,Conductor*%
%TO.N,0*%
G36*
X165943039Y-53019685D02*
G01*
X165988794Y-53072489D01*
X166000000Y-53124000D01*
X166000000Y-135376000D01*
X165980315Y-135443039D01*
X165927511Y-135488794D01*
X165876000Y-135500000D01*
X114624000Y-135500000D01*
X114556961Y-135480315D01*
X114511206Y-135427511D01*
X114500000Y-135376000D01*
X114500000Y-131613219D01*
X116272500Y-131613219D01*
X116272501Y-131613235D01*
X116302056Y-131837731D01*
X116302057Y-131837736D01*
X116302058Y-131837742D01*
X116302059Y-131837744D01*
X116360667Y-132056476D01*
X116447322Y-132265681D01*
X116447329Y-132265696D01*
X116560553Y-132461806D01*
X116698408Y-132641462D01*
X116698414Y-132641469D01*
X116858530Y-132801585D01*
X116858537Y-132801591D01*
X117038193Y-132939446D01*
X117234303Y-133052670D01*
X117234318Y-133052677D01*
X117342507Y-133097490D01*
X117443522Y-133139332D01*
X117662258Y-133197942D01*
X117886774Y-133227500D01*
X117886781Y-133227500D01*
X118113219Y-133227500D01*
X118113226Y-133227500D01*
X118337742Y-133197942D01*
X118556478Y-133139332D01*
X118765693Y-133052672D01*
X118961807Y-132939446D01*
X119141464Y-132801590D01*
X119301590Y-132641464D01*
X119439446Y-132461807D01*
X119552672Y-132265693D01*
X119639332Y-132056478D01*
X119697942Y-131837742D01*
X119727500Y-131613226D01*
X119727500Y-131613219D01*
X160772500Y-131613219D01*
X160772501Y-131613235D01*
X160802056Y-131837731D01*
X160802057Y-131837736D01*
X160802058Y-131837742D01*
X160802059Y-131837744D01*
X160860667Y-132056476D01*
X160947322Y-132265681D01*
X160947329Y-132265696D01*
X161060553Y-132461806D01*
X161198408Y-132641462D01*
X161198414Y-132641469D01*
X161358530Y-132801585D01*
X161358537Y-132801591D01*
X161538193Y-132939446D01*
X161734303Y-133052670D01*
X161734318Y-133052677D01*
X161842507Y-133097490D01*
X161943522Y-133139332D01*
X162162258Y-133197942D01*
X162386774Y-133227500D01*
X162386781Y-133227500D01*
X162613219Y-133227500D01*
X162613226Y-133227500D01*
X162837742Y-133197942D01*
X163056478Y-133139332D01*
X163265693Y-133052672D01*
X163461807Y-132939446D01*
X163641464Y-132801590D01*
X163801590Y-132641464D01*
X163939446Y-132461807D01*
X164052672Y-132265693D01*
X164139332Y-132056478D01*
X164197942Y-131837742D01*
X164227500Y-131613226D01*
X164227500Y-131386774D01*
X164197942Y-131162258D01*
X164139332Y-130943522D01*
X164052672Y-130734307D01*
X163939446Y-130538193D01*
X163801590Y-130358536D01*
X163801585Y-130358530D01*
X163641469Y-130198414D01*
X163641462Y-130198408D01*
X163461806Y-130060553D01*
X163265696Y-129947329D01*
X163265681Y-129947322D01*
X163056476Y-129860667D01*
X162947110Y-129831363D01*
X162837742Y-129802058D01*
X162837736Y-129802057D01*
X162837731Y-129802056D01*
X162613235Y-129772501D01*
X162613232Y-129772500D01*
X162613226Y-129772500D01*
X162386774Y-129772500D01*
X162386768Y-129772500D01*
X162386764Y-129772501D01*
X162162268Y-129802056D01*
X162162261Y-129802057D01*
X162162258Y-129802058D01*
X162116031Y-129814444D01*
X161943523Y-129860667D01*
X161734318Y-129947322D01*
X161734303Y-129947329D01*
X161538193Y-130060553D01*
X161358537Y-130198408D01*
X161358530Y-130198414D01*
X161198414Y-130358530D01*
X161198408Y-130358537D01*
X161060553Y-130538193D01*
X160947329Y-130734303D01*
X160947322Y-130734318D01*
X160860667Y-130943523D01*
X160802059Y-131162255D01*
X160802056Y-131162268D01*
X160772501Y-131386764D01*
X160772500Y-131386780D01*
X160772500Y-131613219D01*
X119727500Y-131613219D01*
X119727500Y-131386774D01*
X119697942Y-131162258D01*
X119639332Y-130943522D01*
X119552672Y-130734307D01*
X119439446Y-130538193D01*
X119301590Y-130358536D01*
X119301585Y-130358530D01*
X119141469Y-130198414D01*
X119141462Y-130198408D01*
X118961806Y-130060553D01*
X118765696Y-129947329D01*
X118765681Y-129947322D01*
X118556476Y-129860667D01*
X118447110Y-129831363D01*
X118337742Y-129802058D01*
X118337736Y-129802057D01*
X118337731Y-129802056D01*
X118113235Y-129772501D01*
X118113232Y-129772500D01*
X118113226Y-129772500D01*
X117886774Y-129772500D01*
X117886768Y-129772500D01*
X117886764Y-129772501D01*
X117662268Y-129802056D01*
X117662261Y-129802057D01*
X117662258Y-129802058D01*
X117616031Y-129814444D01*
X117443523Y-129860667D01*
X117234318Y-129947322D01*
X117234303Y-129947329D01*
X117038193Y-130060553D01*
X116858537Y-130198408D01*
X116858530Y-130198414D01*
X116698414Y-130358530D01*
X116698408Y-130358537D01*
X116560553Y-130538193D01*
X116447329Y-130734303D01*
X116447322Y-130734318D01*
X116360667Y-130943523D01*
X116302059Y-131162255D01*
X116302056Y-131162268D01*
X116272501Y-131386764D01*
X116272500Y-131386780D01*
X116272500Y-131613219D01*
X114500000Y-131613219D01*
X114500000Y-128279269D01*
X137199500Y-128279269D01*
X137202353Y-128309699D01*
X137202353Y-128309701D01*
X137247206Y-128437880D01*
X137247207Y-128437882D01*
X137327850Y-128547150D01*
X137437118Y-128627793D01*
X137458089Y-128635131D01*
X137565299Y-128672646D01*
X137595730Y-128675500D01*
X137595734Y-128675500D01*
X138904270Y-128675500D01*
X138934699Y-128672646D01*
X138934701Y-128672646D01*
X138998790Y-128650219D01*
X139062882Y-128627793D01*
X139172150Y-128547150D01*
X139252793Y-128437882D01*
X139289648Y-128332557D01*
X139297646Y-128309701D01*
X139297646Y-128309699D01*
X139300500Y-128279269D01*
X139300500Y-127728469D01*
X139699500Y-127728469D01*
X139739868Y-127931412D01*
X139739870Y-127931420D01*
X139757921Y-127975000D01*
X139819059Y-128122598D01*
X139832836Y-128143217D01*
X139934024Y-128294657D01*
X140080342Y-128440975D01*
X140080345Y-128440977D01*
X140252402Y-128555941D01*
X140443580Y-128635130D01*
X140632187Y-128672646D01*
X140646530Y-128675499D01*
X140646534Y-128675500D01*
X140646535Y-128675500D01*
X140853466Y-128675500D01*
X140853467Y-128675499D01*
X141056420Y-128635130D01*
X141247598Y-128555941D01*
X141419655Y-128440977D01*
X141565977Y-128294655D01*
X141680941Y-128122598D01*
X141726748Y-128012009D01*
X141770589Y-127957606D01*
X141836883Y-127935541D01*
X141904582Y-127952820D01*
X141952193Y-128003957D01*
X141959240Y-128021144D01*
X141998904Y-128143216D01*
X142095379Y-128332557D01*
X142220272Y-128504459D01*
X142220276Y-128504464D01*
X142370535Y-128654723D01*
X142370540Y-128654727D01*
X142542442Y-128779620D01*
X142731782Y-128876095D01*
X142933871Y-128941757D01*
X143000000Y-128952231D01*
X143000000Y-127904145D01*
X143066657Y-127942630D01*
X143187465Y-127975000D01*
X143312535Y-127975000D01*
X143433343Y-127942630D01*
X143500000Y-127904145D01*
X143500000Y-128952230D01*
X143566126Y-128941757D01*
X143566129Y-128941757D01*
X143768217Y-128876095D01*
X143957557Y-128779620D01*
X144129459Y-128654727D01*
X144129464Y-128654723D01*
X144279723Y-128504464D01*
X144279727Y-128504459D01*
X144404620Y-128332557D01*
X144501095Y-128143217D01*
X144540759Y-128021144D01*
X144580196Y-127963469D01*
X144644555Y-127936270D01*
X144713401Y-127948184D01*
X144764877Y-127995428D01*
X144773251Y-128012009D01*
X144819057Y-128122596D01*
X144934024Y-128294657D01*
X145080342Y-128440975D01*
X145080345Y-128440977D01*
X145252402Y-128555941D01*
X145443580Y-128635130D01*
X145632187Y-128672646D01*
X145646530Y-128675499D01*
X145646534Y-128675500D01*
X145646535Y-128675500D01*
X145853466Y-128675500D01*
X145853467Y-128675499D01*
X146056420Y-128635130D01*
X146247598Y-128555941D01*
X146419655Y-128440977D01*
X146565977Y-128294655D01*
X146680941Y-128122598D01*
X146760130Y-127931420D01*
X146800500Y-127728465D01*
X146800500Y-127271535D01*
X146760130Y-127068580D01*
X146680941Y-126877402D01*
X146565977Y-126705345D01*
X146565975Y-126705342D01*
X146419657Y-126559024D01*
X146324638Y-126495535D01*
X146247598Y-126444059D01*
X146056420Y-126364870D01*
X146056412Y-126364868D01*
X145853469Y-126324500D01*
X145853465Y-126324500D01*
X145646535Y-126324500D01*
X145646530Y-126324500D01*
X145443587Y-126364868D01*
X145443579Y-126364870D01*
X145252403Y-126444058D01*
X145080342Y-126559024D01*
X144934024Y-126705342D01*
X144819057Y-126877404D01*
X144773251Y-126987990D01*
X144729409Y-127042394D01*
X144663115Y-127064458D01*
X144595416Y-127047178D01*
X144547806Y-126996041D01*
X144540759Y-126978855D01*
X144501095Y-126856782D01*
X144404620Y-126667442D01*
X144279727Y-126495540D01*
X144279723Y-126495535D01*
X144129464Y-126345276D01*
X144129459Y-126345272D01*
X143957557Y-126220379D01*
X143768215Y-126123903D01*
X143566124Y-126058241D01*
X143500000Y-126047768D01*
X143500000Y-127095854D01*
X143433343Y-127057370D01*
X143312535Y-127025000D01*
X143187465Y-127025000D01*
X143066657Y-127057370D01*
X143000000Y-127095854D01*
X143000000Y-126047768D01*
X142999999Y-126047768D01*
X142933875Y-126058241D01*
X142731784Y-126123903D01*
X142542442Y-126220379D01*
X142370540Y-126345272D01*
X142370535Y-126345276D01*
X142220276Y-126495535D01*
X142220272Y-126495540D01*
X142095379Y-126667442D01*
X141998905Y-126856781D01*
X141959240Y-126978856D01*
X141919802Y-127036531D01*
X141855443Y-127063729D01*
X141786597Y-127051814D01*
X141735121Y-127004570D01*
X141726748Y-126987990D01*
X141722964Y-126978855D01*
X141680941Y-126877402D01*
X141565977Y-126705345D01*
X141565975Y-126705342D01*
X141419657Y-126559024D01*
X141324638Y-126495535D01*
X141247598Y-126444059D01*
X141056420Y-126364870D01*
X141056412Y-126364868D01*
X140853469Y-126324500D01*
X140853465Y-126324500D01*
X140646535Y-126324500D01*
X140646530Y-126324500D01*
X140443587Y-126364868D01*
X140443579Y-126364870D01*
X140252403Y-126444058D01*
X140080342Y-126559024D01*
X139934024Y-126705342D01*
X139819058Y-126877403D01*
X139739870Y-127068579D01*
X139739868Y-127068587D01*
X139699500Y-127271530D01*
X139699500Y-127728469D01*
X139300500Y-127728469D01*
X139300500Y-126720730D01*
X139297646Y-126690300D01*
X139297646Y-126690298D01*
X139252793Y-126562119D01*
X139252792Y-126562117D01*
X139172150Y-126452850D01*
X139062882Y-126372207D01*
X139062880Y-126372206D01*
X138934700Y-126327353D01*
X138904270Y-126324500D01*
X138904266Y-126324500D01*
X137595734Y-126324500D01*
X137595730Y-126324500D01*
X137565300Y-126327353D01*
X137565298Y-126327353D01*
X137437119Y-126372206D01*
X137437117Y-126372207D01*
X137327850Y-126452850D01*
X137247207Y-126562117D01*
X137247206Y-126562119D01*
X137202353Y-126690298D01*
X137202353Y-126690300D01*
X137199500Y-126720730D01*
X137199500Y-128279269D01*
X114500000Y-128279269D01*
X114500000Y-117710000D01*
X131842002Y-117710000D01*
X131861946Y-117912501D01*
X131921016Y-118107229D01*
X132016932Y-118286675D01*
X132016936Y-118286682D01*
X132146024Y-118443975D01*
X132303317Y-118573063D01*
X132303324Y-118573067D01*
X132482770Y-118668983D01*
X132482772Y-118668983D01*
X132482775Y-118668985D01*
X132677497Y-118728053D01*
X132677496Y-118728053D01*
X132695652Y-118729841D01*
X132880000Y-118747998D01*
X133082503Y-118728053D01*
X133277225Y-118668985D01*
X133456681Y-118573064D01*
X133613975Y-118443975D01*
X133743064Y-118286681D01*
X133838985Y-118107225D01*
X133898053Y-117912503D01*
X133917998Y-117710000D01*
X147082002Y-117710000D01*
X147101946Y-117912501D01*
X147161016Y-118107229D01*
X147256932Y-118286675D01*
X147256936Y-118286682D01*
X147386024Y-118443975D01*
X147543317Y-118573063D01*
X147543324Y-118573067D01*
X147722770Y-118668983D01*
X147722772Y-118668983D01*
X147722775Y-118668985D01*
X147917497Y-118728053D01*
X147917496Y-118728053D01*
X147935652Y-118729841D01*
X148120000Y-118747998D01*
X148322503Y-118728053D01*
X148517225Y-118668985D01*
X148696681Y-118573064D01*
X148853975Y-118443975D01*
X148983064Y-118286681D01*
X149078985Y-118107225D01*
X149138053Y-117912503D01*
X149157998Y-117710000D01*
X149138053Y-117507497D01*
X149078985Y-117312775D01*
X149078983Y-117312772D01*
X149078983Y-117312770D01*
X148983067Y-117133324D01*
X148983063Y-117133317D01*
X148853975Y-116976024D01*
X148696682Y-116846936D01*
X148696675Y-116846932D01*
X148517229Y-116751016D01*
X148419864Y-116721481D01*
X148322503Y-116691947D01*
X148322501Y-116691946D01*
X148322503Y-116691946D01*
X148120000Y-116672002D01*
X147917498Y-116691946D01*
X147722770Y-116751016D01*
X147543324Y-116846932D01*
X147543317Y-116846936D01*
X147386024Y-116976024D01*
X147256936Y-117133317D01*
X147256932Y-117133324D01*
X147161016Y-117312770D01*
X147101946Y-117507498D01*
X147082002Y-117710000D01*
X133917998Y-117710000D01*
X133898053Y-117507497D01*
X133838985Y-117312775D01*
X133838983Y-117312772D01*
X133838983Y-117312770D01*
X133743067Y-117133324D01*
X133743063Y-117133317D01*
X133613975Y-116976024D01*
X133456682Y-116846936D01*
X133456675Y-116846932D01*
X133277229Y-116751016D01*
X133179864Y-116721481D01*
X133082503Y-116691947D01*
X133082501Y-116691946D01*
X133082503Y-116691946D01*
X132880000Y-116672002D01*
X132677498Y-116691946D01*
X132482770Y-116751016D01*
X132303324Y-116846932D01*
X132303317Y-116846936D01*
X132146024Y-116976024D01*
X132016936Y-117133317D01*
X132016932Y-117133324D01*
X131921016Y-117312770D01*
X131861946Y-117507498D01*
X131842002Y-117710000D01*
X114500000Y-117710000D01*
X114500000Y-115170000D01*
X131842002Y-115170000D01*
X131861946Y-115372501D01*
X131921016Y-115567229D01*
X132016932Y-115746675D01*
X132016936Y-115746682D01*
X132146024Y-115903975D01*
X132303317Y-116033063D01*
X132303324Y-116033067D01*
X132482770Y-116128983D01*
X132482772Y-116128983D01*
X132482775Y-116128985D01*
X132677497Y-116188053D01*
X132677496Y-116188053D01*
X132695652Y-116189841D01*
X132880000Y-116207998D01*
X133082503Y-116188053D01*
X133277225Y-116128985D01*
X133456681Y-116033064D01*
X133613975Y-115903975D01*
X133743064Y-115746681D01*
X133838985Y-115567225D01*
X133898053Y-115372503D01*
X133917998Y-115170000D01*
X147082002Y-115170000D01*
X147101946Y-115372501D01*
X147161016Y-115567229D01*
X147256932Y-115746675D01*
X147256936Y-115746682D01*
X147386024Y-115903975D01*
X147543317Y-116033063D01*
X147543324Y-116033067D01*
X147722770Y-116128983D01*
X147722772Y-116128983D01*
X147722775Y-116128985D01*
X147917497Y-116188053D01*
X147917496Y-116188053D01*
X147935652Y-116189841D01*
X148120000Y-116207998D01*
X148322503Y-116188053D01*
X148517225Y-116128985D01*
X148696681Y-116033064D01*
X148853975Y-115903975D01*
X148983064Y-115746681D01*
X149078985Y-115567225D01*
X149138053Y-115372503D01*
X149157998Y-115170000D01*
X149138053Y-114967497D01*
X149078985Y-114772775D01*
X149078983Y-114772772D01*
X149078983Y-114772770D01*
X148983067Y-114593324D01*
X148983063Y-114593317D01*
X148853975Y-114436024D01*
X148696682Y-114306936D01*
X148696675Y-114306932D01*
X148517229Y-114211016D01*
X148419864Y-114181481D01*
X148322503Y-114151947D01*
X148322501Y-114151946D01*
X148322503Y-114151946D01*
X148120000Y-114132002D01*
X147917498Y-114151946D01*
X147722770Y-114211016D01*
X147543324Y-114306932D01*
X147543317Y-114306936D01*
X147386024Y-114436024D01*
X147256936Y-114593317D01*
X147256932Y-114593324D01*
X147161016Y-114772770D01*
X147101946Y-114967498D01*
X147082002Y-115170000D01*
X133917998Y-115170000D01*
X133898053Y-114967497D01*
X133838985Y-114772775D01*
X133838983Y-114772772D01*
X133838983Y-114772770D01*
X133743067Y-114593324D01*
X133743063Y-114593317D01*
X133613975Y-114436024D01*
X133456682Y-114306936D01*
X133456675Y-114306932D01*
X133277229Y-114211016D01*
X133179864Y-114181481D01*
X133082503Y-114151947D01*
X133082501Y-114151946D01*
X133082503Y-114151946D01*
X132880000Y-114132002D01*
X132677498Y-114151946D01*
X132482770Y-114211016D01*
X132303324Y-114306932D01*
X132303317Y-114306936D01*
X132146024Y-114436024D01*
X132016936Y-114593317D01*
X132016932Y-114593324D01*
X131921016Y-114772770D01*
X131861946Y-114967498D01*
X131842002Y-115170000D01*
X114500000Y-115170000D01*
X114500000Y-112630000D01*
X131842002Y-112630000D01*
X131861946Y-112832501D01*
X131921016Y-113027229D01*
X132016932Y-113206675D01*
X132016936Y-113206682D01*
X132146024Y-113363975D01*
X132303317Y-113493063D01*
X132303324Y-113493067D01*
X132482770Y-113588983D01*
X132482772Y-113588983D01*
X132482775Y-113588985D01*
X132677497Y-113648053D01*
X132677496Y-113648053D01*
X132695652Y-113649841D01*
X132880000Y-113667998D01*
X133082503Y-113648053D01*
X133277225Y-113588985D01*
X133456681Y-113493064D01*
X133613975Y-113363975D01*
X133743064Y-113206681D01*
X133838985Y-113027225D01*
X133898053Y-112832503D01*
X133917998Y-112630000D01*
X147082002Y-112630000D01*
X147101946Y-112832501D01*
X147161016Y-113027229D01*
X147256932Y-113206675D01*
X147256936Y-113206682D01*
X147386024Y-113363975D01*
X147543317Y-113493063D01*
X147543324Y-113493067D01*
X147722770Y-113588983D01*
X147722772Y-113588983D01*
X147722775Y-113588985D01*
X147917497Y-113648053D01*
X147917496Y-113648053D01*
X147935652Y-113649841D01*
X148120000Y-113667998D01*
X148322503Y-113648053D01*
X148517225Y-113588985D01*
X148696681Y-113493064D01*
X148853975Y-113363975D01*
X148983064Y-113206681D01*
X149078985Y-113027225D01*
X149138053Y-112832503D01*
X149157998Y-112630000D01*
X149138053Y-112427497D01*
X149078985Y-112232775D01*
X149078983Y-112232772D01*
X149078983Y-112232770D01*
X148983067Y-112053324D01*
X148983063Y-112053317D01*
X148853975Y-111896024D01*
X148696682Y-111766936D01*
X148696675Y-111766932D01*
X148517229Y-111671016D01*
X148419864Y-111641481D01*
X148322503Y-111611947D01*
X148322501Y-111611946D01*
X148322503Y-111611946D01*
X148120000Y-111592002D01*
X147917498Y-111611946D01*
X147722770Y-111671016D01*
X147543324Y-111766932D01*
X147543317Y-111766936D01*
X147386024Y-111896024D01*
X147256936Y-112053317D01*
X147256932Y-112053324D01*
X147161016Y-112232770D01*
X147101946Y-112427498D01*
X147082002Y-112630000D01*
X133917998Y-112630000D01*
X133898053Y-112427497D01*
X133838985Y-112232775D01*
X133838983Y-112232772D01*
X133838983Y-112232770D01*
X133743067Y-112053324D01*
X133743063Y-112053317D01*
X133613975Y-111896024D01*
X133456682Y-111766936D01*
X133456675Y-111766932D01*
X133277229Y-111671016D01*
X133179864Y-111641481D01*
X133082503Y-111611947D01*
X133082501Y-111611946D01*
X133082503Y-111611946D01*
X132880000Y-111592002D01*
X132677498Y-111611946D01*
X132482770Y-111671016D01*
X132303324Y-111766932D01*
X132303317Y-111766936D01*
X132146024Y-111896024D01*
X132016936Y-112053317D01*
X132016932Y-112053324D01*
X131921016Y-112232770D01*
X131861946Y-112427498D01*
X131842002Y-112630000D01*
X114500000Y-112630000D01*
X114500000Y-110090000D01*
X131842002Y-110090000D01*
X131861946Y-110292501D01*
X131921016Y-110487229D01*
X132016932Y-110666675D01*
X132016936Y-110666682D01*
X132146024Y-110823975D01*
X132303317Y-110953063D01*
X132303324Y-110953067D01*
X132482770Y-111048983D01*
X132482772Y-111048983D01*
X132482775Y-111048985D01*
X132677497Y-111108053D01*
X132677496Y-111108053D01*
X132695652Y-111109841D01*
X132880000Y-111127998D01*
X133082503Y-111108053D01*
X133277225Y-111048985D01*
X133456681Y-110953064D01*
X133613975Y-110823975D01*
X133743064Y-110666681D01*
X133838985Y-110487225D01*
X133898053Y-110292503D01*
X133917998Y-110090000D01*
X147082002Y-110090000D01*
X147101946Y-110292501D01*
X147161016Y-110487229D01*
X147256932Y-110666675D01*
X147256936Y-110666682D01*
X147386024Y-110823975D01*
X147543317Y-110953063D01*
X147543324Y-110953067D01*
X147722770Y-111048983D01*
X147722772Y-111048983D01*
X147722775Y-111048985D01*
X147917497Y-111108053D01*
X147917496Y-111108053D01*
X147935652Y-111109841D01*
X148120000Y-111127998D01*
X148322503Y-111108053D01*
X148517225Y-111048985D01*
X148696681Y-110953064D01*
X148853975Y-110823975D01*
X148983064Y-110666681D01*
X149078985Y-110487225D01*
X149138053Y-110292503D01*
X149157998Y-110090000D01*
X149138053Y-109887497D01*
X149078985Y-109692775D01*
X149078983Y-109692772D01*
X149078983Y-109692770D01*
X148983067Y-109513324D01*
X148983063Y-109513317D01*
X148853975Y-109356024D01*
X148696682Y-109226936D01*
X148696675Y-109226932D01*
X148517229Y-109131016D01*
X148419864Y-109101481D01*
X148322503Y-109071947D01*
X148322501Y-109071946D01*
X148322503Y-109071946D01*
X148120000Y-109052002D01*
X147917498Y-109071946D01*
X147722770Y-109131016D01*
X147543324Y-109226932D01*
X147543317Y-109226936D01*
X147386024Y-109356024D01*
X147256936Y-109513317D01*
X147256932Y-109513324D01*
X147161016Y-109692770D01*
X147101946Y-109887498D01*
X147082002Y-110090000D01*
X133917998Y-110090000D01*
X133898053Y-109887497D01*
X133838985Y-109692775D01*
X133838983Y-109692772D01*
X133838983Y-109692770D01*
X133743067Y-109513324D01*
X133743063Y-109513317D01*
X133613975Y-109356024D01*
X133456682Y-109226936D01*
X133456675Y-109226932D01*
X133277229Y-109131016D01*
X133179864Y-109101481D01*
X133082503Y-109071947D01*
X133082501Y-109071946D01*
X133082503Y-109071946D01*
X132880000Y-109052002D01*
X132677498Y-109071946D01*
X132482770Y-109131016D01*
X132303324Y-109226932D01*
X132303317Y-109226936D01*
X132146024Y-109356024D01*
X132016936Y-109513317D01*
X132016932Y-109513324D01*
X131921016Y-109692770D01*
X131861946Y-109887498D01*
X131842002Y-110090000D01*
X114500000Y-110090000D01*
X114500000Y-107550000D01*
X131842002Y-107550000D01*
X131861946Y-107752501D01*
X131921016Y-107947229D01*
X132016932Y-108126675D01*
X132016936Y-108126682D01*
X132146024Y-108283975D01*
X132303317Y-108413063D01*
X132303324Y-108413067D01*
X132482770Y-108508983D01*
X132482772Y-108508983D01*
X132482775Y-108508985D01*
X132677497Y-108568053D01*
X132677496Y-108568053D01*
X132695652Y-108569841D01*
X132880000Y-108587998D01*
X133082503Y-108568053D01*
X133277225Y-108508985D01*
X133456681Y-108413064D01*
X133613975Y-108283975D01*
X133743064Y-108126681D01*
X133838985Y-107947225D01*
X133898053Y-107752503D01*
X133917998Y-107550000D01*
X147082002Y-107550000D01*
X147101946Y-107752501D01*
X147161016Y-107947229D01*
X147256932Y-108126675D01*
X147256936Y-108126682D01*
X147386024Y-108283975D01*
X147543317Y-108413063D01*
X147543324Y-108413067D01*
X147722770Y-108508983D01*
X147722772Y-108508983D01*
X147722775Y-108508985D01*
X147917497Y-108568053D01*
X147917496Y-108568053D01*
X147935652Y-108569841D01*
X148120000Y-108587998D01*
X148322503Y-108568053D01*
X148517225Y-108508985D01*
X148696681Y-108413064D01*
X148853975Y-108283975D01*
X148983064Y-108126681D01*
X149078985Y-107947225D01*
X149138053Y-107752503D01*
X149157998Y-107550000D01*
X149138053Y-107347497D01*
X149078985Y-107152775D01*
X149078983Y-107152772D01*
X149078983Y-107152770D01*
X148983067Y-106973324D01*
X148983063Y-106973317D01*
X148853975Y-106816024D01*
X148696682Y-106686936D01*
X148696675Y-106686932D01*
X148517229Y-106591016D01*
X148419864Y-106561481D01*
X148322503Y-106531947D01*
X148322501Y-106531946D01*
X148322503Y-106531946D01*
X148120000Y-106512002D01*
X147917498Y-106531946D01*
X147722770Y-106591016D01*
X147543324Y-106686932D01*
X147543317Y-106686936D01*
X147386024Y-106816024D01*
X147256936Y-106973317D01*
X147256932Y-106973324D01*
X147161016Y-107152770D01*
X147101946Y-107347498D01*
X147082002Y-107550000D01*
X133917998Y-107550000D01*
X133898053Y-107347497D01*
X133838985Y-107152775D01*
X133838983Y-107152772D01*
X133838983Y-107152770D01*
X133743067Y-106973324D01*
X133743063Y-106973317D01*
X133613975Y-106816024D01*
X133456682Y-106686936D01*
X133456675Y-106686932D01*
X133277229Y-106591016D01*
X133179864Y-106561481D01*
X133082503Y-106531947D01*
X133082501Y-106531946D01*
X133082503Y-106531946D01*
X132880000Y-106512002D01*
X132677498Y-106531946D01*
X132482770Y-106591016D01*
X132303324Y-106686932D01*
X132303317Y-106686936D01*
X132146024Y-106816024D01*
X132016936Y-106973317D01*
X132016932Y-106973324D01*
X131921016Y-107152770D01*
X131861946Y-107347498D01*
X131842002Y-107550000D01*
X114500000Y-107550000D01*
X114500000Y-105010000D01*
X131842002Y-105010000D01*
X131861946Y-105212501D01*
X131921016Y-105407229D01*
X132016932Y-105586675D01*
X132016936Y-105586682D01*
X132146024Y-105743975D01*
X132303317Y-105873063D01*
X132303324Y-105873067D01*
X132482770Y-105968983D01*
X132482772Y-105968983D01*
X132482775Y-105968985D01*
X132677497Y-106028053D01*
X132677496Y-106028053D01*
X132695652Y-106029841D01*
X132880000Y-106047998D01*
X133082503Y-106028053D01*
X133277225Y-105968985D01*
X133456681Y-105873064D01*
X133613975Y-105743975D01*
X133743064Y-105586681D01*
X133838985Y-105407225D01*
X133898053Y-105212503D01*
X133917998Y-105010000D01*
X147082002Y-105010000D01*
X147101946Y-105212501D01*
X147161016Y-105407229D01*
X147256932Y-105586675D01*
X147256936Y-105586682D01*
X147386024Y-105743975D01*
X147543317Y-105873063D01*
X147543324Y-105873067D01*
X147722770Y-105968983D01*
X147722772Y-105968983D01*
X147722775Y-105968985D01*
X147917497Y-106028053D01*
X147917496Y-106028053D01*
X147935652Y-106029841D01*
X148120000Y-106047998D01*
X148322503Y-106028053D01*
X148517225Y-105968985D01*
X148696681Y-105873064D01*
X148853975Y-105743975D01*
X148983064Y-105586681D01*
X149078985Y-105407225D01*
X149138053Y-105212503D01*
X149157998Y-105010000D01*
X149138053Y-104807497D01*
X149078985Y-104612775D01*
X149078983Y-104612772D01*
X149078983Y-104612770D01*
X148983067Y-104433324D01*
X148983063Y-104433317D01*
X148853975Y-104276024D01*
X148696682Y-104146936D01*
X148696675Y-104146932D01*
X148517229Y-104051016D01*
X148419864Y-104021481D01*
X148322503Y-103991947D01*
X148322501Y-103991946D01*
X148322503Y-103991946D01*
X148120000Y-103972002D01*
X147917498Y-103991946D01*
X147722770Y-104051016D01*
X147543324Y-104146932D01*
X147543317Y-104146936D01*
X147386024Y-104276024D01*
X147256936Y-104433317D01*
X147256932Y-104433324D01*
X147161016Y-104612770D01*
X147101946Y-104807498D01*
X147082002Y-105010000D01*
X133917998Y-105010000D01*
X133898053Y-104807497D01*
X133838985Y-104612775D01*
X133838983Y-104612772D01*
X133838983Y-104612770D01*
X133743067Y-104433324D01*
X133743063Y-104433317D01*
X133613975Y-104276024D01*
X133456682Y-104146936D01*
X133456675Y-104146932D01*
X133277229Y-104051016D01*
X133179864Y-104021481D01*
X133082503Y-103991947D01*
X133082501Y-103991946D01*
X133082503Y-103991946D01*
X132880000Y-103972002D01*
X132677498Y-103991946D01*
X132482770Y-104051016D01*
X132303324Y-104146932D01*
X132303317Y-104146936D01*
X132146024Y-104276024D01*
X132016936Y-104433317D01*
X132016932Y-104433324D01*
X131921016Y-104612770D01*
X131861946Y-104807498D01*
X131842002Y-105010000D01*
X114500000Y-105010000D01*
X114500000Y-102470000D01*
X131842002Y-102470000D01*
X131861946Y-102672501D01*
X131921016Y-102867229D01*
X132016932Y-103046675D01*
X132016936Y-103046682D01*
X132146024Y-103203975D01*
X132303317Y-103333063D01*
X132303324Y-103333067D01*
X132482770Y-103428983D01*
X132482772Y-103428983D01*
X132482775Y-103428985D01*
X132677497Y-103488053D01*
X132677496Y-103488053D01*
X132695652Y-103489841D01*
X132880000Y-103507998D01*
X133082503Y-103488053D01*
X133277225Y-103428985D01*
X133456681Y-103333064D01*
X133613975Y-103203975D01*
X133743064Y-103046681D01*
X133838985Y-102867225D01*
X133898053Y-102672503D01*
X133917998Y-102470000D01*
X147082002Y-102470000D01*
X147101946Y-102672501D01*
X147161016Y-102867229D01*
X147256932Y-103046675D01*
X147256936Y-103046682D01*
X147386024Y-103203975D01*
X147543317Y-103333063D01*
X147543324Y-103333067D01*
X147722770Y-103428983D01*
X147722772Y-103428983D01*
X147722775Y-103428985D01*
X147917497Y-103488053D01*
X147917496Y-103488053D01*
X147935652Y-103489841D01*
X148120000Y-103507998D01*
X148322503Y-103488053D01*
X148517225Y-103428985D01*
X148696681Y-103333064D01*
X148853975Y-103203975D01*
X148983064Y-103046681D01*
X149078985Y-102867225D01*
X149138053Y-102672503D01*
X149157998Y-102470000D01*
X149138053Y-102267497D01*
X149078985Y-102072775D01*
X149078983Y-102072772D01*
X149078983Y-102072770D01*
X148983067Y-101893324D01*
X148983063Y-101893317D01*
X148853975Y-101736024D01*
X148696682Y-101606936D01*
X148696675Y-101606932D01*
X148517229Y-101511016D01*
X148419864Y-101481481D01*
X148322503Y-101451947D01*
X148322501Y-101451946D01*
X148322503Y-101451946D01*
X148120000Y-101432002D01*
X147917498Y-101451946D01*
X147722770Y-101511016D01*
X147543324Y-101606932D01*
X147543317Y-101606936D01*
X147386024Y-101736024D01*
X147256936Y-101893317D01*
X147256932Y-101893324D01*
X147161016Y-102072770D01*
X147101946Y-102267498D01*
X147082002Y-102470000D01*
X133917998Y-102470000D01*
X133898053Y-102267497D01*
X133838985Y-102072775D01*
X133838983Y-102072772D01*
X133838983Y-102072770D01*
X133743067Y-101893324D01*
X133743063Y-101893317D01*
X133613975Y-101736024D01*
X133456682Y-101606936D01*
X133456675Y-101606932D01*
X133277229Y-101511016D01*
X133179864Y-101481481D01*
X133082503Y-101451947D01*
X133082501Y-101451946D01*
X133082503Y-101451946D01*
X132880000Y-101432002D01*
X132677498Y-101451946D01*
X132482770Y-101511016D01*
X132303324Y-101606932D01*
X132303317Y-101606936D01*
X132146024Y-101736024D01*
X132016936Y-101893317D01*
X132016932Y-101893324D01*
X131921016Y-102072770D01*
X131861946Y-102267498D01*
X131842002Y-102470000D01*
X114500000Y-102470000D01*
X114500000Y-99930000D01*
X131842002Y-99930000D01*
X131861946Y-100132501D01*
X131921016Y-100327229D01*
X132016932Y-100506675D01*
X132016936Y-100506682D01*
X132146024Y-100663975D01*
X132303317Y-100793063D01*
X132303324Y-100793067D01*
X132482770Y-100888983D01*
X132482772Y-100888983D01*
X132482775Y-100888985D01*
X132677497Y-100948053D01*
X132677496Y-100948053D01*
X132695652Y-100949841D01*
X132880000Y-100967998D01*
X133082503Y-100948053D01*
X133277225Y-100888985D01*
X133456681Y-100793064D01*
X133613975Y-100663975D01*
X133743064Y-100506681D01*
X133838985Y-100327225D01*
X133898053Y-100132503D01*
X133917998Y-99930000D01*
X147082002Y-99930000D01*
X147101946Y-100132501D01*
X147161016Y-100327229D01*
X147256932Y-100506675D01*
X147256936Y-100506682D01*
X147386024Y-100663975D01*
X147543317Y-100793063D01*
X147543324Y-100793067D01*
X147722770Y-100888983D01*
X147722772Y-100888983D01*
X147722775Y-100888985D01*
X147917497Y-100948053D01*
X147917496Y-100948053D01*
X147935652Y-100949841D01*
X148120000Y-100967998D01*
X148322503Y-100948053D01*
X148517225Y-100888985D01*
X148696681Y-100793064D01*
X148853975Y-100663975D01*
X148983064Y-100506681D01*
X149078985Y-100327225D01*
X149138053Y-100132503D01*
X149157998Y-99930000D01*
X149138053Y-99727497D01*
X149078985Y-99532775D01*
X149078983Y-99532772D01*
X149078983Y-99532770D01*
X148983067Y-99353324D01*
X148983063Y-99353317D01*
X148853975Y-99196024D01*
X148696682Y-99066936D01*
X148696675Y-99066932D01*
X148517229Y-98971016D01*
X148419864Y-98941481D01*
X148322503Y-98911947D01*
X148322501Y-98911946D01*
X148322503Y-98911946D01*
X148120000Y-98892002D01*
X147917498Y-98911946D01*
X147722770Y-98971016D01*
X147543324Y-99066932D01*
X147543317Y-99066936D01*
X147386024Y-99196024D01*
X147256936Y-99353317D01*
X147256932Y-99353324D01*
X147161016Y-99532770D01*
X147101946Y-99727498D01*
X147082002Y-99930000D01*
X133917998Y-99930000D01*
X133898053Y-99727497D01*
X133838985Y-99532775D01*
X133838983Y-99532772D01*
X133838983Y-99532770D01*
X133743067Y-99353324D01*
X133743063Y-99353317D01*
X133613975Y-99196024D01*
X133456682Y-99066936D01*
X133456675Y-99066932D01*
X133277229Y-98971016D01*
X133179864Y-98941481D01*
X133082503Y-98911947D01*
X133082501Y-98911946D01*
X133082503Y-98911946D01*
X132880000Y-98892002D01*
X132677498Y-98911946D01*
X132482770Y-98971016D01*
X132303324Y-99066932D01*
X132303317Y-99066936D01*
X132146024Y-99196024D01*
X132016936Y-99353317D01*
X132016932Y-99353324D01*
X131921016Y-99532770D01*
X131861946Y-99727498D01*
X131842002Y-99930000D01*
X114500000Y-99930000D01*
X114500000Y-97390000D01*
X131842002Y-97390000D01*
X131861946Y-97592501D01*
X131921016Y-97787229D01*
X132016932Y-97966675D01*
X132016936Y-97966682D01*
X132146024Y-98123975D01*
X132303317Y-98253063D01*
X132303324Y-98253067D01*
X132482770Y-98348983D01*
X132482772Y-98348983D01*
X132482775Y-98348985D01*
X132677497Y-98408053D01*
X132677496Y-98408053D01*
X132695652Y-98409841D01*
X132880000Y-98427998D01*
X133082503Y-98408053D01*
X133277225Y-98348985D01*
X133456681Y-98253064D01*
X133613975Y-98123975D01*
X133743064Y-97966681D01*
X133838985Y-97787225D01*
X133898053Y-97592503D01*
X133917998Y-97390000D01*
X133898053Y-97187497D01*
X133838985Y-96992775D01*
X133838983Y-96992772D01*
X133838983Y-96992770D01*
X133743067Y-96813324D01*
X133743063Y-96813317D01*
X133613975Y-96656024D01*
X133456682Y-96526936D01*
X133456675Y-96526932D01*
X133277229Y-96431016D01*
X133153719Y-96393550D01*
X133082503Y-96371947D01*
X133082501Y-96371946D01*
X133082503Y-96371946D01*
X132880000Y-96352002D01*
X132677498Y-96371946D01*
X132482770Y-96431016D01*
X132303324Y-96526932D01*
X132303317Y-96526936D01*
X132146024Y-96656024D01*
X132016936Y-96813317D01*
X132016932Y-96813324D01*
X131921016Y-96992770D01*
X131861946Y-97187498D01*
X131842002Y-97390000D01*
X114500000Y-97390000D01*
X114500000Y-92250000D01*
X121547769Y-92250000D01*
X121558242Y-92316126D01*
X121558242Y-92316129D01*
X121623904Y-92518217D01*
X121720379Y-92707557D01*
X121845272Y-92879459D01*
X121845276Y-92879464D01*
X121995535Y-93029723D01*
X121995540Y-93029727D01*
X122167442Y-93154620D01*
X122356782Y-93251095D01*
X122478855Y-93290759D01*
X122536530Y-93330196D01*
X122563729Y-93394555D01*
X122551815Y-93463401D01*
X122504570Y-93514877D01*
X122487990Y-93523251D01*
X122377404Y-93569057D01*
X122205342Y-93684024D01*
X122059024Y-93830342D01*
X121944058Y-94002403D01*
X121864870Y-94193579D01*
X121864868Y-94193587D01*
X121824500Y-94396530D01*
X121824500Y-94603469D01*
X121864868Y-94806412D01*
X121864870Y-94806420D01*
X121944058Y-94997596D01*
X122059024Y-95169657D01*
X122205342Y-95315975D01*
X122205345Y-95315977D01*
X122377402Y-95430941D01*
X122568580Y-95510130D01*
X122757187Y-95547646D01*
X122771530Y-95550499D01*
X122771534Y-95550500D01*
X122771535Y-95550500D01*
X123228466Y-95550500D01*
X123228467Y-95550499D01*
X123431420Y-95510130D01*
X123622598Y-95430941D01*
X123794655Y-95315977D01*
X123940977Y-95169655D01*
X124055941Y-94997598D01*
X124117078Y-94850000D01*
X131842002Y-94850000D01*
X131861946Y-95052501D01*
X131921016Y-95247229D01*
X132016932Y-95426675D01*
X132016936Y-95426682D01*
X132146024Y-95583975D01*
X132303317Y-95713063D01*
X132303324Y-95713067D01*
X132482770Y-95808983D01*
X132482772Y-95808983D01*
X132482775Y-95808985D01*
X132677497Y-95868053D01*
X132677496Y-95868053D01*
X132695652Y-95869841D01*
X132880000Y-95887998D01*
X133082503Y-95868053D01*
X133277225Y-95808985D01*
X133456681Y-95713064D01*
X133613975Y-95583975D01*
X133743064Y-95426681D01*
X133838985Y-95247225D01*
X133898053Y-95052503D01*
X133917998Y-94850001D01*
X146782410Y-94850001D01*
X146802730Y-95082264D01*
X146802731Y-95082272D01*
X146863075Y-95307478D01*
X146863078Y-95307484D01*
X146961612Y-95518793D01*
X146961613Y-95518795D01*
X147017638Y-95598807D01*
X147017639Y-95598808D01*
X147592129Y-95024317D01*
X147602822Y-95064222D01*
X147675890Y-95190778D01*
X147779222Y-95294110D01*
X147905778Y-95367178D01*
X147945682Y-95377870D01*
X147371190Y-95952360D01*
X147451209Y-96008388D01*
X147662515Y-96106921D01*
X147662524Y-96106925D01*
X147842374Y-96155115D01*
X147902035Y-96191480D01*
X147932564Y-96254327D01*
X147924270Y-96323702D01*
X147879784Y-96377580D01*
X147846277Y-96393550D01*
X147722773Y-96431015D01*
X147543324Y-96526932D01*
X147543317Y-96526936D01*
X147386024Y-96656024D01*
X147256936Y-96813317D01*
X147256932Y-96813324D01*
X147161016Y-96992770D01*
X147101946Y-97187498D01*
X147082002Y-97390000D01*
X147101946Y-97592501D01*
X147161016Y-97787229D01*
X147256932Y-97966675D01*
X147256936Y-97966682D01*
X147386024Y-98123975D01*
X147543317Y-98253063D01*
X147543324Y-98253067D01*
X147722770Y-98348983D01*
X147722772Y-98348983D01*
X147722775Y-98348985D01*
X147917497Y-98408053D01*
X147917496Y-98408053D01*
X147935652Y-98409841D01*
X148120000Y-98427998D01*
X148322503Y-98408053D01*
X148517225Y-98348985D01*
X148696681Y-98253064D01*
X148853975Y-98123975D01*
X148983064Y-97966681D01*
X149078985Y-97787225D01*
X149138053Y-97592503D01*
X149157998Y-97390000D01*
X149138053Y-97187497D01*
X149078985Y-96992775D01*
X149078983Y-96992772D01*
X149078983Y-96992770D01*
X148983067Y-96813324D01*
X148983063Y-96813317D01*
X148853975Y-96656024D01*
X148696682Y-96526936D01*
X148696675Y-96526932D01*
X148517226Y-96431015D01*
X148393722Y-96393550D01*
X148335284Y-96355253D01*
X148306827Y-96291440D01*
X148317388Y-96222373D01*
X148363613Y-96169980D01*
X148397625Y-96155115D01*
X148577475Y-96106925D01*
X148577484Y-96106921D01*
X148788794Y-96008386D01*
X148868808Y-95952360D01*
X148294317Y-95377870D01*
X148334222Y-95367178D01*
X148460778Y-95294110D01*
X148564110Y-95190778D01*
X148637178Y-95064222D01*
X148647870Y-95024318D01*
X149222360Y-95598808D01*
X149278386Y-95518794D01*
X149376921Y-95307484D01*
X149376924Y-95307478D01*
X149417976Y-95154269D01*
X156474500Y-95154269D01*
X156477353Y-95184699D01*
X156477353Y-95184701D01*
X156515638Y-95294110D01*
X156522207Y-95312882D01*
X156602850Y-95422150D01*
X156712118Y-95502793D01*
X156733089Y-95510131D01*
X156840299Y-95547646D01*
X156870730Y-95550500D01*
X156870734Y-95550500D01*
X158429270Y-95550500D01*
X158459699Y-95547646D01*
X158459701Y-95547646D01*
X158523790Y-95525219D01*
X158587882Y-95502793D01*
X158697150Y-95422150D01*
X158777793Y-95312882D01*
X158816049Y-95203553D01*
X158822646Y-95184701D01*
X158822646Y-95184699D01*
X158825500Y-95154269D01*
X158825500Y-93845730D01*
X158822646Y-93815300D01*
X158822646Y-93815298D01*
X158779366Y-93691613D01*
X158777793Y-93687118D01*
X158697150Y-93577850D01*
X158587882Y-93497207D01*
X158587880Y-93497206D01*
X158459700Y-93452353D01*
X158429270Y-93449500D01*
X158429266Y-93449500D01*
X156870734Y-93449500D01*
X156870730Y-93449500D01*
X156840300Y-93452353D01*
X156840298Y-93452353D01*
X156712119Y-93497206D01*
X156712117Y-93497207D01*
X156602850Y-93577850D01*
X156522207Y-93687117D01*
X156522206Y-93687119D01*
X156477353Y-93815298D01*
X156477353Y-93815300D01*
X156474500Y-93845730D01*
X156474500Y-95154269D01*
X149417976Y-95154269D01*
X149437268Y-95082272D01*
X149437269Y-95082264D01*
X149457590Y-94850001D01*
X149457590Y-94849998D01*
X149437269Y-94617735D01*
X149437268Y-94617727D01*
X149376924Y-94392521D01*
X149376921Y-94392515D01*
X149278388Y-94181209D01*
X149222359Y-94101190D01*
X148647869Y-94675681D01*
X148637178Y-94635778D01*
X148564110Y-94509222D01*
X148460778Y-94405890D01*
X148334222Y-94332822D01*
X148294317Y-94322129D01*
X148868808Y-93747639D01*
X148868807Y-93747638D01*
X148788795Y-93691613D01*
X148788793Y-93691612D01*
X148577484Y-93593078D01*
X148577475Y-93593074D01*
X148397625Y-93544884D01*
X148337964Y-93508519D01*
X148307435Y-93445672D01*
X148315730Y-93376296D01*
X148360215Y-93322419D01*
X148393718Y-93306450D01*
X148517225Y-93268985D01*
X148696681Y-93173064D01*
X148853975Y-93043975D01*
X148983064Y-92886681D01*
X149078985Y-92707225D01*
X149138053Y-92512503D01*
X149157998Y-92310000D01*
X149138053Y-92107497D01*
X149078985Y-91912775D01*
X149078983Y-91912772D01*
X149078983Y-91912770D01*
X148983067Y-91733324D01*
X148983063Y-91733317D01*
X148853975Y-91576024D01*
X148696682Y-91446936D01*
X148696675Y-91446932D01*
X148517229Y-91351016D01*
X148419864Y-91321481D01*
X148322503Y-91291947D01*
X148322501Y-91291946D01*
X148322503Y-91291946D01*
X148120000Y-91272002D01*
X147917498Y-91291946D01*
X147722770Y-91351016D01*
X147543324Y-91446932D01*
X147543317Y-91446936D01*
X147386024Y-91576024D01*
X147256936Y-91733317D01*
X147256932Y-91733324D01*
X147161016Y-91912770D01*
X147101946Y-92107498D01*
X147082002Y-92310000D01*
X147101946Y-92512501D01*
X147161016Y-92707229D01*
X147256932Y-92886675D01*
X147256936Y-92886682D01*
X147386024Y-93043975D01*
X147543317Y-93173063D01*
X147543324Y-93173067D01*
X147722770Y-93268983D01*
X147722772Y-93268983D01*
X147722775Y-93268985D01*
X147846277Y-93306448D01*
X147904715Y-93344746D01*
X147933171Y-93408558D01*
X147922611Y-93477625D01*
X147876387Y-93530019D01*
X147842375Y-93544884D01*
X147662521Y-93593075D01*
X147662515Y-93593078D01*
X147451202Y-93691614D01*
X147371190Y-93747637D01*
X147945682Y-94322129D01*
X147905778Y-94332822D01*
X147779222Y-94405890D01*
X147675890Y-94509222D01*
X147602822Y-94635778D01*
X147592129Y-94675682D01*
X147017637Y-94101190D01*
X146961614Y-94181202D01*
X146863078Y-94392515D01*
X146863075Y-94392521D01*
X146802731Y-94617727D01*
X146802730Y-94617735D01*
X146782410Y-94849998D01*
X146782410Y-94850001D01*
X133917998Y-94850001D01*
X133917998Y-94850000D01*
X133898053Y-94647497D01*
X133838985Y-94452775D01*
X133838983Y-94452772D01*
X133838983Y-94452770D01*
X133743067Y-94273324D01*
X133743063Y-94273317D01*
X133613975Y-94116024D01*
X133456682Y-93986936D01*
X133456675Y-93986932D01*
X133277229Y-93891016D01*
X133179864Y-93861481D01*
X133082503Y-93831947D01*
X133082501Y-93831946D01*
X133082503Y-93831946D01*
X132880000Y-93812002D01*
X132677498Y-93831946D01*
X132482770Y-93891016D01*
X132303324Y-93986932D01*
X132303317Y-93986936D01*
X132146024Y-94116024D01*
X132016936Y-94273317D01*
X132016932Y-94273324D01*
X131921016Y-94452770D01*
X131861946Y-94647498D01*
X131842002Y-94850000D01*
X124117078Y-94850000D01*
X124135130Y-94806420D01*
X124175500Y-94603465D01*
X124175500Y-94396535D01*
X124135130Y-94193580D01*
X124055941Y-94002402D01*
X123940977Y-93830345D01*
X123940975Y-93830342D01*
X123794657Y-93684024D01*
X123622596Y-93569057D01*
X123512009Y-93523251D01*
X123457606Y-93479410D01*
X123435541Y-93413116D01*
X123452820Y-93345416D01*
X123503958Y-93297806D01*
X123521144Y-93290759D01*
X123643217Y-93251095D01*
X123832557Y-93154620D01*
X124004459Y-93029727D01*
X124004464Y-93029723D01*
X124154723Y-92879464D01*
X124154727Y-92879459D01*
X124279620Y-92707557D01*
X124376095Y-92518217D01*
X124441757Y-92316129D01*
X124441757Y-92316126D01*
X124442727Y-92310000D01*
X131842002Y-92310000D01*
X131861946Y-92512501D01*
X131921016Y-92707229D01*
X132016932Y-92886675D01*
X132016936Y-92886682D01*
X132146024Y-93043975D01*
X132303317Y-93173063D01*
X132303324Y-93173067D01*
X132482770Y-93268983D01*
X132482772Y-93268983D01*
X132482775Y-93268985D01*
X132677497Y-93328053D01*
X132677496Y-93328053D01*
X132695652Y-93329841D01*
X132880000Y-93347998D01*
X133082503Y-93328053D01*
X133277225Y-93268985D01*
X133456681Y-93173064D01*
X133613975Y-93043975D01*
X133743064Y-92886681D01*
X133838985Y-92707225D01*
X133898053Y-92512503D01*
X133917998Y-92310000D01*
X133898053Y-92107497D01*
X133838985Y-91912775D01*
X133838983Y-91912772D01*
X133838983Y-91912770D01*
X133743067Y-91733324D01*
X133743063Y-91733317D01*
X133613975Y-91576024D01*
X133456682Y-91446936D01*
X133456675Y-91446932D01*
X133277229Y-91351016D01*
X133179864Y-91321481D01*
X133082503Y-91291947D01*
X133082501Y-91291946D01*
X133082503Y-91291946D01*
X132880000Y-91272002D01*
X132677498Y-91291946D01*
X132482770Y-91351016D01*
X132303324Y-91446932D01*
X132303317Y-91446936D01*
X132146024Y-91576024D01*
X132016936Y-91733317D01*
X132016932Y-91733324D01*
X131921016Y-91912770D01*
X131861946Y-92107498D01*
X131842002Y-92310000D01*
X124442727Y-92310000D01*
X124452231Y-92250000D01*
X123404146Y-92250000D01*
X123442630Y-92183343D01*
X123475000Y-92062535D01*
X123475000Y-91937465D01*
X123442630Y-91816657D01*
X123404146Y-91750000D01*
X124452231Y-91750000D01*
X124441757Y-91683873D01*
X124441757Y-91683870D01*
X124376095Y-91481782D01*
X124279620Y-91292442D01*
X124154727Y-91120540D01*
X124154723Y-91120535D01*
X124004464Y-90970276D01*
X124004459Y-90970272D01*
X123832557Y-90845379D01*
X123643216Y-90748904D01*
X123521144Y-90709240D01*
X123463468Y-90669802D01*
X123436270Y-90605444D01*
X123448185Y-90536597D01*
X123495429Y-90485122D01*
X123512006Y-90476749D01*
X123622598Y-90430941D01*
X123794655Y-90315977D01*
X123940977Y-90169655D01*
X124055941Y-89997598D01*
X124135130Y-89806420D01*
X124142374Y-89770000D01*
X131842002Y-89770000D01*
X131861946Y-89972501D01*
X131921016Y-90167229D01*
X132016932Y-90346675D01*
X132016936Y-90346682D01*
X132146024Y-90503975D01*
X132303317Y-90633063D01*
X132303324Y-90633067D01*
X132482770Y-90728983D01*
X132482772Y-90728983D01*
X132482775Y-90728985D01*
X132677497Y-90788053D01*
X132677496Y-90788053D01*
X132695652Y-90789841D01*
X132880000Y-90807998D01*
X133082503Y-90788053D01*
X133277225Y-90728985D01*
X133314166Y-90709240D01*
X133416352Y-90654620D01*
X133456681Y-90633064D01*
X133613975Y-90503975D01*
X133743064Y-90346681D01*
X133838985Y-90167225D01*
X133898053Y-89972503D01*
X133917998Y-89770000D01*
X147082002Y-89770000D01*
X147101946Y-89972501D01*
X147161016Y-90167229D01*
X147256932Y-90346675D01*
X147256936Y-90346682D01*
X147386024Y-90503975D01*
X147543317Y-90633063D01*
X147543324Y-90633067D01*
X147722770Y-90728983D01*
X147722772Y-90728983D01*
X147722775Y-90728985D01*
X147917497Y-90788053D01*
X147917496Y-90788053D01*
X147935652Y-90789841D01*
X148120000Y-90807998D01*
X148322503Y-90788053D01*
X148517225Y-90728985D01*
X148554166Y-90709240D01*
X148656352Y-90654620D01*
X148696681Y-90633064D01*
X148853975Y-90503975D01*
X148983064Y-90346681D01*
X149078985Y-90167225D01*
X149138053Y-89972503D01*
X149157998Y-89770000D01*
X149156028Y-89750000D01*
X156197769Y-89750000D01*
X156208242Y-89816126D01*
X156208242Y-89816129D01*
X156273904Y-90018217D01*
X156370379Y-90207557D01*
X156495272Y-90379459D01*
X156495276Y-90379464D01*
X156645535Y-90529723D01*
X156645540Y-90529727D01*
X156817442Y-90654620D01*
X157006782Y-90751095D01*
X157128855Y-90790759D01*
X157186530Y-90830196D01*
X157213729Y-90894555D01*
X157201815Y-90963401D01*
X157154570Y-91014877D01*
X157137990Y-91023251D01*
X157027404Y-91069057D01*
X156855342Y-91184024D01*
X156709024Y-91330342D01*
X156594058Y-91502403D01*
X156514870Y-91693579D01*
X156514868Y-91693587D01*
X156474500Y-91896530D01*
X156474500Y-92103469D01*
X156514868Y-92306412D01*
X156514870Y-92306420D01*
X156594058Y-92497596D01*
X156709024Y-92669657D01*
X156855342Y-92815975D01*
X156855345Y-92815977D01*
X157027402Y-92930941D01*
X157218580Y-93010130D01*
X157421530Y-93050499D01*
X157421534Y-93050500D01*
X157421535Y-93050500D01*
X157878466Y-93050500D01*
X157878467Y-93050499D01*
X158081420Y-93010130D01*
X158272598Y-92930941D01*
X158444655Y-92815977D01*
X158590977Y-92669655D01*
X158705941Y-92497598D01*
X158785130Y-92306420D01*
X158825500Y-92103465D01*
X158825500Y-91896535D01*
X158785130Y-91693580D01*
X158705941Y-91502402D01*
X158590977Y-91330345D01*
X158590975Y-91330342D01*
X158444657Y-91184024D01*
X158272596Y-91069057D01*
X158162009Y-91023251D01*
X158107606Y-90979410D01*
X158085541Y-90913116D01*
X158102820Y-90845416D01*
X158153958Y-90797806D01*
X158171144Y-90790759D01*
X158293217Y-90751095D01*
X158482557Y-90654620D01*
X158654459Y-90529727D01*
X158654464Y-90529723D01*
X158804723Y-90379464D01*
X158804727Y-90379459D01*
X158929620Y-90207557D01*
X159026095Y-90018217D01*
X159091757Y-89816129D01*
X159091757Y-89816126D01*
X159102231Y-89750000D01*
X158054146Y-89750000D01*
X158092630Y-89683343D01*
X158125000Y-89562535D01*
X158125000Y-89437465D01*
X158092630Y-89316657D01*
X158054146Y-89250000D01*
X159102231Y-89250000D01*
X159091757Y-89183873D01*
X159091757Y-89183870D01*
X159026095Y-88981782D01*
X158929620Y-88792442D01*
X158804727Y-88620540D01*
X158804723Y-88620535D01*
X158654464Y-88470276D01*
X158654459Y-88470272D01*
X158482557Y-88345379D01*
X158293216Y-88248904D01*
X158171144Y-88209240D01*
X158113468Y-88169802D01*
X158086270Y-88105444D01*
X158098185Y-88036597D01*
X158145429Y-87985122D01*
X158162006Y-87976749D01*
X158272598Y-87930941D01*
X158444655Y-87815977D01*
X158590977Y-87669655D01*
X158705941Y-87497598D01*
X158785130Y-87306420D01*
X158825500Y-87103465D01*
X158825500Y-86896535D01*
X158785130Y-86693580D01*
X158705941Y-86502402D01*
X158590977Y-86330345D01*
X158590975Y-86330342D01*
X158444657Y-86184024D01*
X158358626Y-86126541D01*
X158272598Y-86069059D01*
X158081420Y-85989870D01*
X158081412Y-85989868D01*
X157878469Y-85949500D01*
X157878465Y-85949500D01*
X157421535Y-85949500D01*
X157421530Y-85949500D01*
X157218587Y-85989868D01*
X157218579Y-85989870D01*
X157027403Y-86069058D01*
X156855342Y-86184024D01*
X156709024Y-86330342D01*
X156594058Y-86502403D01*
X156514870Y-86693579D01*
X156514868Y-86693587D01*
X156474500Y-86896530D01*
X156474500Y-87103469D01*
X156514868Y-87306412D01*
X156514870Y-87306420D01*
X156594058Y-87497596D01*
X156709024Y-87669657D01*
X156855342Y-87815975D01*
X156855345Y-87815977D01*
X157027402Y-87930941D01*
X157137990Y-87976748D01*
X157192393Y-88020589D01*
X157214458Y-88086883D01*
X157197179Y-88154582D01*
X157146042Y-88202193D01*
X157128856Y-88209240D01*
X157006781Y-88248905D01*
X156817442Y-88345379D01*
X156645540Y-88470272D01*
X156645535Y-88470276D01*
X156495276Y-88620535D01*
X156495272Y-88620540D01*
X156370379Y-88792442D01*
X156273904Y-88981782D01*
X156208242Y-89183870D01*
X156208242Y-89183873D01*
X156197769Y-89250000D01*
X157245854Y-89250000D01*
X157207370Y-89316657D01*
X157175000Y-89437465D01*
X157175000Y-89562535D01*
X157207370Y-89683343D01*
X157245854Y-89750000D01*
X156197769Y-89750000D01*
X149156028Y-89750000D01*
X149138053Y-89567497D01*
X149078985Y-89372775D01*
X149078983Y-89372772D01*
X149078983Y-89372770D01*
X148983067Y-89193324D01*
X148983063Y-89193317D01*
X148853975Y-89036024D01*
X148696682Y-88906936D01*
X148696675Y-88906932D01*
X148517229Y-88811016D01*
X148419864Y-88781481D01*
X148322503Y-88751947D01*
X148322501Y-88751946D01*
X148322503Y-88751946D01*
X148120000Y-88732002D01*
X147917498Y-88751946D01*
X147722770Y-88811016D01*
X147543324Y-88906932D01*
X147543317Y-88906936D01*
X147386024Y-89036024D01*
X147256936Y-89193317D01*
X147256932Y-89193324D01*
X147161016Y-89372770D01*
X147101946Y-89567498D01*
X147082002Y-89770000D01*
X133917998Y-89770000D01*
X133898053Y-89567497D01*
X133838985Y-89372775D01*
X133838983Y-89372772D01*
X133838983Y-89372770D01*
X133743067Y-89193324D01*
X133743063Y-89193317D01*
X133613975Y-89036024D01*
X133456682Y-88906936D01*
X133456675Y-88906932D01*
X133277229Y-88811016D01*
X133179864Y-88781481D01*
X133082503Y-88751947D01*
X133082501Y-88751946D01*
X133082503Y-88751946D01*
X132880000Y-88732002D01*
X132677498Y-88751946D01*
X132482770Y-88811016D01*
X132303324Y-88906932D01*
X132303317Y-88906936D01*
X132146024Y-89036024D01*
X132016936Y-89193317D01*
X132016932Y-89193324D01*
X131921016Y-89372770D01*
X131861946Y-89567498D01*
X131842002Y-89770000D01*
X124142374Y-89770000D01*
X124175500Y-89603465D01*
X124175500Y-89396535D01*
X124135130Y-89193580D01*
X124055941Y-89002402D01*
X123940977Y-88830345D01*
X123940975Y-88830342D01*
X123794657Y-88684024D01*
X123699638Y-88620535D01*
X123622598Y-88569059D01*
X123431420Y-88489870D01*
X123431412Y-88489868D01*
X123228469Y-88449500D01*
X123228465Y-88449500D01*
X122771535Y-88449500D01*
X122771530Y-88449500D01*
X122568587Y-88489868D01*
X122568579Y-88489870D01*
X122377403Y-88569058D01*
X122205342Y-88684024D01*
X122059024Y-88830342D01*
X121944058Y-89002403D01*
X121864870Y-89193579D01*
X121864868Y-89193587D01*
X121824500Y-89396530D01*
X121824500Y-89603469D01*
X121864868Y-89806412D01*
X121864870Y-89806420D01*
X121944058Y-89997596D01*
X122059024Y-90169657D01*
X122205342Y-90315975D01*
X122205345Y-90315977D01*
X122377402Y-90430941D01*
X122487990Y-90476748D01*
X122542393Y-90520589D01*
X122564458Y-90586883D01*
X122547179Y-90654582D01*
X122496042Y-90702193D01*
X122478856Y-90709240D01*
X122356781Y-90748905D01*
X122167442Y-90845379D01*
X121995540Y-90970272D01*
X121995535Y-90970276D01*
X121845276Y-91120535D01*
X121845272Y-91120540D01*
X121720379Y-91292442D01*
X121623904Y-91481782D01*
X121558242Y-91683870D01*
X121558242Y-91683873D01*
X121547769Y-91750000D01*
X122595854Y-91750000D01*
X122557370Y-91816657D01*
X122525000Y-91937465D01*
X122525000Y-92062535D01*
X122557370Y-92183343D01*
X122595854Y-92250000D01*
X121547769Y-92250000D01*
X114500000Y-92250000D01*
X114500000Y-87654269D01*
X121824500Y-87654269D01*
X121827353Y-87684699D01*
X121827353Y-87684701D01*
X121872206Y-87812880D01*
X121872207Y-87812882D01*
X121952850Y-87922150D01*
X122062118Y-88002793D01*
X122104845Y-88017744D01*
X122190299Y-88047646D01*
X122220730Y-88050500D01*
X122220734Y-88050500D01*
X123779270Y-88050500D01*
X123809699Y-88047646D01*
X123809701Y-88047646D01*
X123873790Y-88025219D01*
X123937882Y-88002793D01*
X124047150Y-87922150D01*
X124127793Y-87812882D01*
X124150219Y-87748790D01*
X124172646Y-87684701D01*
X124172646Y-87684699D01*
X124175500Y-87654269D01*
X124175500Y-87230000D01*
X131842002Y-87230000D01*
X131861946Y-87432501D01*
X131921016Y-87627229D01*
X132016932Y-87806675D01*
X132016936Y-87806682D01*
X132146024Y-87963975D01*
X132303317Y-88093063D01*
X132303324Y-88093067D01*
X132482770Y-88188983D01*
X132482772Y-88188983D01*
X132482775Y-88188985D01*
X132677497Y-88248053D01*
X132677496Y-88248053D01*
X132686137Y-88248904D01*
X132880000Y-88267998D01*
X133082503Y-88248053D01*
X133277225Y-88188985D01*
X133456681Y-88093064D01*
X133613975Y-87963975D01*
X133743064Y-87806681D01*
X133838985Y-87627225D01*
X133898053Y-87432503D01*
X133917998Y-87230000D01*
X147082002Y-87230000D01*
X147101946Y-87432501D01*
X147161016Y-87627229D01*
X147256932Y-87806675D01*
X147256936Y-87806682D01*
X147386024Y-87963975D01*
X147543317Y-88093063D01*
X147543324Y-88093067D01*
X147722770Y-88188983D01*
X147722772Y-88188983D01*
X147722775Y-88188985D01*
X147917497Y-88248053D01*
X147917496Y-88248053D01*
X147926137Y-88248904D01*
X148120000Y-88267998D01*
X148322503Y-88248053D01*
X148517225Y-88188985D01*
X148696681Y-88093064D01*
X148853975Y-87963975D01*
X148983064Y-87806681D01*
X149078985Y-87627225D01*
X149138053Y-87432503D01*
X149157998Y-87230000D01*
X149138053Y-87027497D01*
X149078985Y-86832775D01*
X149078983Y-86832772D01*
X149078983Y-86832770D01*
X148983067Y-86653324D01*
X148983063Y-86653317D01*
X148853975Y-86496024D01*
X148696682Y-86366936D01*
X148696675Y-86366932D01*
X148517229Y-86271016D01*
X148419864Y-86241481D01*
X148322503Y-86211947D01*
X148322501Y-86211946D01*
X148322503Y-86211946D01*
X148120000Y-86192002D01*
X147917498Y-86211946D01*
X147722770Y-86271016D01*
X147543324Y-86366932D01*
X147543317Y-86366936D01*
X147386024Y-86496024D01*
X147256936Y-86653317D01*
X147256932Y-86653324D01*
X147161016Y-86832770D01*
X147101946Y-87027498D01*
X147082002Y-87230000D01*
X133917998Y-87230000D01*
X133898053Y-87027497D01*
X133838985Y-86832775D01*
X133838983Y-86832772D01*
X133838983Y-86832770D01*
X133743067Y-86653324D01*
X133743063Y-86653317D01*
X133613975Y-86496024D01*
X133456682Y-86366936D01*
X133456675Y-86366932D01*
X133277229Y-86271016D01*
X133179864Y-86241481D01*
X133082503Y-86211947D01*
X133082501Y-86211946D01*
X133082503Y-86211946D01*
X132880000Y-86192002D01*
X132677498Y-86211946D01*
X132482770Y-86271016D01*
X132303324Y-86366932D01*
X132303317Y-86366936D01*
X132146024Y-86496024D01*
X132016936Y-86653317D01*
X132016932Y-86653324D01*
X131921016Y-86832770D01*
X131861946Y-87027498D01*
X131842002Y-87230000D01*
X124175500Y-87230000D01*
X124175500Y-86345730D01*
X124172646Y-86315300D01*
X124172646Y-86315298D01*
X124127793Y-86187119D01*
X124127792Y-86187117D01*
X124047150Y-86077850D01*
X123937882Y-85997207D01*
X123937880Y-85997206D01*
X123809700Y-85952353D01*
X123779270Y-85949500D01*
X123779266Y-85949500D01*
X122220734Y-85949500D01*
X122220730Y-85949500D01*
X122190300Y-85952353D01*
X122190298Y-85952353D01*
X122062119Y-85997206D01*
X122062117Y-85997207D01*
X121952850Y-86077850D01*
X121872207Y-86187117D01*
X121872206Y-86187119D01*
X121827353Y-86315298D01*
X121827353Y-86315300D01*
X121824500Y-86345730D01*
X121824500Y-87654269D01*
X114500000Y-87654269D01*
X114500000Y-84690000D01*
X131842002Y-84690000D01*
X131861946Y-84892501D01*
X131921016Y-85087229D01*
X132016932Y-85266675D01*
X132016936Y-85266682D01*
X132146024Y-85423975D01*
X132303317Y-85553063D01*
X132303324Y-85553067D01*
X132482770Y-85648983D01*
X132482772Y-85648983D01*
X132482775Y-85648985D01*
X132677497Y-85708053D01*
X132677496Y-85708053D01*
X132695652Y-85709841D01*
X132880000Y-85727998D01*
X133082503Y-85708053D01*
X133277225Y-85648985D01*
X133456681Y-85553064D01*
X133613975Y-85423975D01*
X133743064Y-85266681D01*
X133838985Y-85087225D01*
X133898053Y-84892503D01*
X133917998Y-84690000D01*
X147082002Y-84690000D01*
X147101946Y-84892501D01*
X147161016Y-85087229D01*
X147256932Y-85266675D01*
X147256936Y-85266682D01*
X147386024Y-85423975D01*
X147543317Y-85553063D01*
X147543324Y-85553067D01*
X147722770Y-85648983D01*
X147722772Y-85648983D01*
X147722775Y-85648985D01*
X147917497Y-85708053D01*
X147917496Y-85708053D01*
X147935652Y-85709841D01*
X148120000Y-85727998D01*
X148322503Y-85708053D01*
X148517225Y-85648985D01*
X148696681Y-85553064D01*
X148853975Y-85423975D01*
X148983064Y-85266681D01*
X149078985Y-85087225D01*
X149138053Y-84892503D01*
X149157998Y-84690000D01*
X149138053Y-84487497D01*
X149078985Y-84292775D01*
X149078983Y-84292772D01*
X149078983Y-84292770D01*
X148983067Y-84113324D01*
X148983063Y-84113317D01*
X148853975Y-83956024D01*
X148696682Y-83826936D01*
X148696675Y-83826932D01*
X148517229Y-83731016D01*
X148419864Y-83701481D01*
X148322503Y-83671947D01*
X148322501Y-83671946D01*
X148322503Y-83671946D01*
X148120000Y-83652002D01*
X147917498Y-83671946D01*
X147722770Y-83731016D01*
X147543324Y-83826932D01*
X147543317Y-83826936D01*
X147386024Y-83956024D01*
X147256936Y-84113317D01*
X147256932Y-84113324D01*
X147161016Y-84292770D01*
X147101946Y-84487498D01*
X147082002Y-84690000D01*
X133917998Y-84690000D01*
X133898053Y-84487497D01*
X133838985Y-84292775D01*
X133838983Y-84292772D01*
X133838983Y-84292770D01*
X133743067Y-84113324D01*
X133743063Y-84113317D01*
X133613975Y-83956024D01*
X133456682Y-83826936D01*
X133456675Y-83826932D01*
X133277229Y-83731016D01*
X133179864Y-83701481D01*
X133082503Y-83671947D01*
X133082501Y-83671946D01*
X133082503Y-83671946D01*
X132880000Y-83652002D01*
X132677498Y-83671946D01*
X132482770Y-83731016D01*
X132303324Y-83826932D01*
X132303317Y-83826936D01*
X132146024Y-83956024D01*
X132016936Y-84113317D01*
X132016932Y-84113324D01*
X131921016Y-84292770D01*
X131861946Y-84487498D01*
X131842002Y-84690000D01*
X114500000Y-84690000D01*
X114500000Y-82150000D01*
X131842002Y-82150000D01*
X131861946Y-82352501D01*
X131921016Y-82547229D01*
X132016932Y-82726675D01*
X132016936Y-82726682D01*
X132146024Y-82883975D01*
X132303317Y-83013063D01*
X132303324Y-83013067D01*
X132482770Y-83108983D01*
X132482772Y-83108983D01*
X132482775Y-83108985D01*
X132677497Y-83168053D01*
X132677496Y-83168053D01*
X132695652Y-83169841D01*
X132880000Y-83187998D01*
X133082503Y-83168053D01*
X133277225Y-83108985D01*
X133456681Y-83013064D01*
X133613975Y-82883975D01*
X133743064Y-82726681D01*
X133838985Y-82547225D01*
X133898053Y-82352503D01*
X133917998Y-82150000D01*
X147082002Y-82150000D01*
X147101946Y-82352501D01*
X147161016Y-82547229D01*
X147256932Y-82726675D01*
X147256936Y-82726682D01*
X147386024Y-82883975D01*
X147543317Y-83013063D01*
X147543324Y-83013067D01*
X147722770Y-83108983D01*
X147722772Y-83108983D01*
X147722775Y-83108985D01*
X147917497Y-83168053D01*
X147917496Y-83168053D01*
X147935652Y-83169841D01*
X148120000Y-83187998D01*
X148322503Y-83168053D01*
X148517225Y-83108985D01*
X148696681Y-83013064D01*
X148853975Y-82883975D01*
X148983064Y-82726681D01*
X149078985Y-82547225D01*
X149138053Y-82352503D01*
X149157998Y-82150000D01*
X149138053Y-81947497D01*
X149078985Y-81752775D01*
X149078983Y-81752772D01*
X149078983Y-81752770D01*
X148983067Y-81573324D01*
X148983063Y-81573317D01*
X148853975Y-81416024D01*
X148696682Y-81286936D01*
X148696675Y-81286932D01*
X148517229Y-81191016D01*
X148419864Y-81161481D01*
X148322503Y-81131947D01*
X148322501Y-81131946D01*
X148322503Y-81131946D01*
X148120000Y-81112002D01*
X147917498Y-81131946D01*
X147722770Y-81191016D01*
X147543324Y-81286932D01*
X147543317Y-81286936D01*
X147386024Y-81416024D01*
X147256936Y-81573317D01*
X147256932Y-81573324D01*
X147161016Y-81752770D01*
X147101946Y-81947498D01*
X147082002Y-82150000D01*
X133917998Y-82150000D01*
X133898053Y-81947497D01*
X133838985Y-81752775D01*
X133838983Y-81752772D01*
X133838983Y-81752770D01*
X133743067Y-81573324D01*
X133743063Y-81573317D01*
X133613975Y-81416024D01*
X133456682Y-81286936D01*
X133456675Y-81286932D01*
X133277229Y-81191016D01*
X133179864Y-81161481D01*
X133082503Y-81131947D01*
X133082501Y-81131946D01*
X133082503Y-81131946D01*
X132880000Y-81112002D01*
X132677498Y-81131946D01*
X132482770Y-81191016D01*
X132303324Y-81286932D01*
X132303317Y-81286936D01*
X132146024Y-81416024D01*
X132016936Y-81573317D01*
X132016932Y-81573324D01*
X131921016Y-81752770D01*
X131861946Y-81947498D01*
X131842002Y-82150000D01*
X114500000Y-82150000D01*
X114500000Y-79610000D01*
X131842002Y-79610000D01*
X131861946Y-79812501D01*
X131921016Y-80007229D01*
X132016932Y-80186675D01*
X132016936Y-80186682D01*
X132146024Y-80343975D01*
X132303317Y-80473063D01*
X132303324Y-80473067D01*
X132482770Y-80568983D01*
X132482772Y-80568983D01*
X132482775Y-80568985D01*
X132677497Y-80628053D01*
X132677496Y-80628053D01*
X132695652Y-80629841D01*
X132880000Y-80647998D01*
X133082503Y-80628053D01*
X133277225Y-80568985D01*
X133456681Y-80473064D01*
X133613975Y-80343975D01*
X133743064Y-80186681D01*
X133838985Y-80007225D01*
X133898053Y-79812503D01*
X133917998Y-79610000D01*
X147082002Y-79610000D01*
X147101946Y-79812501D01*
X147161016Y-80007229D01*
X147256932Y-80186675D01*
X147256936Y-80186682D01*
X147386024Y-80343975D01*
X147543317Y-80473063D01*
X147543324Y-80473067D01*
X147722770Y-80568983D01*
X147722772Y-80568983D01*
X147722775Y-80568985D01*
X147917497Y-80628053D01*
X147917496Y-80628053D01*
X147935652Y-80629841D01*
X148120000Y-80647998D01*
X148322503Y-80628053D01*
X148517225Y-80568985D01*
X148696681Y-80473064D01*
X148853975Y-80343975D01*
X148983064Y-80186681D01*
X149078985Y-80007225D01*
X149138053Y-79812503D01*
X149157998Y-79610000D01*
X149138053Y-79407497D01*
X149078985Y-79212775D01*
X149078983Y-79212772D01*
X149078983Y-79212770D01*
X148983067Y-79033324D01*
X148983063Y-79033317D01*
X148853975Y-78876024D01*
X148696682Y-78746936D01*
X148696675Y-78746932D01*
X148517229Y-78651016D01*
X148419864Y-78621481D01*
X148322503Y-78591947D01*
X148322501Y-78591946D01*
X148322503Y-78591946D01*
X148120000Y-78572002D01*
X147917498Y-78591946D01*
X147722770Y-78651016D01*
X147543324Y-78746932D01*
X147543317Y-78746936D01*
X147386024Y-78876024D01*
X147256936Y-79033317D01*
X147256932Y-79033324D01*
X147161016Y-79212770D01*
X147101946Y-79407498D01*
X147082002Y-79610000D01*
X133917998Y-79610000D01*
X133898053Y-79407497D01*
X133838985Y-79212775D01*
X133838983Y-79212772D01*
X133838983Y-79212770D01*
X133743067Y-79033324D01*
X133743063Y-79033317D01*
X133613975Y-78876024D01*
X133456682Y-78746936D01*
X133456675Y-78746932D01*
X133277229Y-78651016D01*
X133179864Y-78621481D01*
X133082503Y-78591947D01*
X133082501Y-78591946D01*
X133082503Y-78591946D01*
X132880000Y-78572002D01*
X132677498Y-78591946D01*
X132482770Y-78651016D01*
X132303324Y-78746932D01*
X132303317Y-78746936D01*
X132146024Y-78876024D01*
X132016936Y-79033317D01*
X132016932Y-79033324D01*
X131921016Y-79212770D01*
X131861946Y-79407498D01*
X131842002Y-79610000D01*
X114500000Y-79610000D01*
X114500000Y-77070000D01*
X131842002Y-77070000D01*
X131861946Y-77272501D01*
X131921016Y-77467229D01*
X132016932Y-77646675D01*
X132016936Y-77646682D01*
X132146024Y-77803975D01*
X132303317Y-77933063D01*
X132303324Y-77933067D01*
X132482770Y-78028983D01*
X132482772Y-78028983D01*
X132482775Y-78028985D01*
X132677497Y-78088053D01*
X132677496Y-78088053D01*
X132695652Y-78089841D01*
X132880000Y-78107998D01*
X133082503Y-78088053D01*
X133277225Y-78028985D01*
X133456681Y-77933064D01*
X133613975Y-77803975D01*
X133743064Y-77646681D01*
X133838985Y-77467225D01*
X133898053Y-77272503D01*
X133917998Y-77070000D01*
X147082002Y-77070000D01*
X147101946Y-77272501D01*
X147161016Y-77467229D01*
X147256932Y-77646675D01*
X147256936Y-77646682D01*
X147386024Y-77803975D01*
X147543317Y-77933063D01*
X147543324Y-77933067D01*
X147722770Y-78028983D01*
X147722772Y-78028983D01*
X147722775Y-78028985D01*
X147917497Y-78088053D01*
X147917496Y-78088053D01*
X147935652Y-78089841D01*
X148120000Y-78107998D01*
X148322503Y-78088053D01*
X148517225Y-78028985D01*
X148696681Y-77933064D01*
X148853975Y-77803975D01*
X148983064Y-77646681D01*
X149078985Y-77467225D01*
X149138053Y-77272503D01*
X149157998Y-77070000D01*
X149138053Y-76867497D01*
X149078985Y-76672775D01*
X149078983Y-76672772D01*
X149078983Y-76672770D01*
X148983067Y-76493324D01*
X148983063Y-76493317D01*
X148853975Y-76336024D01*
X148696682Y-76206936D01*
X148696675Y-76206932D01*
X148517229Y-76111016D01*
X148419864Y-76081481D01*
X148322503Y-76051947D01*
X148322501Y-76051946D01*
X148322503Y-76051946D01*
X148120000Y-76032002D01*
X147917498Y-76051946D01*
X147722770Y-76111016D01*
X147543324Y-76206932D01*
X147543317Y-76206936D01*
X147386024Y-76336024D01*
X147256936Y-76493317D01*
X147256932Y-76493324D01*
X147161016Y-76672770D01*
X147101946Y-76867498D01*
X147082002Y-77070000D01*
X133917998Y-77070000D01*
X133898053Y-76867497D01*
X133838985Y-76672775D01*
X133838983Y-76672772D01*
X133838983Y-76672770D01*
X133743067Y-76493324D01*
X133743063Y-76493317D01*
X133613975Y-76336024D01*
X133456682Y-76206936D01*
X133456675Y-76206932D01*
X133277229Y-76111016D01*
X133179864Y-76081481D01*
X133082503Y-76051947D01*
X133082501Y-76051946D01*
X133082503Y-76051946D01*
X132880000Y-76032002D01*
X132677498Y-76051946D01*
X132482770Y-76111016D01*
X132303324Y-76206932D01*
X132303317Y-76206936D01*
X132146024Y-76336024D01*
X132016936Y-76493317D01*
X132016932Y-76493324D01*
X131921016Y-76672770D01*
X131861946Y-76867498D01*
X131842002Y-77070000D01*
X114500000Y-77070000D01*
X114500000Y-74530000D01*
X131842002Y-74530000D01*
X131861946Y-74732501D01*
X131921016Y-74927229D01*
X132016932Y-75106675D01*
X132016936Y-75106682D01*
X132146024Y-75263975D01*
X132303317Y-75393063D01*
X132303324Y-75393067D01*
X132482770Y-75488983D01*
X132482772Y-75488983D01*
X132482775Y-75488985D01*
X132677497Y-75548053D01*
X132677496Y-75548053D01*
X132695652Y-75549841D01*
X132880000Y-75567998D01*
X133082503Y-75548053D01*
X133277225Y-75488985D01*
X133456681Y-75393064D01*
X133613975Y-75263975D01*
X133743064Y-75106681D01*
X133838985Y-74927225D01*
X133898053Y-74732503D01*
X133917998Y-74530000D01*
X147082002Y-74530000D01*
X147101946Y-74732501D01*
X147161016Y-74927229D01*
X147256932Y-75106675D01*
X147256936Y-75106682D01*
X147386024Y-75263975D01*
X147543317Y-75393063D01*
X147543324Y-75393067D01*
X147722770Y-75488983D01*
X147722772Y-75488983D01*
X147722775Y-75488985D01*
X147917497Y-75548053D01*
X147917496Y-75548053D01*
X147935652Y-75549841D01*
X148120000Y-75567998D01*
X148322503Y-75548053D01*
X148517225Y-75488985D01*
X148696681Y-75393064D01*
X148853975Y-75263975D01*
X148983064Y-75106681D01*
X149078985Y-74927225D01*
X149138053Y-74732503D01*
X149157998Y-74530000D01*
X149138053Y-74327497D01*
X149078985Y-74132775D01*
X149078983Y-74132772D01*
X149078983Y-74132770D01*
X148983067Y-73953324D01*
X148983063Y-73953317D01*
X148853975Y-73796024D01*
X148696682Y-73666936D01*
X148696675Y-73666932D01*
X148517229Y-73571016D01*
X148419864Y-73541481D01*
X148322503Y-73511947D01*
X148322501Y-73511946D01*
X148322503Y-73511946D01*
X148120000Y-73492002D01*
X147917498Y-73511946D01*
X147722770Y-73571016D01*
X147543324Y-73666932D01*
X147543317Y-73666936D01*
X147386024Y-73796024D01*
X147256936Y-73953317D01*
X147256932Y-73953324D01*
X147161016Y-74132770D01*
X147101946Y-74327498D01*
X147082002Y-74530000D01*
X133917998Y-74530000D01*
X133898053Y-74327497D01*
X133838985Y-74132775D01*
X133838983Y-74132772D01*
X133838983Y-74132770D01*
X133743067Y-73953324D01*
X133743063Y-73953317D01*
X133613975Y-73796024D01*
X133456682Y-73666936D01*
X133456675Y-73666932D01*
X133277229Y-73571016D01*
X133179864Y-73541481D01*
X133082503Y-73511947D01*
X133082501Y-73511946D01*
X133082503Y-73511946D01*
X132880000Y-73492002D01*
X132677498Y-73511946D01*
X132482770Y-73571016D01*
X132303324Y-73666932D01*
X132303317Y-73666936D01*
X132146024Y-73796024D01*
X132016936Y-73953317D01*
X132016932Y-73953324D01*
X131921016Y-74132770D01*
X131861946Y-74327498D01*
X131842002Y-74530000D01*
X114500000Y-74530000D01*
X114500000Y-71990000D01*
X131842002Y-71990000D01*
X131861946Y-72192501D01*
X131921016Y-72387229D01*
X132016932Y-72566675D01*
X132016936Y-72566682D01*
X132146024Y-72723975D01*
X132303317Y-72853063D01*
X132303324Y-72853067D01*
X132482770Y-72948983D01*
X132482772Y-72948983D01*
X132482775Y-72948985D01*
X132677497Y-73008053D01*
X132677496Y-73008053D01*
X132695652Y-73009841D01*
X132880000Y-73027998D01*
X133082503Y-73008053D01*
X133277225Y-72948985D01*
X133456681Y-72853064D01*
X133613975Y-72723975D01*
X133743064Y-72566681D01*
X133838985Y-72387225D01*
X133898053Y-72192503D01*
X133917998Y-71990000D01*
X147082002Y-71990000D01*
X147101946Y-72192501D01*
X147161016Y-72387229D01*
X147256932Y-72566675D01*
X147256936Y-72566682D01*
X147386024Y-72723975D01*
X147543317Y-72853063D01*
X147543324Y-72853067D01*
X147722770Y-72948983D01*
X147722772Y-72948983D01*
X147722775Y-72948985D01*
X147917497Y-73008053D01*
X147917496Y-73008053D01*
X147935652Y-73009841D01*
X148120000Y-73027998D01*
X148322503Y-73008053D01*
X148517225Y-72948985D01*
X148696681Y-72853064D01*
X148853975Y-72723975D01*
X148983064Y-72566681D01*
X149078985Y-72387225D01*
X149138053Y-72192503D01*
X149157998Y-71990000D01*
X149138053Y-71787497D01*
X149078985Y-71592775D01*
X149078983Y-71592772D01*
X149078983Y-71592770D01*
X148983067Y-71413324D01*
X148983063Y-71413317D01*
X148853975Y-71256024D01*
X148696682Y-71126936D01*
X148696675Y-71126932D01*
X148517229Y-71031016D01*
X148419864Y-71001481D01*
X148322503Y-70971947D01*
X148322501Y-70971946D01*
X148322503Y-70971946D01*
X148120000Y-70952002D01*
X147917498Y-70971946D01*
X147722770Y-71031016D01*
X147543324Y-71126932D01*
X147543317Y-71126936D01*
X147386024Y-71256024D01*
X147256936Y-71413317D01*
X147256932Y-71413324D01*
X147161016Y-71592770D01*
X147101946Y-71787498D01*
X147082002Y-71990000D01*
X133917998Y-71990000D01*
X133898053Y-71787497D01*
X133838985Y-71592775D01*
X133838983Y-71592772D01*
X133838983Y-71592770D01*
X133743067Y-71413324D01*
X133743063Y-71413317D01*
X133613975Y-71256024D01*
X133456682Y-71126936D01*
X133456675Y-71126932D01*
X133277229Y-71031016D01*
X133179864Y-71001481D01*
X133082503Y-70971947D01*
X133082501Y-70971946D01*
X133082503Y-70971946D01*
X132880000Y-70952002D01*
X132677498Y-70971946D01*
X132482770Y-71031016D01*
X132303324Y-71126932D01*
X132303317Y-71126936D01*
X132146024Y-71256024D01*
X132016936Y-71413317D01*
X132016932Y-71413324D01*
X131921016Y-71592770D01*
X131861946Y-71787498D01*
X131842002Y-71990000D01*
X114500000Y-71990000D01*
X114500000Y-69450000D01*
X131842002Y-69450000D01*
X131861946Y-69652501D01*
X131921016Y-69847229D01*
X132016932Y-70026675D01*
X132016936Y-70026682D01*
X132146024Y-70183975D01*
X132303317Y-70313063D01*
X132303324Y-70313067D01*
X132482770Y-70408983D01*
X132482772Y-70408983D01*
X132482775Y-70408985D01*
X132677497Y-70468053D01*
X132677496Y-70468053D01*
X132695652Y-70469841D01*
X132880000Y-70487998D01*
X133082503Y-70468053D01*
X133277225Y-70408985D01*
X133456681Y-70313064D01*
X133613975Y-70183975D01*
X133743064Y-70026681D01*
X133838985Y-69847225D01*
X133898053Y-69652503D01*
X133917998Y-69450000D01*
X147082002Y-69450000D01*
X147101946Y-69652501D01*
X147161016Y-69847229D01*
X147256932Y-70026675D01*
X147256936Y-70026682D01*
X147386024Y-70183975D01*
X147543317Y-70313063D01*
X147543324Y-70313067D01*
X147722770Y-70408983D01*
X147722772Y-70408983D01*
X147722775Y-70408985D01*
X147917497Y-70468053D01*
X147917496Y-70468053D01*
X147935652Y-70469841D01*
X148120000Y-70487998D01*
X148322503Y-70468053D01*
X148517225Y-70408985D01*
X148696681Y-70313064D01*
X148853975Y-70183975D01*
X148983064Y-70026681D01*
X149078985Y-69847225D01*
X149138053Y-69652503D01*
X149157998Y-69450000D01*
X149138053Y-69247497D01*
X149078985Y-69052775D01*
X149078983Y-69052772D01*
X149078983Y-69052770D01*
X148983067Y-68873324D01*
X148983063Y-68873317D01*
X148853975Y-68716024D01*
X148696682Y-68586936D01*
X148696675Y-68586932D01*
X148517229Y-68491016D01*
X148406928Y-68457557D01*
X148322503Y-68431947D01*
X148322501Y-68431946D01*
X148322503Y-68431946D01*
X148120000Y-68412002D01*
X147917498Y-68431946D01*
X147722770Y-68491016D01*
X147543324Y-68586932D01*
X147543317Y-68586936D01*
X147386024Y-68716024D01*
X147256936Y-68873317D01*
X147256932Y-68873324D01*
X147161016Y-69052770D01*
X147101946Y-69247498D01*
X147082002Y-69450000D01*
X133917998Y-69450000D01*
X133898053Y-69247497D01*
X133838985Y-69052775D01*
X133838983Y-69052772D01*
X133838983Y-69052770D01*
X133743067Y-68873324D01*
X133743063Y-68873317D01*
X133613975Y-68716024D01*
X133456682Y-68586936D01*
X133456675Y-68586932D01*
X133277229Y-68491016D01*
X133166928Y-68457557D01*
X133082503Y-68431947D01*
X133082501Y-68431946D01*
X133082503Y-68431946D01*
X132880000Y-68412002D01*
X132677498Y-68431946D01*
X132482770Y-68491016D01*
X132303324Y-68586932D01*
X132303317Y-68586936D01*
X132146024Y-68716024D01*
X132016936Y-68873317D01*
X132016932Y-68873324D01*
X131921016Y-69052770D01*
X131861946Y-69247498D01*
X131842002Y-69450000D01*
X114500000Y-69450000D01*
X114500000Y-68000000D01*
X122472769Y-68000000D01*
X122483242Y-68066126D01*
X122483242Y-68066129D01*
X122548904Y-68268217D01*
X122645379Y-68457557D01*
X122770272Y-68629459D01*
X122770276Y-68629464D01*
X122920535Y-68779723D01*
X122920540Y-68779727D01*
X123092442Y-68904620D01*
X123281782Y-69001095D01*
X123483870Y-69066757D01*
X123693754Y-69100000D01*
X123700000Y-69100000D01*
X123700000Y-68183012D01*
X123757007Y-68215925D01*
X123884174Y-68250000D01*
X124015826Y-68250000D01*
X124142993Y-68215925D01*
X124200000Y-68183012D01*
X124200000Y-69100000D01*
X124206246Y-69100000D01*
X124416127Y-69066757D01*
X124416130Y-69066757D01*
X124618217Y-69001095D01*
X124807557Y-68904620D01*
X124979459Y-68779727D01*
X124979464Y-68779723D01*
X125129723Y-68629464D01*
X125129727Y-68629459D01*
X125254620Y-68457557D01*
X125351095Y-68268217D01*
X125416757Y-68066129D01*
X125416757Y-68066126D01*
X125427231Y-68000000D01*
X124383012Y-68000000D01*
X124415925Y-67942993D01*
X124450000Y-67815826D01*
X124450000Y-67684174D01*
X124415925Y-67557007D01*
X124383012Y-67500000D01*
X125427231Y-67500000D01*
X125416757Y-67433873D01*
X125416757Y-67433870D01*
X125351095Y-67231782D01*
X125254620Y-67042442D01*
X125158396Y-66910000D01*
X131842002Y-66910000D01*
X131861946Y-67112501D01*
X131921016Y-67307229D01*
X132016932Y-67486675D01*
X132016936Y-67486682D01*
X132146024Y-67643975D01*
X132303317Y-67773063D01*
X132303324Y-67773067D01*
X132482770Y-67868983D01*
X132482772Y-67868983D01*
X132482775Y-67868985D01*
X132677497Y-67928053D01*
X132677496Y-67928053D01*
X132695652Y-67929841D01*
X132880000Y-67947998D01*
X133082503Y-67928053D01*
X133277225Y-67868985D01*
X133456681Y-67773064D01*
X133613975Y-67643975D01*
X133743064Y-67486681D01*
X133838985Y-67307225D01*
X133898053Y-67112503D01*
X133917998Y-66910000D01*
X147082002Y-66910000D01*
X147101946Y-67112501D01*
X147161016Y-67307229D01*
X147256932Y-67486675D01*
X147256936Y-67486682D01*
X147386024Y-67643975D01*
X147543317Y-67773063D01*
X147543324Y-67773067D01*
X147722770Y-67868983D01*
X147722772Y-67868983D01*
X147722775Y-67868985D01*
X147917497Y-67928053D01*
X147917496Y-67928053D01*
X147935652Y-67929841D01*
X148120000Y-67947998D01*
X148322503Y-67928053D01*
X148517225Y-67868985D01*
X148696681Y-67773064D01*
X148853975Y-67643975D01*
X148983064Y-67486681D01*
X149078985Y-67307225D01*
X149138053Y-67112503D01*
X149157998Y-66910000D01*
X149138053Y-66707497D01*
X149078985Y-66512775D01*
X149078983Y-66512772D01*
X149078983Y-66512770D01*
X148983067Y-66333324D01*
X148983063Y-66333317D01*
X148853975Y-66176024D01*
X148696682Y-66046936D01*
X148696675Y-66046932D01*
X148517229Y-65951016D01*
X148363113Y-65904266D01*
X148322503Y-65891947D01*
X148322501Y-65891946D01*
X148322503Y-65891946D01*
X148120000Y-65872002D01*
X147917498Y-65891946D01*
X147722770Y-65951016D01*
X147543324Y-66046932D01*
X147543317Y-66046936D01*
X147386024Y-66176024D01*
X147256936Y-66333317D01*
X147256932Y-66333324D01*
X147161016Y-66512770D01*
X147101946Y-66707498D01*
X147082002Y-66910000D01*
X133917998Y-66910000D01*
X133898053Y-66707497D01*
X133838985Y-66512775D01*
X133838983Y-66512772D01*
X133838983Y-66512770D01*
X133743067Y-66333324D01*
X133743063Y-66333317D01*
X133613975Y-66176024D01*
X133456682Y-66046936D01*
X133456675Y-66046932D01*
X133277229Y-65951016D01*
X133123113Y-65904266D01*
X133082503Y-65891947D01*
X133082501Y-65891946D01*
X133082503Y-65891946D01*
X132880000Y-65872002D01*
X132677498Y-65891946D01*
X132482770Y-65951016D01*
X132303324Y-66046932D01*
X132303317Y-66046936D01*
X132146024Y-66176024D01*
X132016936Y-66333317D01*
X132016932Y-66333324D01*
X131921016Y-66512770D01*
X131861946Y-66707498D01*
X131842002Y-66910000D01*
X125158396Y-66910000D01*
X125129727Y-66870540D01*
X125129723Y-66870535D01*
X124979464Y-66720276D01*
X124979459Y-66720272D01*
X124807557Y-66595379D01*
X124689029Y-66534985D01*
X124638233Y-66487010D01*
X124621438Y-66419189D01*
X124643976Y-66353054D01*
X124698691Y-66309603D01*
X124745324Y-66300500D01*
X124754270Y-66300500D01*
X124784699Y-66297646D01*
X124784701Y-66297646D01*
X124848790Y-66275219D01*
X124912882Y-66252793D01*
X125022150Y-66172150D01*
X125102793Y-66062882D01*
X125125219Y-65998790D01*
X125147646Y-65934701D01*
X125147646Y-65934699D01*
X125150500Y-65904269D01*
X125150500Y-64595730D01*
X125147646Y-64565300D01*
X125147646Y-64565298D01*
X125102793Y-64437119D01*
X125102792Y-64437117D01*
X125053258Y-64370000D01*
X131842002Y-64370000D01*
X131861946Y-64572501D01*
X131921016Y-64767229D01*
X132016932Y-64946675D01*
X132016936Y-64946682D01*
X132146024Y-65103975D01*
X132303317Y-65233063D01*
X132303324Y-65233067D01*
X132482770Y-65328983D01*
X132482772Y-65328983D01*
X132482775Y-65328985D01*
X132677497Y-65388053D01*
X132677496Y-65388053D01*
X132695652Y-65389841D01*
X132880000Y-65407998D01*
X133082503Y-65388053D01*
X133277225Y-65328985D01*
X133456681Y-65233064D01*
X133613975Y-65103975D01*
X133743064Y-64946681D01*
X133838985Y-64767225D01*
X133898053Y-64572503D01*
X133917998Y-64370000D01*
X133898053Y-64167497D01*
X133838985Y-63972775D01*
X133838983Y-63972772D01*
X133838983Y-63972770D01*
X133743067Y-63793324D01*
X133743063Y-63793317D01*
X133613975Y-63636024D01*
X133456682Y-63506936D01*
X133456675Y-63506932D01*
X133277229Y-63411016D01*
X133153719Y-63373550D01*
X133082503Y-63351947D01*
X133082501Y-63351946D01*
X133082503Y-63351946D01*
X132880000Y-63332002D01*
X132677498Y-63351946D01*
X132482770Y-63411016D01*
X132303324Y-63506932D01*
X132303317Y-63506936D01*
X132146024Y-63636024D01*
X132016936Y-63793317D01*
X132016932Y-63793324D01*
X131921016Y-63972770D01*
X131861946Y-64167498D01*
X131842002Y-64370000D01*
X125053258Y-64370000D01*
X125022150Y-64327850D01*
X124912882Y-64247207D01*
X124912880Y-64247206D01*
X124784700Y-64202353D01*
X124754270Y-64199500D01*
X124754266Y-64199500D01*
X123145734Y-64199500D01*
X123145730Y-64199500D01*
X123115300Y-64202353D01*
X123115298Y-64202353D01*
X122987119Y-64247206D01*
X122987117Y-64247207D01*
X122877850Y-64327850D01*
X122797207Y-64437117D01*
X122797206Y-64437119D01*
X122752353Y-64565298D01*
X122752353Y-64565300D01*
X122749500Y-64595730D01*
X122749500Y-65904269D01*
X122752353Y-65934699D01*
X122752353Y-65934701D01*
X122791627Y-66046936D01*
X122797207Y-66062882D01*
X122877850Y-66172150D01*
X122987118Y-66252793D01*
X123029845Y-66267744D01*
X123115299Y-66297646D01*
X123145730Y-66300500D01*
X123154676Y-66300500D01*
X123221715Y-66320185D01*
X123267470Y-66372989D01*
X123277414Y-66442147D01*
X123248389Y-66505703D01*
X123210971Y-66534985D01*
X123092442Y-66595379D01*
X122920540Y-66720272D01*
X122920535Y-66720276D01*
X122770276Y-66870535D01*
X122770272Y-66870540D01*
X122645379Y-67042442D01*
X122548904Y-67231782D01*
X122483242Y-67433870D01*
X122483242Y-67433873D01*
X122472769Y-67500000D01*
X123516988Y-67500000D01*
X123484075Y-67557007D01*
X123450000Y-67684174D01*
X123450000Y-67815826D01*
X123484075Y-67942993D01*
X123516988Y-68000000D01*
X122472769Y-68000000D01*
X114500000Y-68000000D01*
X114500000Y-59290001D01*
X131542410Y-59290001D01*
X131562730Y-59522264D01*
X131562731Y-59522272D01*
X131623075Y-59747478D01*
X131623078Y-59747484D01*
X131721612Y-59958793D01*
X131721613Y-59958795D01*
X131777638Y-60038807D01*
X131777639Y-60038808D01*
X132352129Y-59464317D01*
X132362822Y-59504222D01*
X132435890Y-59630778D01*
X132539222Y-59734110D01*
X132665778Y-59807178D01*
X132705682Y-59817870D01*
X132131190Y-60392360D01*
X132211209Y-60448388D01*
X132422515Y-60546921D01*
X132422524Y-60546925D01*
X132602374Y-60595115D01*
X132662035Y-60631480D01*
X132692564Y-60694327D01*
X132684270Y-60763702D01*
X132639784Y-60817580D01*
X132606277Y-60833550D01*
X132482773Y-60871015D01*
X132303324Y-60966932D01*
X132303317Y-60966936D01*
X132146024Y-61096024D01*
X132016936Y-61253317D01*
X132016932Y-61253324D01*
X131921016Y-61432770D01*
X131861946Y-61627498D01*
X131842002Y-61830000D01*
X131861946Y-62032501D01*
X131921016Y-62227229D01*
X132016932Y-62406675D01*
X132016936Y-62406682D01*
X132146024Y-62563975D01*
X132303317Y-62693063D01*
X132303324Y-62693067D01*
X132482770Y-62788983D01*
X132482772Y-62788983D01*
X132482775Y-62788985D01*
X132677497Y-62848053D01*
X132677496Y-62848053D01*
X132695652Y-62849841D01*
X132880000Y-62867998D01*
X133082503Y-62848053D01*
X133277225Y-62788985D01*
X133456681Y-62693064D01*
X133613975Y-62563975D01*
X133743064Y-62406681D01*
X133838985Y-62227225D01*
X133898053Y-62032503D01*
X133917998Y-61830001D01*
X146782410Y-61830001D01*
X146802730Y-62062264D01*
X146802731Y-62062272D01*
X146863075Y-62287478D01*
X146863078Y-62287484D01*
X146961612Y-62498793D01*
X146961613Y-62498795D01*
X147017638Y-62578807D01*
X147017639Y-62578808D01*
X147592129Y-62004317D01*
X147602822Y-62044222D01*
X147675890Y-62170778D01*
X147779222Y-62274110D01*
X147905778Y-62347178D01*
X147945682Y-62357870D01*
X147371190Y-62932360D01*
X147451209Y-62988388D01*
X147662515Y-63086921D01*
X147662524Y-63086925D01*
X147842374Y-63135115D01*
X147902035Y-63171480D01*
X147932564Y-63234327D01*
X147924270Y-63303702D01*
X147879784Y-63357580D01*
X147846277Y-63373550D01*
X147722773Y-63411015D01*
X147543324Y-63506932D01*
X147543317Y-63506936D01*
X147386024Y-63636024D01*
X147256936Y-63793317D01*
X147256932Y-63793324D01*
X147161016Y-63972770D01*
X147101946Y-64167498D01*
X147082002Y-64370000D01*
X147101946Y-64572501D01*
X147161016Y-64767229D01*
X147256932Y-64946675D01*
X147256936Y-64946682D01*
X147386024Y-65103975D01*
X147543317Y-65233063D01*
X147543324Y-65233067D01*
X147722770Y-65328983D01*
X147722772Y-65328983D01*
X147722775Y-65328985D01*
X147917497Y-65388053D01*
X147917496Y-65388053D01*
X147935652Y-65389841D01*
X148120000Y-65407998D01*
X148322503Y-65388053D01*
X148517225Y-65328985D01*
X148696681Y-65233064D01*
X148853975Y-65103975D01*
X148983064Y-64946681D01*
X149078985Y-64767225D01*
X149138053Y-64572503D01*
X149157998Y-64370000D01*
X149138053Y-64167497D01*
X149078985Y-63972775D01*
X149078983Y-63972772D01*
X149078983Y-63972770D01*
X148983067Y-63793324D01*
X148983063Y-63793317D01*
X148853975Y-63636024D01*
X148696682Y-63506936D01*
X148696675Y-63506932D01*
X148517226Y-63411015D01*
X148393722Y-63373550D01*
X148335284Y-63335253D01*
X148306827Y-63271440D01*
X148317388Y-63202373D01*
X148363613Y-63149980D01*
X148397625Y-63135115D01*
X148577475Y-63086925D01*
X148577484Y-63086921D01*
X148788794Y-62988386D01*
X148868808Y-62932360D01*
X148294317Y-62357870D01*
X148334222Y-62347178D01*
X148460778Y-62274110D01*
X148564110Y-62170778D01*
X148637178Y-62044222D01*
X148647870Y-62004317D01*
X149222360Y-62578808D01*
X149278386Y-62498794D01*
X149376921Y-62287484D01*
X149376924Y-62287478D01*
X149437268Y-62062272D01*
X149437269Y-62062264D01*
X149457590Y-61830001D01*
X149457590Y-61829998D01*
X149437269Y-61597735D01*
X149437268Y-61597727D01*
X149376924Y-61372521D01*
X149376921Y-61372515D01*
X149278388Y-61161209D01*
X149222359Y-61081190D01*
X148647869Y-61655681D01*
X148637178Y-61615778D01*
X148564110Y-61489222D01*
X148460778Y-61385890D01*
X148334222Y-61312822D01*
X148294317Y-61302129D01*
X148868808Y-60727639D01*
X148868807Y-60727638D01*
X148788795Y-60671613D01*
X148788793Y-60671612D01*
X148577484Y-60573078D01*
X148577475Y-60573074D01*
X148397625Y-60524884D01*
X148337964Y-60488519D01*
X148307435Y-60425672D01*
X148315730Y-60356296D01*
X148360215Y-60302419D01*
X148393718Y-60286450D01*
X148517225Y-60248985D01*
X148696681Y-60153064D01*
X148853975Y-60023975D01*
X148983064Y-59866681D01*
X149078985Y-59687225D01*
X149138053Y-59492503D01*
X149157998Y-59290000D01*
X149138053Y-59087497D01*
X149078985Y-58892775D01*
X149078983Y-58892772D01*
X149078983Y-58892770D01*
X148983067Y-58713324D01*
X148983063Y-58713317D01*
X148853975Y-58556024D01*
X148696682Y-58426936D01*
X148696675Y-58426932D01*
X148517229Y-58331016D01*
X148419864Y-58301481D01*
X148322503Y-58271947D01*
X148322501Y-58271946D01*
X148322503Y-58271946D01*
X148120000Y-58252002D01*
X147917498Y-58271946D01*
X147722770Y-58331016D01*
X147543324Y-58426932D01*
X147543317Y-58426936D01*
X147386024Y-58556024D01*
X147256936Y-58713317D01*
X147256932Y-58713324D01*
X147161016Y-58892770D01*
X147101946Y-59087498D01*
X147082002Y-59290000D01*
X147101946Y-59492501D01*
X147161016Y-59687229D01*
X147256932Y-59866675D01*
X147256936Y-59866682D01*
X147386024Y-60023975D01*
X147543317Y-60153063D01*
X147543324Y-60153067D01*
X147722770Y-60248983D01*
X147722772Y-60248983D01*
X147722775Y-60248985D01*
X147846277Y-60286448D01*
X147904715Y-60324746D01*
X147933171Y-60388558D01*
X147922611Y-60457625D01*
X147876387Y-60510019D01*
X147842375Y-60524884D01*
X147662521Y-60573075D01*
X147662515Y-60573078D01*
X147451202Y-60671614D01*
X147371190Y-60727637D01*
X147945682Y-61302129D01*
X147905778Y-61312822D01*
X147779222Y-61385890D01*
X147675890Y-61489222D01*
X147602822Y-61615778D01*
X147592129Y-61655682D01*
X147017637Y-61081190D01*
X146961614Y-61161202D01*
X146863078Y-61372515D01*
X146863075Y-61372521D01*
X146802731Y-61597727D01*
X146802730Y-61597735D01*
X146782410Y-61829998D01*
X146782410Y-61830001D01*
X133917998Y-61830001D01*
X133917998Y-61830000D01*
X133898053Y-61627497D01*
X133838985Y-61432775D01*
X133838983Y-61432772D01*
X133838983Y-61432770D01*
X133743067Y-61253324D01*
X133743063Y-61253317D01*
X133613975Y-61096024D01*
X133456682Y-60966936D01*
X133456675Y-60966932D01*
X133277226Y-60871015D01*
X133153722Y-60833550D01*
X133095284Y-60795253D01*
X133066827Y-60731440D01*
X133077388Y-60662373D01*
X133123613Y-60609980D01*
X133157625Y-60595115D01*
X133337475Y-60546925D01*
X133337484Y-60546921D01*
X133548794Y-60448386D01*
X133628808Y-60392360D01*
X133054317Y-59817870D01*
X133094222Y-59807178D01*
X133220778Y-59734110D01*
X133324110Y-59630778D01*
X133397178Y-59504222D01*
X133407870Y-59464318D01*
X133982360Y-60038808D01*
X134038386Y-59958794D01*
X134136921Y-59747484D01*
X134136924Y-59747478D01*
X134197268Y-59522272D01*
X134197269Y-59522264D01*
X134217590Y-59290001D01*
X134217590Y-59289998D01*
X134197269Y-59057735D01*
X134197268Y-59057727D01*
X134136924Y-58832521D01*
X134136921Y-58832515D01*
X134038388Y-58621209D01*
X133982359Y-58541190D01*
X133407869Y-59115681D01*
X133397178Y-59075778D01*
X133324110Y-58949222D01*
X133220778Y-58845890D01*
X133094222Y-58772822D01*
X133054317Y-58762129D01*
X133628808Y-58187639D01*
X133628807Y-58187638D01*
X133548795Y-58131613D01*
X133548793Y-58131612D01*
X133337484Y-58033078D01*
X133337478Y-58033075D01*
X133112272Y-57972731D01*
X133112264Y-57972730D01*
X132880002Y-57952410D01*
X132879998Y-57952410D01*
X132647735Y-57972730D01*
X132647727Y-57972731D01*
X132422521Y-58033075D01*
X132422515Y-58033078D01*
X132211202Y-58131614D01*
X132131190Y-58187637D01*
X132705682Y-58762129D01*
X132665778Y-58772822D01*
X132539222Y-58845890D01*
X132435890Y-58949222D01*
X132362822Y-59075778D01*
X132352129Y-59115682D01*
X131777637Y-58541190D01*
X131721614Y-58621202D01*
X131623078Y-58832515D01*
X131623075Y-58832521D01*
X131562731Y-59057727D01*
X131562730Y-59057735D01*
X131542410Y-59289998D01*
X131542410Y-59290001D01*
X114500000Y-59290001D01*
X114500000Y-57113219D01*
X116272500Y-57113219D01*
X116272501Y-57113235D01*
X116302056Y-57337731D01*
X116302057Y-57337736D01*
X116302058Y-57337742D01*
X116302059Y-57337744D01*
X116360667Y-57556476D01*
X116447322Y-57765681D01*
X116447329Y-57765696D01*
X116560553Y-57961806D01*
X116698408Y-58141462D01*
X116698414Y-58141469D01*
X116858530Y-58301585D01*
X116858537Y-58301591D01*
X117038193Y-58439446D01*
X117234303Y-58552670D01*
X117234318Y-58552677D01*
X117342507Y-58597490D01*
X117443522Y-58639332D01*
X117662258Y-58697942D01*
X117886774Y-58727500D01*
X117886781Y-58727500D01*
X118113219Y-58727500D01*
X118113226Y-58727500D01*
X118337742Y-58697942D01*
X118556478Y-58639332D01*
X118765693Y-58552672D01*
X118961807Y-58439446D01*
X119141464Y-58301590D01*
X119301590Y-58141464D01*
X119439446Y-57961807D01*
X119552672Y-57765693D01*
X119639332Y-57556478D01*
X119697942Y-57337742D01*
X119727500Y-57113226D01*
X119727500Y-57113219D01*
X160772500Y-57113219D01*
X160772501Y-57113235D01*
X160802056Y-57337731D01*
X160802057Y-57337736D01*
X160802058Y-57337742D01*
X160802059Y-57337744D01*
X160860667Y-57556476D01*
X160947322Y-57765681D01*
X160947329Y-57765696D01*
X161060553Y-57961806D01*
X161198408Y-58141462D01*
X161198414Y-58141469D01*
X161358530Y-58301585D01*
X161358537Y-58301591D01*
X161538193Y-58439446D01*
X161734303Y-58552670D01*
X161734318Y-58552677D01*
X161842507Y-58597490D01*
X161943522Y-58639332D01*
X162162258Y-58697942D01*
X162386774Y-58727500D01*
X162386781Y-58727500D01*
X162613219Y-58727500D01*
X162613226Y-58727500D01*
X162837742Y-58697942D01*
X163056478Y-58639332D01*
X163265693Y-58552672D01*
X163461807Y-58439446D01*
X163641464Y-58301590D01*
X163801590Y-58141464D01*
X163939446Y-57961807D01*
X164052672Y-57765693D01*
X164139332Y-57556478D01*
X164197942Y-57337742D01*
X164227500Y-57113226D01*
X164227500Y-56886774D01*
X164197942Y-56662258D01*
X164139332Y-56443522D01*
X164052672Y-56234307D01*
X163939446Y-56038193D01*
X163801590Y-55858536D01*
X163801585Y-55858530D01*
X163641469Y-55698414D01*
X163641462Y-55698408D01*
X163461806Y-55560553D01*
X163265696Y-55447329D01*
X163265681Y-55447322D01*
X163056476Y-55360667D01*
X162947110Y-55331363D01*
X162837742Y-55302058D01*
X162837736Y-55302057D01*
X162837731Y-55302056D01*
X162613235Y-55272501D01*
X162613232Y-55272500D01*
X162613226Y-55272500D01*
X162386774Y-55272500D01*
X162386768Y-55272500D01*
X162386764Y-55272501D01*
X162162268Y-55302056D01*
X162162261Y-55302057D01*
X162162258Y-55302058D01*
X162116031Y-55314444D01*
X161943523Y-55360667D01*
X161734318Y-55447322D01*
X161734303Y-55447329D01*
X161538193Y-55560553D01*
X161358537Y-55698408D01*
X161358530Y-55698414D01*
X161198414Y-55858530D01*
X161198408Y-55858537D01*
X161060553Y-56038193D01*
X160947329Y-56234303D01*
X160947322Y-56234318D01*
X160860667Y-56443523D01*
X160802059Y-56662255D01*
X160802056Y-56662268D01*
X160772501Y-56886764D01*
X160772500Y-56886780D01*
X160772500Y-57113219D01*
X119727500Y-57113219D01*
X119727500Y-56886774D01*
X119697942Y-56662258D01*
X119639332Y-56443522D01*
X119552672Y-56234307D01*
X119439446Y-56038193D01*
X119301590Y-55858536D01*
X119301585Y-55858530D01*
X119141469Y-55698414D01*
X119141462Y-55698408D01*
X118961806Y-55560553D01*
X118765696Y-55447329D01*
X118765681Y-55447322D01*
X118556476Y-55360667D01*
X118447110Y-55331363D01*
X118337742Y-55302058D01*
X118337736Y-55302057D01*
X118337731Y-55302056D01*
X118113235Y-55272501D01*
X118113232Y-55272500D01*
X118113226Y-55272500D01*
X117886774Y-55272500D01*
X117886768Y-55272500D01*
X117886764Y-55272501D01*
X117662268Y-55302056D01*
X117662261Y-55302057D01*
X117662258Y-55302058D01*
X117616031Y-55314444D01*
X117443523Y-55360667D01*
X117234318Y-55447322D01*
X117234303Y-55447329D01*
X117038193Y-55560553D01*
X116858537Y-55698408D01*
X116858530Y-55698414D01*
X116698414Y-55858530D01*
X116698408Y-55858537D01*
X116560553Y-56038193D01*
X116447329Y-56234303D01*
X116447322Y-56234318D01*
X116360667Y-56443523D01*
X116302059Y-56662255D01*
X116302056Y-56662268D01*
X116272501Y-56886764D01*
X116272500Y-56886780D01*
X116272500Y-57113219D01*
X114500000Y-57113219D01*
X114500000Y-53124000D01*
X114519685Y-53056961D01*
X114572489Y-53011206D01*
X114624000Y-53000000D01*
X165876000Y-53000000D01*
X165943039Y-53019685D01*
G37*
%TD.AperFunction*%
%TD*%
M02*
