(kicad_sch
	(version 20231120)
	(generator "eeschema")
	(generator_version "8.0")
	(uuid "d0f1f5d0-4417-4e42-8bf0-3981df801fc2")
	(paper "A4")
	(lib_symbols
		(symbol "00_parts:EXB-E10C272J"
			(pin_names
				(offset 1.016)
			)
			(exclude_from_sim no)
			(in_bom yes)
			(on_board yes)
			(property "Reference" "R1"
				(at 8.636 -23.114 0)
				(effects
					(font
						(size 1.27 1.27)
					)
					(justify right)
				)
			)
			(property "Value" "EXB-E10C272J"
				(at -2.54 -23.114 0)
				(effects
					(font
						(size 1.27 1.27)
					)
					(justify right)
				)
			)
			(property "Footprint" "00_parts:RESCAV80P400X210X65-10N"
				(at 0 0 0)
				(effects
					(font
						(size 1.27 1.27)
					)
					(justify bottom)
					(hide yes)
				)
			)
			(property "Datasheet" ""
				(at 0 0 0)
				(effects
					(font
						(size 1.27 1.27)
					)
					(hide yes)
				)
			)
			(property "Description" ""
				(at 0 0 0)
				(effects
					(font
						(size 1.27 1.27)
					)
					(hide yes)
				)
			)
			(property "MF" "Panasonic"
				(at 0 0 0)
				(effects
					(font
						(size 1.27 1.27)
					)
					(justify bottom)
					(hide yes)
				)
			)
			(property "MAXIMUM_PACKAGE_HEIGHT" "0.65 mm"
				(at 0 0 0)
				(effects
					(font
						(size 1.27 1.27)
					)
					(justify bottom)
					(hide yes)
				)
			)
			(property "Package" "1608 Panasonic"
				(at 0 0 0)
				(effects
					(font
						(size 1.27 1.27)
					)
					(justify bottom)
					(hide yes)
				)
			)
			(property "Price" "None"
				(at 0 0 0)
				(effects
					(font
						(size 1.27 1.27)
					)
					(justify bottom)
					(hide yes)
				)
			)
			(property "Check_prices" "https://www.snapeda.com/parts/EXB-E10C272J/Panasonic/view-part/?ref=eda"
				(at 0 0 0)
				(effects
					(font
						(size 1.27 1.27)
					)
					(justify bottom)
					(hide yes)
				)
			)
			(property "STANDARD" "IPC 7351B"
				(at 0 0 0)
				(effects
					(font
						(size 1.27 1.27)
					)
					(justify bottom)
					(hide yes)
				)
			)
			(property "PARTREV" "1-Mar-20"
				(at 0 0 0)
				(effects
					(font
						(size 1.27 1.27)
					)
					(justify bottom)
					(hide yes)
				)
			)
			(property "SnapEDA_Link" "https://www.snapeda.com/parts/EXB-E10C272J/Panasonic/view-part/?ref=snap"
				(at 0 0 0)
				(effects
					(font
						(size 1.27 1.27)
					)
					(justify bottom)
					(hide yes)
				)
			)
			(property "MP" "EXB-E10C272J"
				(at 0 0 0)
				(effects
					(font
						(size 1.27 1.27)
					)
					(justify bottom)
					(hide yes)
				)
			)
			(property "Description_1" "\n2.7k Ohm ±5% 62.5mW Power Per Element Bussed 8 Resistor Network/Array ±200ppm/°C 1608, Concave, Long Side Terminals\n"
				(at 0 0 0)
				(effects
					(font
						(size 1.27 1.27)
					)
					(justify bottom)
					(hide yes)
				)
			)
			(property "Availability" "In Stock"
				(at 0 0 0)
				(effects
					(font
						(size 1.27 1.27)
					)
					(justify bottom)
					(hide yes)
				)
			)
			(property "MANUFACTURER" "Panasonic"
				(at 0 0 0)
				(effects
					(font
						(size 1.27 1.27)
					)
					(justify bottom)
					(hide yes)
				)
			)
			(symbol "EXB-E10C272J_0_0"
				(rectangle
					(start -15.24 20.32)
					(end 15.24 -20.32)
					(stroke
						(width 0.254)
						(type default)
					)
					(fill
						(type background)
					)
				)
				(circle
					(center 0 -15.24)
					(radius 0.254)
					(stroke
						(width 0.508)
						(type default)
					)
					(fill
						(type none)
					)
				)
				(circle
					(center 0 -7.62)
					(radius 0.254)
					(stroke
						(width 0.508)
						(type default)
					)
					(fill
						(type none)
					)
				)
				(polyline
					(pts
						(xy -12.7 -15.24) (xy -15.24 -15.24)
					)
					(stroke
						(width 0.254)
						(type default)
					)
					(fill
						(type none)
					)
				)
				(polyline
					(pts
						(xy -12.7 -15.24) (xy -12.065 -13.335)
					)
					(stroke
						(width 0.254)
						(type default)
					)
					(fill
						(type none)
					)
				)
				(polyline
					(pts
						(xy -12.7 -7.62) (xy -15.24 -7.62)
					)
					(stroke
						(width 0.254)
						(type default)
					)
					(fill
						(type none)
					)
				)
				(polyline
					(pts
						(xy -12.7 -7.62) (xy -12.065 -5.715)
					)
					(stroke
						(width 0.254)
						(type default)
					)
					(fill
						(type none)
					)
				)
				(polyline
					(pts
						(xy -12.7 0) (xy -15.24 0)
					)
					(stroke
						(width 0.254)
						(type default)
					)
					(fill
						(type none)
					)
				)
				(polyline
					(pts
						(xy -12.7 0) (xy -12.065 1.905)
					)
					(stroke
						(width 0.254)
						(type default)
					)
					(fill
						(type none)
					)
				)
				(polyline
					(pts
						(xy -12.7 7.62) (xy -15.24 7.62)
					)
					(stroke
						(width 0.254)
						(type default)
					)
					(fill
						(type none)
					)
				)
				(polyline
					(pts
						(xy -12.7 7.62) (xy -12.065 9.525)
					)
					(stroke
						(width 0.254)
						(type default)
					)
					(fill
						(type none)
					)
				)
				(polyline
					(pts
						(xy -12.065 -13.335) (xy -10.795 -17.145)
					)
					(stroke
						(width 0.254)
						(type default)
					)
					(fill
						(type none)
					)
				)
				(polyline
					(pts
						(xy -12.065 -5.715) (xy -10.795 -9.525)
					)
					(stroke
						(width 0.254)
						(type default)
					)
					(fill
						(type none)
					)
				)
				(polyline
					(pts
						(xy -12.065 1.905) (xy -10.795 -1.905)
					)
					(stroke
						(width 0.254)
						(type default)
					)
					(fill
						(type none)
					)
				)
				(polyline
					(pts
						(xy -12.065 9.525) (xy -10.795 5.715)
					)
					(stroke
						(width 0.254)
						(type default)
					)
					(fill
						(type none)
					)
				)
				(polyline
					(pts
						(xy -10.795 -17.145) (xy -9.525 -13.335)
					)
					(stroke
						(width 0.254)
						(type default)
					)
					(fill
						(type none)
					)
				)
				(polyline
					(pts
						(xy -10.795 -9.525) (xy -9.525 -5.715)
					)
					(stroke
						(width 0.254)
						(type default)
					)
					(fill
						(type none)
					)
				)
				(polyline
					(pts
						(xy -10.795 -1.905) (xy -9.525 1.905)
					)
					(stroke
						(width 0.254)
						(type default)
					)
					(fill
						(type none)
					)
				)
				(polyline
					(pts
						(xy -10.795 5.715) (xy -9.525 9.525)
					)
					(stroke
						(width 0.254)
						(type default)
					)
					(fill
						(type none)
					)
				)
				(polyline
					(pts
						(xy -9.525 -13.335) (xy -8.255 -17.145)
					)
					(stroke
						(width 0.254)
						(type default)
					)
					(fill
						(type none)
					)
				)
				(polyline
					(pts
						(xy -9.525 -5.715) (xy -8.255 -9.525)
					)
					(stroke
						(width 0.254)
						(type default)
					)
					(fill
						(type none)
					)
				)
				(polyline
					(pts
						(xy -9.525 1.905) (xy -8.255 -1.905)
					)
					(stroke
						(width 0.254)
						(type default)
					)
					(fill
						(type none)
					)
				)
				(polyline
					(pts
						(xy -9.525 9.525) (xy -8.255 5.715)
					)
					(stroke
						(width 0.254)
						(type default)
					)
					(fill
						(type none)
					)
				)
				(polyline
					(pts
						(xy -8.255 -17.145) (xy -6.985 -13.335)
					)
					(stroke
						(width 0.254)
						(type default)
					)
					(fill
						(type none)
					)
				)
				(polyline
					(pts
						(xy -8.255 -9.525) (xy -6.985 -5.715)
					)
					(stroke
						(width 0.254)
						(type default)
					)
					(fill
						(type none)
					)
				)
				(polyline
					(pts
						(xy -8.255 -1.905) (xy -6.985 1.905)
					)
					(stroke
						(width 0.254)
						(type default)
					)
					(fill
						(type none)
					)
				)
				(polyline
					(pts
						(xy -8.255 5.715) (xy -6.985 9.525)
					)
					(stroke
						(width 0.254)
						(type default)
					)
					(fill
						(type none)
					)
				)
				(polyline
					(pts
						(xy -6.985 -13.335) (xy -5.715 -17.145)
					)
					(stroke
						(width 0.254)
						(type default)
					)
					(fill
						(type none)
					)
				)
				(polyline
					(pts
						(xy -6.985 -5.715) (xy -5.715 -9.525)
					)
					(stroke
						(width 0.254)
						(type default)
					)
					(fill
						(type none)
					)
				)
				(polyline
					(pts
						(xy -6.985 1.905) (xy -5.715 -1.905)
					)
					(stroke
						(width 0.254)
						(type default)
					)
					(fill
						(type none)
					)
				)
				(polyline
					(pts
						(xy -6.985 9.525) (xy -5.715 5.715)
					)
					(stroke
						(width 0.254)
						(type default)
					)
					(fill
						(type none)
					)
				)
				(polyline
					(pts
						(xy -5.715 -17.145) (xy -4.445 -13.335)
					)
					(stroke
						(width 0.254)
						(type default)
					)
					(fill
						(type none)
					)
				)
				(polyline
					(pts
						(xy -5.715 -9.525) (xy -4.445 -5.715)
					)
					(stroke
						(width 0.254)
						(type default)
					)
					(fill
						(type none)
					)
				)
				(polyline
					(pts
						(xy -5.715 -1.905) (xy -4.445 1.905)
					)
					(stroke
						(width 0.254)
						(type default)
					)
					(fill
						(type none)
					)
				)
				(polyline
					(pts
						(xy -5.715 5.715) (xy -4.445 9.525)
					)
					(stroke
						(width 0.254)
						(type default)
					)
					(fill
						(type none)
					)
				)
				(polyline
					(pts
						(xy -4.445 -13.335) (xy -3.175 -17.145)
					)
					(stroke
						(width 0.254)
						(type default)
					)
					(fill
						(type none)
					)
				)
				(polyline
					(pts
						(xy -4.445 -5.715) (xy -3.175 -9.525)
					)
					(stroke
						(width 0.254)
						(type default)
					)
					(fill
						(type none)
					)
				)
				(polyline
					(pts
						(xy -4.445 1.905) (xy -3.175 -1.905)
					)
					(stroke
						(width 0.254)
						(type default)
					)
					(fill
						(type none)
					)
				)
				(polyline
					(pts
						(xy -4.445 9.525) (xy -3.175 5.715)
					)
					(stroke
						(width 0.254)
						(type default)
					)
					(fill
						(type none)
					)
				)
				(polyline
					(pts
						(xy -3.175 -17.145) (xy -2.54 -15.24)
					)
					(stroke
						(width 0.254)
						(type default)
					)
					(fill
						(type none)
					)
				)
				(polyline
					(pts
						(xy -3.175 -9.525) (xy -2.54 -7.62)
					)
					(stroke
						(width 0.254)
						(type default)
					)
					(fill
						(type none)
					)
				)
				(polyline
					(pts
						(xy -3.175 -1.905) (xy -2.54 0)
					)
					(stroke
						(width 0.254)
						(type default)
					)
					(fill
						(type none)
					)
				)
				(polyline
					(pts
						(xy -3.175 5.715) (xy -2.54 7.62)
					)
					(stroke
						(width 0.254)
						(type default)
					)
					(fill
						(type none)
					)
				)
				(polyline
					(pts
						(xy 0 -15.24) (xy 0 15.24)
					)
					(stroke
						(width 0.254)
						(type default)
					)
					(fill
						(type none)
					)
				)
				(polyline
					(pts
						(xy 0 15.24) (xy -15.24 15.24)
					)
					(stroke
						(width 0.254)
						(type default)
					)
					(fill
						(type none)
					)
				)
				(polyline
					(pts
						(xy 2.54 -15.24) (xy -2.54 -15.24)
					)
					(stroke
						(width 0.254)
						(type default)
					)
					(fill
						(type none)
					)
				)
				(polyline
					(pts
						(xy 2.54 -15.24) (xy 3.175 -13.335)
					)
					(stroke
						(width 0.254)
						(type default)
					)
					(fill
						(type none)
					)
				)
				(polyline
					(pts
						(xy 2.54 -7.62) (xy -2.54 -7.62)
					)
					(stroke
						(width 0.254)
						(type default)
					)
					(fill
						(type none)
					)
				)
				(polyline
					(pts
						(xy 2.54 -7.62) (xy 3.175 -5.715)
					)
					(stroke
						(width 0.254)
						(type default)
					)
					(fill
						(type none)
					)
				)
				(polyline
					(pts
						(xy 2.54 0) (xy -2.54 0)
					)
					(stroke
						(width 0.254)
						(type default)
					)
					(fill
						(type none)
					)
				)
				(polyline
					(pts
						(xy 2.54 0) (xy 3.175 1.905)
					)
					(stroke
						(width 0.254)
						(type default)
					)
					(fill
						(type none)
					)
				)
				(polyline
					(pts
						(xy 2.54 7.62) (xy -2.54 7.62)
					)
					(stroke
						(width 0.254)
						(type default)
					)
					(fill
						(type none)
					)
				)
				(polyline
					(pts
						(xy 2.54 7.62) (xy 3.175 9.525)
					)
					(stroke
						(width 0.254)
						(type default)
					)
					(fill
						(type none)
					)
				)
				(polyline
					(pts
						(xy 3.175 -13.335) (xy 4.445 -17.145)
					)
					(stroke
						(width 0.254)
						(type default)
					)
					(fill
						(type none)
					)
				)
				(polyline
					(pts
						(xy 3.175 -5.715) (xy 4.445 -9.525)
					)
					(stroke
						(width 0.254)
						(type default)
					)
					(fill
						(type none)
					)
				)
				(polyline
					(pts
						(xy 3.175 1.905) (xy 4.445 -1.905)
					)
					(stroke
						(width 0.254)
						(type default)
					)
					(fill
						(type none)
					)
				)
				(polyline
					(pts
						(xy 3.175 9.525) (xy 4.445 5.715)
					)
					(stroke
						(width 0.254)
						(type default)
					)
					(fill
						(type none)
					)
				)
				(polyline
					(pts
						(xy 4.445 -17.145) (xy 5.715 -13.335)
					)
					(stroke
						(width 0.254)
						(type default)
					)
					(fill
						(type none)
					)
				)
				(polyline
					(pts
						(xy 4.445 -9.525) (xy 5.715 -5.715)
					)
					(stroke
						(width 0.254)
						(type default)
					)
					(fill
						(type none)
					)
				)
				(polyline
					(pts
						(xy 4.445 -1.905) (xy 5.715 1.905)
					)
					(stroke
						(width 0.254)
						(type default)
					)
					(fill
						(type none)
					)
				)
				(polyline
					(pts
						(xy 4.445 5.715) (xy 5.715 9.525)
					)
					(stroke
						(width 0.254)
						(type default)
					)
					(fill
						(type none)
					)
				)
				(polyline
					(pts
						(xy 5.715 -13.335) (xy 6.985 -17.145)
					)
					(stroke
						(width 0.254)
						(type default)
					)
					(fill
						(type none)
					)
				)
				(polyline
					(pts
						(xy 5.715 -5.715) (xy 6.985 -9.525)
					)
					(stroke
						(width 0.254)
						(type default)
					)
					(fill
						(type none)
					)
				)
				(polyline
					(pts
						(xy 5.715 1.905) (xy 6.985 -1.905)
					)
					(stroke
						(width 0.254)
						(type default)
					)
					(fill
						(type none)
					)
				)
				(polyline
					(pts
						(xy 5.715 9.525) (xy 6.985 5.715)
					)
					(stroke
						(width 0.254)
						(type default)
					)
					(fill
						(type none)
					)
				)
				(polyline
					(pts
						(xy 6.985 -17.145) (xy 8.255 -13.335)
					)
					(stroke
						(width 0.254)
						(type default)
					)
					(fill
						(type none)
					)
				)
				(polyline
					(pts
						(xy 6.985 -9.525) (xy 8.255 -5.715)
					)
					(stroke
						(width 0.254)
						(type default)
					)
					(fill
						(type none)
					)
				)
				(polyline
					(pts
						(xy 6.985 -1.905) (xy 8.255 1.905)
					)
					(stroke
						(width 0.254)
						(type default)
					)
					(fill
						(type none)
					)
				)
				(polyline
					(pts
						(xy 6.985 5.715) (xy 8.255 9.525)
					)
					(stroke
						(width 0.254)
						(type default)
					)
					(fill
						(type none)
					)
				)
				(polyline
					(pts
						(xy 8.255 -13.335) (xy 9.525 -17.145)
					)
					(stroke
						(width 0.254)
						(type default)
					)
					(fill
						(type none)
					)
				)
				(polyline
					(pts
						(xy 8.255 -5.715) (xy 9.525 -9.525)
					)
					(stroke
						(width 0.254)
						(type default)
					)
					(fill
						(type none)
					)
				)
				(polyline
					(pts
						(xy 8.255 1.905) (xy 9.525 -1.905)
					)
					(stroke
						(width 0.254)
						(type default)
					)
					(fill
						(type none)
					)
				)
				(polyline
					(pts
						(xy 8.255 9.525) (xy 9.525 5.715)
					)
					(stroke
						(width 0.254)
						(type default)
					)
					(fill
						(type none)
					)
				)
				(polyline
					(pts
						(xy 9.525 -17.145) (xy 10.795 -13.335)
					)
					(stroke
						(width 0.254)
						(type default)
					)
					(fill
						(type none)
					)
				)
				(polyline
					(pts
						(xy 9.525 -9.525) (xy 10.795 -5.715)
					)
					(stroke
						(width 0.254)
						(type default)
					)
					(fill
						(type none)
					)
				)
				(polyline
					(pts
						(xy 9.525 -1.905) (xy 10.795 1.905)
					)
					(stroke
						(width 0.254)
						(type default)
					)
					(fill
						(type none)
					)
				)
				(polyline
					(pts
						(xy 9.525 5.715) (xy 10.795 9.525)
					)
					(stroke
						(width 0.254)
						(type default)
					)
					(fill
						(type none)
					)
				)
				(polyline
					(pts
						(xy 10.795 -13.335) (xy 12.065 -17.145)
					)
					(stroke
						(width 0.254)
						(type default)
					)
					(fill
						(type none)
					)
				)
				(polyline
					(pts
						(xy 10.795 -5.715) (xy 12.065 -9.525)
					)
					(stroke
						(width 0.254)
						(type default)
					)
					(fill
						(type none)
					)
				)
				(polyline
					(pts
						(xy 10.795 1.905) (xy 12.065 -1.905)
					)
					(stroke
						(width 0.254)
						(type default)
					)
					(fill
						(type none)
					)
				)
				(polyline
					(pts
						(xy 10.795 9.525) (xy 12.065 5.715)
					)
					(stroke
						(width 0.254)
						(type default)
					)
					(fill
						(type none)
					)
				)
				(polyline
					(pts
						(xy 12.065 -17.145) (xy 12.7 -15.24)
					)
					(stroke
						(width 0.254)
						(type default)
					)
					(fill
						(type none)
					)
				)
				(polyline
					(pts
						(xy 12.065 -9.525) (xy 12.7 -7.62)
					)
					(stroke
						(width 0.254)
						(type default)
					)
					(fill
						(type none)
					)
				)
				(polyline
					(pts
						(xy 12.065 -1.905) (xy 12.7 0)
					)
					(stroke
						(width 0.254)
						(type default)
					)
					(fill
						(type none)
					)
				)
				(polyline
					(pts
						(xy 12.065 5.715) (xy 12.7 7.62)
					)
					(stroke
						(width 0.254)
						(type default)
					)
					(fill
						(type none)
					)
				)
				(polyline
					(pts
						(xy 12.7 -15.24) (xy 15.24 -15.24)
					)
					(stroke
						(width 0.254)
						(type default)
					)
					(fill
						(type none)
					)
				)
				(polyline
					(pts
						(xy 12.7 -7.62) (xy 15.24 -7.62)
					)
					(stroke
						(width 0.254)
						(type default)
					)
					(fill
						(type none)
					)
				)
				(polyline
					(pts
						(xy 12.7 0) (xy 15.24 0)
					)
					(stroke
						(width 0.254)
						(type default)
					)
					(fill
						(type none)
					)
				)
				(polyline
					(pts
						(xy 12.7 7.62) (xy 15.24 7.62)
					)
					(stroke
						(width 0.254)
						(type default)
					)
					(fill
						(type none)
					)
				)
				(circle
					(center 0 0)
					(radius 0.254)
					(stroke
						(width 0.508)
						(type default)
					)
					(fill
						(type none)
					)
				)
				(circle
					(center 0 7.62)
					(radius 0.254)
					(stroke
						(width 0.508)
						(type default)
					)
					(fill
						(type none)
					)
				)
				(pin passive line
					(at -17.78 15.24 0)
					(length 2.54)
					(name "~"
						(effects
							(font
								(size 1.016 1.016)
							)
						)
					)
					(number "1"
						(effects
							(font
								(size 1.016 1.016)
							)
						)
					)
				)
				(pin passive line
					(at 17.78 7.62 180)
					(length 2.54)
					(name "~"
						(effects
							(font
								(size 1.016 1.016)
							)
						)
					)
					(number "10"
						(effects
							(font
								(size 1.016 1.016)
							)
						)
					)
				)
				(pin passive line
					(at -17.78 7.62 0)
					(length 2.54)
					(name "~"
						(effects
							(font
								(size 1.016 1.016)
							)
						)
					)
					(number "2"
						(effects
							(font
								(size 1.016 1.016)
							)
						)
					)
				)
				(pin passive line
					(at -17.78 0 0)
					(length 2.54)
					(name "~"
						(effects
							(font
								(size 1.016 1.016)
							)
						)
					)
					(number "3"
						(effects
							(font
								(size 1.016 1.016)
							)
						)
					)
				)
				(pin passive line
					(at -17.78 -7.62 0)
					(length 2.54)
					(name "~"
						(effects
							(font
								(size 1.016 1.016)
							)
						)
					)
					(number "4"
						(effects
							(font
								(size 1.016 1.016)
							)
						)
					)
				)
				(pin passive line
					(at -17.78 -15.24 0)
					(length 2.54)
					(name "~"
						(effects
							(font
								(size 1.016 1.016)
							)
						)
					)
					(number "5"
						(effects
							(font
								(size 1.016 1.016)
							)
						)
					)
				)
				(pin passive line
					(at 0 -22.86 90)
					(length 2.54)
					(name "~"
						(effects
							(font
								(size 1.016 1.016)
							)
						)
					)
					(number "6"
						(effects
							(font
								(size 1.016 1.016)
							)
						)
					)
				)
				(pin passive line
					(at 17.78 -15.24 180)
					(length 2.54)
					(name "~"
						(effects
							(font
								(size 1.016 1.016)
							)
						)
					)
					(number "7"
						(effects
							(font
								(size 1.016 1.016)
							)
						)
					)
				)
				(pin passive line
					(at 17.78 -7.62 180)
					(length 2.54)
					(name "~"
						(effects
							(font
								(size 1.016 1.016)
							)
						)
					)
					(number "8"
						(effects
							(font
								(size 1.016 1.016)
							)
						)
					)
				)
				(pin passive line
					(at 17.78 0 180)
					(length 2.54)
					(name "~"
						(effects
							(font
								(size 1.016 1.016)
							)
						)
					)
					(number "9"
						(effects
							(font
								(size 1.016 1.016)
							)
						)
					)
				)
			)
			(symbol "EXB-E10C272J_0_1"
				(polyline
					(pts
						(xy 0 -15.24) (xy 0 -20.32)
					)
					(stroke
						(width 0)
						(type default)
					)
					(fill
						(type none)
					)
				)
			)
		)
		(symbol "00_parts:LTC4311CSC6#TRPBF"
			(exclude_from_sim no)
			(in_bom yes)
			(on_board yes)
			(property "Reference" "IC"
				(at 29.21 7.62 0)
				(effects
					(font
						(size 1.27 1.27)
					)
					(justify left top)
				)
			)
			(property "Value" "LTC4311CSC6#TRPBF"
				(at 29.21 5.08 0)
				(effects
					(font
						(size 1.27 1.27)
					)
					(justify left top)
				)
			)
			(property "Footprint" "SOT65P210X100-6N"
				(at 29.21 -94.92 0)
				(effects
					(font
						(size 1.27 1.27)
					)
					(justify left top)
					(hide yes)
				)
			)
			(property "Datasheet" "https://www.analog.com/media/en/technical-documentation/data-sheets/4311fa.pdf"
				(at 29.21 -194.92 0)
				(effects
					(font
						(size 1.27 1.27)
					)
					(justify left top)
					(hide yes)
				)
			)
			(property "Description" "Interface - Specialized I2C/SMBus Rise Time Accelerator"
				(at 0 0 0)
				(effects
					(font
						(size 1.27 1.27)
					)
					(hide yes)
				)
			)
			(property "Height" "1"
				(at 29.21 -394.92 0)
				(effects
					(font
						(size 1.27 1.27)
					)
					(justify left top)
					(hide yes)
				)
			)
			(property "Mouser Part Number" "584-LTC4311CSC6TRPBF"
				(at 29.21 -494.92 0)
				(effects
					(font
						(size 1.27 1.27)
					)
					(justify left top)
					(hide yes)
				)
			)
			(property "Mouser Price/Stock" "https://www.mouser.co.uk/ProductDetail/Analog-Devices/LTC4311CSC6TRPBF?qs=hVkxg5c3xu8dDGkXCTUXoQ%3D%3D"
				(at 29.21 -594.92 0)
				(effects
					(font
						(size 1.27 1.27)
					)
					(justify left top)
					(hide yes)
				)
			)
			(property "Manufacturer_Name" "Analog Devices"
				(at 29.21 -694.92 0)
				(effects
					(font
						(size 1.27 1.27)
					)
					(justify left top)
					(hide yes)
				)
			)
			(property "Manufacturer_Part_Number" "LTC4311CSC6#TRPBF"
				(at 29.21 -794.92 0)
				(effects
					(font
						(size 1.27 1.27)
					)
					(justify left top)
					(hide yes)
				)
			)
			(symbol "LTC4311CSC6#TRPBF_1_1"
				(rectangle
					(start 5.08 2.54)
					(end 27.94 -7.62)
					(stroke
						(width 0.254)
						(type default)
					)
					(fill
						(type background)
					)
				)
				(pin passive line
					(at 0 0 0)
					(length 5.08)
					(name "VCC"
						(effects
							(font
								(size 1.27 1.27)
							)
						)
					)
					(number "1"
						(effects
							(font
								(size 1.27 1.27)
							)
						)
					)
				)
				(pin passive line
					(at 0 -2.54 0)
					(length 5.08)
					(name "GND_1"
						(effects
							(font
								(size 1.27 1.27)
							)
						)
					)
					(number "2"
						(effects
							(font
								(size 1.27 1.27)
							)
						)
					)
				)
				(pin passive line
					(at 0 -5.08 0)
					(length 5.08)
					(name "ENABLE"
						(effects
							(font
								(size 1.27 1.27)
							)
						)
					)
					(number "3"
						(effects
							(font
								(size 1.27 1.27)
							)
						)
					)
				)
				(pin passive line
					(at 33.02 -5.08 180)
					(length 5.08)
					(name "BUS2"
						(effects
							(font
								(size 1.27 1.27)
							)
						)
					)
					(number "4"
						(effects
							(font
								(size 1.27 1.27)
							)
						)
					)
				)
				(pin passive line
					(at 33.02 -2.54 180)
					(length 5.08)
					(name "GND_2"
						(effects
							(font
								(size 1.27 1.27)
							)
						)
					)
					(number "5"
						(effects
							(font
								(size 1.27 1.27)
							)
						)
					)
				)
				(pin passive line
					(at 33.02 0 180)
					(length 5.08)
					(name "BUS1"
						(effects
							(font
								(size 1.27 1.27)
							)
						)
					)
					(number "6"
						(effects
							(font
								(size 1.27 1.27)
							)
						)
					)
				)
			)
		)
		(symbol "Connector_Generic:Conn_01x04"
			(pin_names
				(offset 1.016) hide)
			(exclude_from_sim no)
			(in_bom yes)
			(on_board yes)
			(property "Reference" "J"
				(at 0 5.08 0)
				(effects
					(font
						(size 1.27 1.27)
					)
				)
			)
			(property "Value" "Conn_01x04"
				(at 0 -7.62 0)
				(effects
					(font
						(size 1.27 1.27)
					)
				)
			)
			(property "Footprint" ""
				(at 0 0 0)
				(effects
					(font
						(size 1.27 1.27)
					)
					(hide yes)
				)
			)
			(property "Datasheet" "~"
				(at 0 0 0)
				(effects
					(font
						(size 1.27 1.27)
					)
					(hide yes)
				)
			)
			(property "Description" "Generic connector, single row, 01x04, script generated (kicad-library-utils/schlib/autogen/connector/)"
				(at 0 0 0)
				(effects
					(font
						(size 1.27 1.27)
					)
					(hide yes)
				)
			)
			(property "ki_keywords" "connector"
				(at 0 0 0)
				(effects
					(font
						(size 1.27 1.27)
					)
					(hide yes)
				)
			)
			(property "ki_fp_filters" "Connector*:*_1x??_*"
				(at 0 0 0)
				(effects
					(font
						(size 1.27 1.27)
					)
					(hide yes)
				)
			)
			(symbol "Conn_01x04_1_1"
				(rectangle
					(start -1.27 -4.953)
					(end 0 -5.207)
					(stroke
						(width 0.1524)
						(type default)
					)
					(fill
						(type none)
					)
				)
				(rectangle
					(start -1.27 -2.413)
					(end 0 -2.667)
					(stroke
						(width 0.1524)
						(type default)
					)
					(fill
						(type none)
					)
				)
				(rectangle
					(start -1.27 0.127)
					(end 0 -0.127)
					(stroke
						(width 0.1524)
						(type default)
					)
					(fill
						(type none)
					)
				)
				(rectangle
					(start -1.27 2.667)
					(end 0 2.413)
					(stroke
						(width 0.1524)
						(type default)
					)
					(fill
						(type none)
					)
				)
				(rectangle
					(start -1.27 3.81)
					(end 1.27 -6.35)
					(stroke
						(width 0.254)
						(type default)
					)
					(fill
						(type background)
					)
				)
				(pin passive line
					(at -5.08 2.54 0)
					(length 3.81)
					(name "Pin_1"
						(effects
							(font
								(size 1.27 1.27)
							)
						)
					)
					(number "1"
						(effects
							(font
								(size 1.27 1.27)
							)
						)
					)
				)
				(pin passive line
					(at -5.08 0 0)
					(length 3.81)
					(name "Pin_2"
						(effects
							(font
								(size 1.27 1.27)
							)
						)
					)
					(number "2"
						(effects
							(font
								(size 1.27 1.27)
							)
						)
					)
				)
				(pin passive line
					(at -5.08 -2.54 0)
					(length 3.81)
					(name "Pin_3"
						(effects
							(font
								(size 1.27 1.27)
							)
						)
					)
					(number "3"
						(effects
							(font
								(size 1.27 1.27)
							)
						)
					)
				)
				(pin passive line
					(at -5.08 -5.08 0)
					(length 3.81)
					(name "Pin_4"
						(effects
							(font
								(size 1.27 1.27)
							)
						)
					)
					(number "4"
						(effects
							(font
								(size 1.27 1.27)
							)
						)
					)
				)
			)
		)
		(symbol "Device:C"
			(pin_numbers hide)
			(pin_names
				(offset 0.254)
			)
			(exclude_from_sim no)
			(in_bom yes)
			(on_board yes)
			(property "Reference" "C"
				(at 0.635 2.54 0)
				(effects
					(font
						(size 1.27 1.27)
					)
					(justify left)
				)
			)
			(property "Value" "C"
				(at 0.635 -2.54 0)
				(effects
					(font
						(size 1.27 1.27)
					)
					(justify left)
				)
			)
			(property "Footprint" ""
				(at 0.9652 -3.81 0)
				(effects
					(font
						(size 1.27 1.27)
					)
					(hide yes)
				)
			)
			(property "Datasheet" "~"
				(at 0 0 0)
				(effects
					(font
						(size 1.27 1.27)
					)
					(hide yes)
				)
			)
			(property "Description" "Unpolarized capacitor"
				(at 0 0 0)
				(effects
					(font
						(size 1.27 1.27)
					)
					(hide yes)
				)
			)
			(property "ki_keywords" "cap capacitor"
				(at 0 0 0)
				(effects
					(font
						(size 1.27 1.27)
					)
					(hide yes)
				)
			)
			(property "ki_fp_filters" "C_*"
				(at 0 0 0)
				(effects
					(font
						(size 1.27 1.27)
					)
					(hide yes)
				)
			)
			(symbol "C_0_1"
				(polyline
					(pts
						(xy -2.032 -0.762) (xy 2.032 -0.762)
					)
					(stroke
						(width 0.508)
						(type default)
					)
					(fill
						(type none)
					)
				)
				(polyline
					(pts
						(xy -2.032 0.762) (xy 2.032 0.762)
					)
					(stroke
						(width 0.508)
						(type default)
					)
					(fill
						(type none)
					)
				)
			)
			(symbol "C_1_1"
				(pin passive line
					(at 0 3.81 270)
					(length 2.794)
					(name "~"
						(effects
							(font
								(size 1.27 1.27)
							)
						)
					)
					(number "1"
						(effects
							(font
								(size 1.27 1.27)
							)
						)
					)
				)
				(pin passive line
					(at 0 -3.81 90)
					(length 2.794)
					(name "~"
						(effects
							(font
								(size 1.27 1.27)
							)
						)
					)
					(number "2"
						(effects
							(font
								(size 1.27 1.27)
							)
						)
					)
				)
			)
		)
		(symbol "Simulation_SPICE:0"
			(power)
			(pin_numbers hide)
			(pin_names
				(offset 0) hide)
			(exclude_from_sim no)
			(in_bom yes)
			(on_board yes)
			(property "Reference" "#GND"
				(at 0 -5.08 0)
				(effects
					(font
						(size 1.27 1.27)
					)
					(hide yes)
				)
			)
			(property "Value" "0"
				(at 0 -2.54 0)
				(effects
					(font
						(size 1.27 1.27)
					)
				)
			)
			(property "Footprint" ""
				(at 0 0 0)
				(effects
					(font
						(size 1.27 1.27)
					)
					(hide yes)
				)
			)
			(property "Datasheet" "https://ngspice.sourceforge.io/docs/ngspice-html-manual/manual.xhtml#subsec_Circuit_elements__device"
				(at 0 -10.16 0)
				(effects
					(font
						(size 1.27 1.27)
					)
					(hide yes)
				)
			)
			(property "Description" "0V reference potential for simulation"
				(at 0 -7.62 0)
				(effects
					(font
						(size 1.27 1.27)
					)
					(hide yes)
				)
			)
			(property "ki_keywords" "simulation"
				(at 0 0 0)
				(effects
					(font
						(size 1.27 1.27)
					)
					(hide yes)
				)
			)
			(symbol "0_0_1"
				(polyline
					(pts
						(xy -1.27 0) (xy 0 -1.27) (xy 1.27 0) (xy -1.27 0)
					)
					(stroke
						(width 0)
						(type default)
					)
					(fill
						(type none)
					)
				)
			)
			(symbol "0_1_1"
				(pin power_in line
					(at 0 0 0)
					(length 0)
					(name "~"
						(effects
							(font
								(size 1.016 1.016)
							)
						)
					)
					(number "1"
						(effects
							(font
								(size 1.016 1.016)
							)
						)
					)
				)
			)
		)
	)
	(junction
		(at 128.27 106.68)
		(diameter 0)
		(color 0 0 0 0)
		(uuid "d747442e-e037-4f8d-af94-dd5c11bc0f08")
	)
	(junction
		(at 130.81 99.06)
		(diameter 0)
		(color 0 0 0 0)
		(uuid "de9943ab-522d-4dd8-befc-e030f60851d1")
	)
	(no_connect
		(at 139.7 45.72)
		(uuid "1312d2e0-8a56-4852-bb76-b5609d145047")
	)
	(no_connect
		(at 132.08 45.72)
		(uuid "4af85fe9-bc91-415a-b746-34730f9073d4")
	)
	(no_connect
		(at 147.32 45.72)
		(uuid "7abcd9a0-d5e0-471e-bc96-7f28ad32db1a")
	)
	(no_connect
		(at 162.56 45.72)
		(uuid "7b3fe702-cab4-4ad8-b2bf-7a180fab78b1")
	)
	(no_connect
		(at 154.94 81.28)
		(uuid "97152117-152d-460d-ac49-f3e7901ba977")
	)
	(no_connect
		(at 162.56 81.28)
		(uuid "c1a3812b-0ec3-4058-9f7b-4eae7a8d8fb7")
	)
	(no_connect
		(at 154.94 45.72)
		(uuid "ee86d814-7c6d-4ca5-a16f-65ba657de14f")
	)
	(wire
		(pts
			(xy 114.3 99.06) (xy 130.81 99.06)
		)
		(stroke
			(width 0)
			(type default)
		)
		(uuid "15089f32-5f0d-4e80-a7cc-0eaf2157b9a9")
	)
	(wire
		(pts
			(xy 166.37 104.14) (xy 165.1 104.14)
		)
		(stroke
			(width 0)
			(type default)
		)
		(uuid "17ee7efa-e8ee-464e-899e-e4b7cbcf325b")
	)
	(wire
		(pts
			(xy 165.1 101.6) (xy 172.72 101.6)
		)
		(stroke
			(width 0)
			(type default)
		)
		(uuid "2386f276-2704-45eb-be36-01031eeb1f67")
	)
	(wire
		(pts
			(xy 227.33 68.58) (xy 227.33 72.39)
		)
		(stroke
			(width 0)
			(type default)
		)
		(uuid "35e46776-ecf9-464f-a20d-0927add1d3d1")
	)
	(wire
		(pts
			(xy 62.23 69.85) (xy 64.77 69.85)
		)
		(stroke
			(width 0)
			(type default)
		)
		(uuid "52d4c43d-4452-43a7-812f-6c899c1b3d4e")
	)
	(wire
		(pts
			(xy 128.27 106.68) (xy 128.27 110.49)
		)
		(stroke
			(width 0)
			(type default)
		)
		(uuid "57abdfd7-d6e9-4067-bd24-dddb7aa19e5b")
	)
	(wire
		(pts
			(xy 224.79 72.39) (xy 224.79 68.58)
		)
		(stroke
			(width 0)
			(type default)
		)
		(uuid "5e00ff9f-e470-4348-a3b2-75f622cd1907")
	)
	(wire
		(pts
			(xy 132.08 106.68) (xy 132.08 104.14)
		)
		(stroke
			(width 0)
			(type default)
		)
		(uuid "610cdd15-e668-4a83-b953-bcef12f35244")
	)
	(wire
		(pts
			(xy 229.87 72.39) (xy 229.87 68.58)
		)
		(stroke
			(width 0)
			(type default)
		)
		(uuid "6246d980-8fec-4c7b-8bee-b4d9a4f094a5")
	)
	(wire
		(pts
			(xy 129.54 82.55) (xy 132.08 82.55)
		)
		(stroke
			(width 0)
			(type default)
		)
		(uuid "69f0f8d0-ee1d-4f66-8bf0-3ceed668d2fd")
	)
	(wire
		(pts
			(xy 67.31 72.39) (xy 67.31 68.58)
		)
		(stroke
			(width 0)
			(type default)
		)
		(uuid "6dd5b920-2c35-48f7-b46f-24b692fbb0ca")
	)
	(wire
		(pts
			(xy 69.85 68.58) (xy 69.85 72.39)
		)
		(stroke
			(width 0)
			(type default)
		)
		(uuid "75d118ce-964a-4e4b-83ef-b123a86970d9")
	)
	(wire
		(pts
			(xy 114.3 106.68) (xy 128.27 106.68)
		)
		(stroke
			(width 0)
			(type default)
		)
		(uuid "831c8111-bfcc-4f3c-98fe-7578f331c2c6")
	)
	(wire
		(pts
			(xy 129.54 83.82) (xy 129.54 82.55)
		)
		(stroke
			(width 0)
			(type default)
		)
		(uuid "84c2019f-1efa-42df-8f68-e185ff4f3106")
	)
	(wire
		(pts
			(xy 170.18 99.06) (xy 165.1 99.06)
		)
		(stroke
			(width 0)
			(type default)
		)
		(uuid "9399c6ff-b138-48ba-b770-7c1f268832b1")
	)
	(wire
		(pts
			(xy 128.27 101.6) (xy 128.27 106.68)
		)
		(stroke
			(width 0)
			(type default)
		)
		(uuid "96e0aa59-7597-4d2a-a296-6c04e21534cb")
	)
	(wire
		(pts
			(xy 219.71 69.85) (xy 222.25 69.85)
		)
		(stroke
			(width 0)
			(type default)
		)
		(uuid "9739be01-695b-4fc9-b835-e6be23b42164")
	)
	(wire
		(pts
			(xy 222.25 69.85) (xy 222.25 68.58)
		)
		(stroke
			(width 0)
			(type default)
		)
		(uuid "9c8e2bad-6be3-4560-9759-d42f0ca84984")
	)
	(wire
		(pts
			(xy 72.39 72.39) (xy 72.39 68.58)
		)
		(stroke
			(width 0)
			(type default)
		)
		(uuid "ca080c5a-9467-4460-b020-abcc18842c9b")
	)
	(wire
		(pts
			(xy 64.77 69.85) (xy 64.77 68.58)
		)
		(stroke
			(width 0)
			(type default)
		)
		(uuid "cac64cf6-c027-4338-a2cf-164d6e033232")
	)
	(wire
		(pts
			(xy 130.81 99.06) (xy 132.08 99.06)
		)
		(stroke
			(width 0)
			(type default)
		)
		(uuid "cb169df0-01b0-4285-a1b0-e367b1367db1")
	)
	(wire
		(pts
			(xy 172.72 63.5) (xy 170.18 63.5)
		)
		(stroke
			(width 0)
			(type default)
		)
		(uuid "dad17485-d8b5-4c73-aec2-aea64d2fc644")
	)
	(wire
		(pts
			(xy 130.81 93.98) (xy 130.81 99.06)
		)
		(stroke
			(width 0)
			(type default)
		)
		(uuid "e341ffa3-1932-4217-99fa-9d27a2cc2c6f")
	)
	(wire
		(pts
			(xy 132.08 82.55) (xy 132.08 81.28)
		)
		(stroke
			(width 0)
			(type default)
		)
		(uuid "e884a748-b5ba-403a-9c51-294aeac3a979")
	)
	(wire
		(pts
			(xy 172.72 101.6) (xy 172.72 110.49)
		)
		(stroke
			(width 0)
			(type default)
		)
		(uuid "e9b096c0-118c-4258-a3c8-abbf1ab7730d")
	)
	(wire
		(pts
			(xy 132.08 101.6) (xy 128.27 101.6)
		)
		(stroke
			(width 0)
			(type default)
		)
		(uuid "ff8d5d39-3f42-474c-8abb-889f2eec7e7d")
	)
	(label "SDA"
		(at 72.39 72.39 0)
		(fields_autoplaced yes)
		(effects
			(font
				(size 1.27 1.27)
			)
			(justify left bottom)
		)
		(uuid "2dfbc9da-5794-4a69-b3a8-82369dd46f97")
	)
	(label "3.3V "
		(at 62.23 69.85 270)
		(fields_autoplaced yes)
		(effects
			(font
				(size 1.27 1.27)
			)
			(justify right bottom)
		)
		(uuid "37ff9a23-b266-4f08-a048-cdd4b784a67b")
		(property "Netclass" ""
			(at 63.5 69.85 90)
			(effects
				(font
					(size 1.27 1.27)
					(italic yes)
				)
				(justify right)
			)
		)
	)
	(label "SCL"
		(at 139.7 81.28 270)
		(fields_autoplaced yes)
		(effects
			(font
				(size 1.27 1.27)
			)
			(justify right bottom)
		)
		(uuid "3a5822f0-18bb-4d13-bb43-49c2b82fb6fb")
	)
	(label "SCL"
		(at 170.18 99.06 0)
		(fields_autoplaced yes)
		(effects
			(font
				(size 1.27 1.27)
			)
			(justify left bottom)
		)
		(uuid "4459b547-bba9-46d7-8db1-40f5ca794152")
	)
	(label "SDA"
		(at 166.37 104.14 0)
		(fields_autoplaced yes)
		(effects
			(font
				(size 1.27 1.27)
			)
			(justify left bottom)
		)
		(uuid "4c952a49-21d3-478b-bea4-56ccb051d1fe")
	)
	(label "SCL"
		(at 67.31 72.39 270)
		(fields_autoplaced yes)
		(effects
			(font
				(size 1.27 1.27)
			)
			(justify right bottom)
		)
		(uuid "517a70e7-e7ca-4945-b44b-39f0b2f811a4")
	)
	(label "3.3V "
		(at 129.54 83.82 180)
		(fields_autoplaced yes)
		(effects
			(font
				(size 1.27 1.27)
			)
			(justify right bottom)
		)
		(uuid "72996c1c-afdb-4876-b18b-49c0f7fe6ad7")
		(property "Netclass" ""
			(at 129.54 85.09 0)
			(effects
				(font
					(size 1.27 1.27)
					(italic yes)
				)
				(justify right)
			)
		)
	)
	(label "3.3V "
		(at 130.81 93.98 180)
		(fields_autoplaced yes)
		(effects
			(font
				(size 1.27 1.27)
			)
			(justify right bottom)
		)
		(uuid "86661548-51f5-4b6e-b4cd-1c8c7bb9694a")
		(property "Netclass" ""
			(at 130.81 95.25 0)
			(effects
				(font
					(size 1.27 1.27)
					(italic yes)
				)
				(justify right)
			)
		)
	)
	(label "SCL"
		(at 224.79 72.39 270)
		(fields_autoplaced yes)
		(effects
			(font
				(size 1.27 1.27)
			)
			(justify right bottom)
		)
		(uuid "8fd29e55-b871-462b-b412-e9fc8ab13275")
	)
	(label "SDA"
		(at 229.87 72.39 0)
		(fields_autoplaced yes)
		(effects
			(font
				(size 1.27 1.27)
			)
			(justify left bottom)
		)
		(uuid "b04a1dc4-0ad8-467d-b6bd-ba9a594902cd")
	)
	(label "SDA"
		(at 147.32 81.28 270)
		(fields_autoplaced yes)
		(effects
			(font
				(size 1.27 1.27)
			)
			(justify right bottom)
		)
		(uuid "d3d89f91-32a5-4f16-abc1-c8f40c086df6")
	)
	(label "3.3V "
		(at 219.71 69.85 270)
		(fields_autoplaced yes)
		(effects
			(font
				(size 1.27 1.27)
			)
			(justify right bottom)
		)
		(uuid "d822e99c-e6c0-4a91-aef7-e57eb7b08c34")
		(property "Netclass" ""
			(at 220.98 69.85 90)
			(effects
				(font
					(size 1.27 1.27)
					(italic yes)
				)
				(justify right)
			)
		)
	)
	(label "3.3V "
		(at 132.08 106.68 0)
		(fields_autoplaced yes)
		(effects
			(font
				(size 1.27 1.27)
			)
			(justify left bottom)
		)
		(uuid "e9ca6ecc-f8e3-4e8c-b31d-8d07bb10c764")
		(property "Netclass" ""
			(at 132.08 107.95 0)
			(effects
				(font
					(size 1.27 1.27)
					(italic yes)
				)
				(justify left)
			)
		)
	)
	(label "3.3V "
		(at 172.72 63.5 0)
		(fields_autoplaced yes)
		(effects
			(font
				(size 1.27 1.27)
			)
			(justify left bottom)
		)
		(uuid "fb43d4ae-1ac2-4f7e-a511-e3b1e2f38e96")
		(property "Netclass" ""
			(at 172.72 64.77 0)
			(effects
				(font
					(size 1.27 1.27)
					(italic yes)
				)
				(justify left)
			)
		)
	)
	(symbol
		(lib_id "Simulation_SPICE:0")
		(at 227.33 72.39 0)
		(unit 1)
		(exclude_from_sim no)
		(in_bom yes)
		(on_board yes)
		(dnp no)
		(fields_autoplaced yes)
		(uuid "1e1a16e8-eef0-4c55-877d-330178db6afb")
		(property "Reference" "#GND04"
			(at 227.33 77.47 0)
			(effects
				(font
					(size 1.27 1.27)
				)
				(hide yes)
			)
		)
		(property "Value" "0"
			(at 227.33 69.85 0)
			(effects
				(font
					(size 1.27 1.27)
				)
			)
		)
		(property "Footprint" ""
			(at 227.33 72.39 0)
			(effects
				(font
					(size 1.27 1.27)
				)
				(hide yes)
			)
		)
		(property "Datasheet" "https://ngspice.sourceforge.io/docs/ngspice-html-manual/manual.xhtml#subsec_Circuit_elements__device"
			(at 227.33 82.55 0)
			(effects
				(font
					(size 1.27 1.27)
				)
				(hide yes)
			)
		)
		(property "Description" "0V reference potential for simulation"
			(at 227.33 80.01 0)
			(effects
				(font
					(size 1.27 1.27)
				)
				(hide yes)
			)
		)
		(pin "1"
			(uuid "3d068807-ac89-499a-90f1-d72b5c3cc3ad")
		)
		(instances
			(project "ltc4311_breakout"
				(path "/d0f1f5d0-4417-4e42-8bf0-3981df801fc2"
					(reference "#GND04")
					(unit 1)
				)
			)
		)
	)
	(symbol
		(lib_id "00_parts:EXB-E10C272J")
		(at 147.32 63.5 90)
		(unit 1)
		(exclude_from_sim no)
		(in_bom yes)
		(on_board yes)
		(dnp no)
		(fields_autoplaced yes)
		(uuid "23fa39f0-1ea5-4782-92ee-54fe31edbcf4")
		(property "Reference" "R1"
			(at 170.434 54.864 0)
			(effects
				(font
					(size 1.27 1.27)
				)
				(justify right)
			)
		)
		(property "Value" "EXB-E10C272J"
			(at 170.434 66.04 0)
			(effects
				(font
					(size 1.27 1.27)
				)
				(justify right)
			)
		)
		(property "Footprint" "00_parts:RESCAV80P400X210X65-10N"
			(at 147.32 63.5 0)
			(effects
				(font
					(size 1.27 1.27)
				)
				(justify bottom)
				(hide yes)
			)
		)
		(property "Datasheet" ""
			(at 147.32 63.5 0)
			(effects
				(font
					(size 1.27 1.27)
				)
				(hide yes)
			)
		)
		(property "Description" ""
			(at 147.32 63.5 0)
			(effects
				(font
					(size 1.27 1.27)
				)
				(hide yes)
			)
		)
		(property "MF" "Panasonic"
			(at 147.32 63.5 0)
			(effects
				(font
					(size 1.27 1.27)
				)
				(justify bottom)
				(hide yes)
			)
		)
		(property "MAXIMUM_PACKAGE_HEIGHT" "0.65 mm"
			(at 147.32 63.5 0)
			(effects
				(font
					(size 1.27 1.27)
				)
				(justify bottom)
				(hide yes)
			)
		)
		(property "Package" "1608 Panasonic"
			(at 147.32 63.5 0)
			(effects
				(font
					(size 1.27 1.27)
				)
				(justify bottom)
				(hide yes)
			)
		)
		(property "Price" "None"
			(at 147.32 63.5 0)
			(effects
				(font
					(size 1.27 1.27)
				)
				(justify bottom)
				(hide yes)
			)
		)
		(property "Check_prices" "https://www.snapeda.com/parts/EXB-E10C272J/Panasonic/view-part/?ref=eda"
			(at 147.32 63.5 0)
			(effects
				(font
					(size 1.27 1.27)
				)
				(justify bottom)
				(hide yes)
			)
		)
		(property "STANDARD" "IPC 7351B"
			(at 147.32 63.5 0)
			(effects
				(font
					(size 1.27 1.27)
				)
				(justify bottom)
				(hide yes)
			)
		)
		(property "PARTREV" "1-Mar-20"
			(at 147.32 63.5 0)
			(effects
				(font
					(size 1.27 1.27)
				)
				(justify bottom)
				(hide yes)
			)
		)
		(property "SnapEDA_Link" "https://www.snapeda.com/parts/EXB-E10C272J/Panasonic/view-part/?ref=snap"
			(at 147.32 63.5 0)
			(effects
				(font
					(size 1.27 1.27)
				)
				(justify bottom)
				(hide yes)
			)
		)
		(property "MP" "EXB-E10C272J"
			(at 147.32 63.5 0)
			(effects
				(font
					(size 1.27 1.27)
				)
				(justify bottom)
				(hide yes)
			)
		)
		(property "Description_1" "\n2.7k Ohm ±5% 62.5mW Power Per Element Bussed 8 Resistor Network/Array ±200ppm/°C 1608, Concave, Long Side Terminals\n"
			(at 147.32 63.5 0)
			(effects
				(font
					(size 1.27 1.27)
				)
				(justify bottom)
				(hide yes)
			)
		)
		(property "Availability" "In Stock"
			(at 147.32 63.5 0)
			(effects
				(font
					(size 1.27 1.27)
				)
				(justify bottom)
				(hide yes)
			)
		)
		(property "MANUFACTURER" "Panasonic"
			(at 147.32 63.5 0)
			(effects
				(font
					(size 1.27 1.27)
				)
				(justify bottom)
				(hide yes)
			)
		)
		(pin "1"
			(uuid "e1d13db5-9767-4014-9413-e1c7253fd44d")
		)
		(pin "6"
			(uuid "6b271252-6650-4e28-8948-e3c4405831f4")
		)
		(pin "5"
			(uuid "efe907ee-dfcb-4bfc-9ed5-4167db02c9ae")
		)
		(pin "4"
			(uuid "75dabbba-51c5-402b-81e0-ca75470eef68")
		)
		(pin "3"
			(uuid "286742fe-46a7-4f97-b59e-34ee1e916f14")
		)
		(pin "2"
			(uuid "396fee18-2206-4294-9d0a-456a7b8b2b36")
		)
		(pin "10"
			(uuid "837d6e7b-c40e-44bc-82e9-216e2c5a3c99")
		)
		(pin "7"
			(uuid "af8d7655-f5ec-479d-afc9-dbbbe9bfdfd9")
		)
		(pin "8"
			(uuid "0f0eb039-86f8-41ce-9ac7-8155164bba55")
		)
		(pin "9"
			(uuid "e5501261-3f07-43b3-a6b2-e40f119d48c8")
		)
		(instances
			(project "ltc4311_breakout"
				(path "/d0f1f5d0-4417-4e42-8bf0-3981df801fc2"
					(reference "R1")
					(unit 1)
				)
			)
		)
	)
	(symbol
		(lib_id "Device:C")
		(at 114.3 102.87 0)
		(unit 1)
		(exclude_from_sim no)
		(in_bom yes)
		(on_board yes)
		(dnp no)
		(fields_autoplaced yes)
		(uuid "2de54371-b80d-44b5-9c8b-eb3633461c96")
		(property "Reference" "C1"
			(at 118.11 101.5999 0)
			(effects
				(font
					(size 1.27 1.27)
				)
				(justify left)
			)
		)
		(property "Value" "0.01uF"
			(at 118.11 104.1399 0)
			(effects
				(font
					(size 1.27 1.27)
				)
				(justify left)
			)
		)
		(property "Footprint" "Capacitor_SMD:C_0805_2012Metric"
			(at 115.2652 106.68 0)
			(effects
				(font
					(size 1.27 1.27)
				)
				(hide yes)
			)
		)
		(property "Datasheet" "~"
			(at 114.3 102.87 0)
			(effects
				(font
					(size 1.27 1.27)
				)
				(hide yes)
			)
		)
		(property "Description" "Unpolarized capacitor"
			(at 114.3 102.87 0)
			(effects
				(font
					(size 1.27 1.27)
				)
				(hide yes)
			)
		)
		(pin "2"
			(uuid "8762832a-4ae5-401a-8861-cfc1ccdab0d6")
		)
		(pin "1"
			(uuid "ae3fc723-5377-461f-bc71-5225098a9052")
		)
		(instances
			(project "ltc4311_breakout"
				(path "/d0f1f5d0-4417-4e42-8bf0-3981df801fc2"
					(reference "C1")
					(unit 1)
				)
			)
		)
	)
	(symbol
		(lib_id "Simulation_SPICE:0")
		(at 172.72 110.49 0)
		(unit 1)
		(exclude_from_sim no)
		(in_bom yes)
		(on_board yes)
		(dnp no)
		(fields_autoplaced yes)
		(uuid "3c335d87-e871-4510-be0f-2cd407bc44a6")
		(property "Reference" "#GND03"
			(at 172.72 115.57 0)
			(effects
				(font
					(size 1.27 1.27)
				)
				(hide yes)
			)
		)
		(property "Value" "0"
			(at 172.72 107.95 0)
			(effects
				(font
					(size 1.27 1.27)
				)
			)
		)
		(property "Footprint" ""
			(at 172.72 110.49 0)
			(effects
				(font
					(size 1.27 1.27)
				)
				(hide yes)
			)
		)
		(property "Datasheet" "https://ngspice.sourceforge.io/docs/ngspice-html-manual/manual.xhtml#subsec_Circuit_elements__device"
			(at 172.72 120.65 0)
			(effects
				(font
					(size 1.27 1.27)
				)
				(hide yes)
			)
		)
		(property "Description" "0V reference potential for simulation"
			(at 172.72 118.11 0)
			(effects
				(font
					(size 1.27 1.27)
				)
				(hide yes)
			)
		)
		(pin "1"
			(uuid "78be200b-65de-4974-ba5b-78cdf038529b")
		)
		(instances
			(project "ltc4311_breakout"
				(path "/d0f1f5d0-4417-4e42-8bf0-3981df801fc2"
					(reference "#GND03")
					(unit 1)
				)
			)
		)
	)
	(symbol
		(lib_id "00_parts:LTC4311CSC6#TRPBF")
		(at 132.08 99.06 0)
		(unit 1)
		(exclude_from_sim no)
		(in_bom yes)
		(on_board yes)
		(dnp no)
		(fields_autoplaced yes)
		(uuid "7df3ebaa-e374-4ae9-a876-4d1c8989f2c4")
		(property "Reference" "IC1"
			(at 148.59 91.44 0)
			(effects
				(font
					(size 1.27 1.27)
				)
			)
		)
		(property "Value" "LTC4311CSC6#TRPBF"
			(at 148.59 93.98 0)
			(effects
				(font
					(size 1.27 1.27)
				)
			)
		)
		(property "Footprint" "SOT65P210X100-6N"
			(at 161.29 193.98 0)
			(effects
				(font
					(size 1.27 1.27)
				)
				(justify left top)
				(hide yes)
			)
		)
		(property "Datasheet" "https://www.analog.com/media/en/technical-documentation/data-sheets/4311fa.pdf"
			(at 161.29 293.98 0)
			(effects
				(font
					(size 1.27 1.27)
				)
				(justify left top)
				(hide yes)
			)
		)
		(property "Description" "Interface - Specialized I2C/SMBus Rise Time Accelerator"
			(at 132.08 99.06 0)
			(effects
				(font
					(size 1.27 1.27)
				)
				(hide yes)
			)
		)
		(property "Height" "1"
			(at 161.29 493.98 0)
			(effects
				(font
					(size 1.27 1.27)
				)
				(justify left top)
				(hide yes)
			)
		)
		(property "Mouser Part Number" "584-LTC4311CSC6TRPBF"
			(at 161.29 593.98 0)
			(effects
				(font
					(size 1.27 1.27)
				)
				(justify left top)
				(hide yes)
			)
		)
		(property "Mouser Price/Stock" "https://www.mouser.co.uk/ProductDetail/Analog-Devices/LTC4311CSC6TRPBF?qs=hVkxg5c3xu8dDGkXCTUXoQ%3D%3D"
			(at 161.29 693.98 0)
			(effects
				(font
					(size 1.27 1.27)
				)
				(justify left top)
				(hide yes)
			)
		)
		(property "Manufacturer_Name" "Analog Devices"
			(at 161.29 793.98 0)
			(effects
				(font
					(size 1.27 1.27)
				)
				(justify left top)
				(hide yes)
			)
		)
		(property "Manufacturer_Part_Number" "LTC4311CSC6#TRPBF"
			(at 161.29 893.98 0)
			(effects
				(font
					(size 1.27 1.27)
				)
				(justify left top)
				(hide yes)
			)
		)
		(pin "1"
			(uuid "f877e5a4-63b2-493a-a039-5dcdfeacea0c")
		)
		(pin "4"
			(uuid "d59a8c7f-b907-42c1-9985-263fc7f3cc91")
		)
		(pin "6"
			(uuid "7e87d11a-681c-47be-8da2-2544a2be444c")
		)
		(pin "5"
			(uuid "0b5bb923-0493-4bf7-b199-a4e721ad65e2")
		)
		(pin "3"
			(uuid "79e7630b-c9b9-42d1-b0dc-59c6c39623bd")
		)
		(pin "2"
			(uuid "a4db653f-6a20-4db1-90e9-0a5945e81ddc")
		)
		(instances
			(project "ltc4311_breakout"
				(path "/d0f1f5d0-4417-4e42-8bf0-3981df801fc2"
					(reference "IC1")
					(unit 1)
				)
			)
		)
	)
	(symbol
		(lib_id "Simulation_SPICE:0")
		(at 69.85 72.39 0)
		(unit 1)
		(exclude_from_sim no)
		(in_bom yes)
		(on_board yes)
		(dnp no)
		(fields_autoplaced yes)
		(uuid "9fcc197f-46a5-4c4e-ba8e-54447253e243")
		(property "Reference" "#GND01"
			(at 69.85 77.47 0)
			(effects
				(font
					(size 1.27 1.27)
				)
				(hide yes)
			)
		)
		(property "Value" "0"
			(at 69.85 69.85 0)
			(effects
				(font
					(size 1.27 1.27)
				)
			)
		)
		(property "Footprint" ""
			(at 69.85 72.39 0)
			(effects
				(font
					(size 1.27 1.27)
				)
				(hide yes)
			)
		)
		(property "Datasheet" "https://ngspice.sourceforge.io/docs/ngspice-html-manual/manual.xhtml#subsec_Circuit_elements__device"
			(at 69.85 82.55 0)
			(effects
				(font
					(size 1.27 1.27)
				)
				(hide yes)
			)
		)
		(property "Description" "0V reference potential for simulation"
			(at 69.85 80.01 0)
			(effects
				(font
					(size 1.27 1.27)
				)
				(hide yes)
			)
		)
		(pin "1"
			(uuid "0438080c-4351-436c-b889-b792d8a0e662")
		)
		(instances
			(project "ltc4311_breakout"
				(path "/d0f1f5d0-4417-4e42-8bf0-3981df801fc2"
					(reference "#GND01")
					(unit 1)
				)
			)
		)
	)
	(symbol
		(lib_id "Simulation_SPICE:0")
		(at 128.27 110.49 0)
		(unit 1)
		(exclude_from_sim no)
		(in_bom yes)
		(on_board yes)
		(dnp no)
		(fields_autoplaced yes)
		(uuid "adc0e8a7-e998-4869-b26c-f28f8f700051")
		(property "Reference" "#GND02"
			(at 128.27 115.57 0)
			(effects
				(font
					(size 1.27 1.27)
				)
				(hide yes)
			)
		)
		(property "Value" "0"
			(at 128.27 107.95 0)
			(effects
				(font
					(size 1.27 1.27)
				)
			)
		)
		(property "Footprint" ""
			(at 128.27 110.49 0)
			(effects
				(font
					(size 1.27 1.27)
				)
				(hide yes)
			)
		)
		(property "Datasheet" "https://ngspice.sourceforge.io/docs/ngspice-html-manual/manual.xhtml#subsec_Circuit_elements__device"
			(at 128.27 120.65 0)
			(effects
				(font
					(size 1.27 1.27)
				)
				(hide yes)
			)
		)
		(property "Description" "0V reference potential for simulation"
			(at 128.27 118.11 0)
			(effects
				(font
					(size 1.27 1.27)
				)
				(hide yes)
			)
		)
		(pin "1"
			(uuid "d8b8c77e-0554-4006-94b8-57827571998b")
		)
		(instances
			(project "ltc4311_breakout"
				(path "/d0f1f5d0-4417-4e42-8bf0-3981df801fc2"
					(reference "#GND02")
					(unit 1)
				)
			)
		)
	)
	(symbol
		(lib_id "Connector_Generic:Conn_01x04")
		(at 224.79 63.5 90)
		(unit 1)
		(exclude_from_sim no)
		(in_bom yes)
		(on_board yes)
		(dnp no)
		(fields_autoplaced yes)
		(uuid "cda2c96f-d5ce-4250-885e-ab0a8c7c8c6a")
		(property "Reference" "J_OUT1"
			(at 226.06 59.69 90)
			(effects
				(font
					(size 1.27 1.27)
				)
			)
		)
		(property "Value" "~"
			(at 226.06 59.69 90)
			(effects
				(font
					(size 1.27 1.27)
				)
				(hide yes)
			)
		)
		(property "Footprint" "Connector_JST:JST_XH_S4B-XH-A-1_1x04_P2.50mm_Horizontal"
			(at 224.79 63.5 0)
			(effects
				(font
					(size 1.27 1.27)
				)
				(hide yes)
			)
		)
		(property "Datasheet" "~"
			(at 224.79 63.5 0)
			(effects
				(font
					(size 1.27 1.27)
				)
				(hide yes)
			)
		)
		(property "Description" "Generic connector, single row, 01x04, script generated (kicad-library-utils/schlib/autogen/connector/)"
			(at 224.79 63.5 0)
			(effects
				(font
					(size 1.27 1.27)
				)
				(hide yes)
			)
		)
		(pin "2"
			(uuid "4c1127cf-bb47-4a0f-b438-99644e956aad")
		)
		(pin "1"
			(uuid "3a7a35f0-ed0f-4f8a-b995-f7c61d66cbe0")
		)
		(pin "3"
			(uuid "2445ec93-f6c2-4408-8aa2-2dfde299fac6")
		)
		(pin "4"
			(uuid "68c2a820-b9e2-4353-9d44-409508b09fc3")
		)
		(instances
			(project "ltc4311_breakout"
				(path "/d0f1f5d0-4417-4e42-8bf0-3981df801fc2"
					(reference "J_OUT1")
					(unit 1)
				)
			)
		)
	)
	(symbol
		(lib_id "Connector_Generic:Conn_01x04")
		(at 67.31 63.5 90)
		(unit 1)
		(exclude_from_sim no)
		(in_bom yes)
		(on_board yes)
		(dnp no)
		(fields_autoplaced yes)
		(uuid "ff5fed01-6de1-46bf-ab2b-fdba4d7acab3")
		(property "Reference" "J_IN1"
			(at 68.58 59.69 90)
			(effects
				(font
					(size 1.27 1.27)
				)
			)
		)
		(property "Value" "~"
			(at 68.58 59.69 90)
			(effects
				(font
					(size 1.27 1.27)
				)
				(hide yes)
			)
		)
		(property "Footprint" "Connector_JST:JST_XH_S4B-XH-A-1_1x04_P2.50mm_Horizontal"
			(at 67.31 63.5 0)
			(effects
				(font
					(size 1.27 1.27)
				)
				(hide yes)
			)
		)
		(property "Datasheet" "~"
			(at 67.31 63.5 0)
			(effects
				(font
					(size 1.27 1.27)
				)
				(hide yes)
			)
		)
		(property "Description" "Generic connector, single row, 01x04, script generated (kicad-library-utils/schlib/autogen/connector/)"
			(at 67.31 63.5 0)
			(effects
				(font
					(size 1.27 1.27)
				)
				(hide yes)
			)
		)
		(pin "2"
			(uuid "be8229d3-b31f-4fdb-9720-73b52720684e")
		)
		(pin "1"
			(uuid "56cae1d9-ada8-4df8-8fda-3876c529fc01")
		)
		(pin "3"
			(uuid "63c5448c-eb0a-4868-8b5c-af6bca834875")
		)
		(pin "4"
			(uuid "e9a29e7a-9fa0-4f2e-aaf4-d7a06286109a")
		)
		(instances
			(project "ltc4311_breakout"
				(path "/d0f1f5d0-4417-4e42-8bf0-3981df801fc2"
					(reference "J_IN1")
					(unit 1)
				)
			)
		)
	)
	(sheet_instances
		(path "/"
			(page "1")
		)
	)
)