%TF.GenerationSoftware,KiCad,Pcbnew,8.0.1-8.0.1-0~ubuntu20.04.1*%
%TF.CreationDate,2024-05-05T01:55:17-05:00*%
%TF.ProjectId,ltc4311_breakout,6c746334-3331-4315-9f62-7265616b6f75,rev?*%
%TF.SameCoordinates,Original*%
%TF.FileFunction,Drillmap*%
%TF.FilePolarity,Positive*%
%FSLAX45Y45*%
G04 Gerber Fmt 4.5, Leading zero omitted, Abs format (unit mm)*
G04 Created by KiCad (PCBNEW 8.0.1-8.0.1-0~ubuntu20.04.1) date 2024-05-05 01:55:17*
%MOMM*%
%LPD*%
G01*
G04 APERTURE LIST*
%ADD10C,0.100000*%
%ADD11C,0.200000*%
%ADD12C,0.220000*%
G04 APERTURE END LIST*
D10*
X10600000Y-9200000D02*
X14450000Y-9200000D01*
X14450000Y-10950000D01*
X10600000Y-10950000D01*
X10600000Y-9200000D01*
D11*
D12*
X12040000Y-10540000D02*
X12260000Y-10760000D01*
X12260000Y-10540000D02*
X12040000Y-10760000D01*
X12040000Y-10540000D02*
X12260000Y-10760000D01*
X12260000Y-10540000D02*
X12040000Y-10760000D01*
X12740000Y-9390000D02*
X12960000Y-9610000D01*
X12960000Y-9390000D02*
X12740000Y-9610000D01*
D11*
X10855777Y-11266484D02*
X10855777Y-11066484D01*
X10855777Y-11066484D02*
X10903396Y-11066484D01*
X10903396Y-11066484D02*
X10931967Y-11076008D01*
X10931967Y-11076008D02*
X10951015Y-11095055D01*
X10951015Y-11095055D02*
X10960539Y-11114103D01*
X10960539Y-11114103D02*
X10970063Y-11152198D01*
X10970063Y-11152198D02*
X10970063Y-11180770D01*
X10970063Y-11180770D02*
X10960539Y-11218865D01*
X10960539Y-11218865D02*
X10951015Y-11237912D01*
X10951015Y-11237912D02*
X10931967Y-11256960D01*
X10931967Y-11256960D02*
X10903396Y-11266484D01*
X10903396Y-11266484D02*
X10855777Y-11266484D01*
X11055777Y-11266484D02*
X11055777Y-11133150D01*
X11055777Y-11171246D02*
X11065301Y-11152198D01*
X11065301Y-11152198D02*
X11074824Y-11142674D01*
X11074824Y-11142674D02*
X11093872Y-11133150D01*
X11093872Y-11133150D02*
X11112920Y-11133150D01*
X11179586Y-11266484D02*
X11179586Y-11133150D01*
X11179586Y-11066484D02*
X11170063Y-11076008D01*
X11170063Y-11076008D02*
X11179586Y-11085531D01*
X11179586Y-11085531D02*
X11189110Y-11076008D01*
X11189110Y-11076008D02*
X11179586Y-11066484D01*
X11179586Y-11066484D02*
X11179586Y-11085531D01*
X11303396Y-11266484D02*
X11284348Y-11256960D01*
X11284348Y-11256960D02*
X11274824Y-11237912D01*
X11274824Y-11237912D02*
X11274824Y-11066484D01*
X11408158Y-11266484D02*
X11389110Y-11256960D01*
X11389110Y-11256960D02*
X11379586Y-11237912D01*
X11379586Y-11237912D02*
X11379586Y-11066484D01*
X11636729Y-11266484D02*
X11636729Y-11066484D01*
X11636729Y-11066484D02*
X11703396Y-11209341D01*
X11703396Y-11209341D02*
X11770062Y-11066484D01*
X11770062Y-11066484D02*
X11770062Y-11266484D01*
X11951015Y-11266484D02*
X11951015Y-11161722D01*
X11951015Y-11161722D02*
X11941491Y-11142674D01*
X11941491Y-11142674D02*
X11922443Y-11133150D01*
X11922443Y-11133150D02*
X11884348Y-11133150D01*
X11884348Y-11133150D02*
X11865301Y-11142674D01*
X11951015Y-11256960D02*
X11931967Y-11266484D01*
X11931967Y-11266484D02*
X11884348Y-11266484D01*
X11884348Y-11266484D02*
X11865301Y-11256960D01*
X11865301Y-11256960D02*
X11855777Y-11237912D01*
X11855777Y-11237912D02*
X11855777Y-11218865D01*
X11855777Y-11218865D02*
X11865301Y-11199817D01*
X11865301Y-11199817D02*
X11884348Y-11190293D01*
X11884348Y-11190293D02*
X11931967Y-11190293D01*
X11931967Y-11190293D02*
X11951015Y-11180770D01*
X12046253Y-11133150D02*
X12046253Y-11333150D01*
X12046253Y-11142674D02*
X12065301Y-11133150D01*
X12065301Y-11133150D02*
X12103396Y-11133150D01*
X12103396Y-11133150D02*
X12122443Y-11142674D01*
X12122443Y-11142674D02*
X12131967Y-11152198D01*
X12131967Y-11152198D02*
X12141491Y-11171246D01*
X12141491Y-11171246D02*
X12141491Y-11228388D01*
X12141491Y-11228388D02*
X12131967Y-11247436D01*
X12131967Y-11247436D02*
X12122443Y-11256960D01*
X12122443Y-11256960D02*
X12103396Y-11266484D01*
X12103396Y-11266484D02*
X12065301Y-11266484D01*
X12065301Y-11266484D02*
X12046253Y-11256960D01*
X12227205Y-11247436D02*
X12236729Y-11256960D01*
X12236729Y-11256960D02*
X12227205Y-11266484D01*
X12227205Y-11266484D02*
X12217682Y-11256960D01*
X12217682Y-11256960D02*
X12227205Y-11247436D01*
X12227205Y-11247436D02*
X12227205Y-11266484D01*
X12227205Y-11142674D02*
X12236729Y-11152198D01*
X12236729Y-11152198D02*
X12227205Y-11161722D01*
X12227205Y-11161722D02*
X12217682Y-11152198D01*
X12217682Y-11152198D02*
X12227205Y-11142674D01*
X12227205Y-11142674D02*
X12227205Y-11161722D01*
X10395000Y-11495000D02*
X10595000Y-11695000D01*
X10595000Y-11495000D02*
X10395000Y-11695000D01*
X10846253Y-11505531D02*
X10855777Y-11496008D01*
X10855777Y-11496008D02*
X10874824Y-11486484D01*
X10874824Y-11486484D02*
X10922444Y-11486484D01*
X10922444Y-11486484D02*
X10941491Y-11496008D01*
X10941491Y-11496008D02*
X10951015Y-11505531D01*
X10951015Y-11505531D02*
X10960539Y-11524579D01*
X10960539Y-11524579D02*
X10960539Y-11543627D01*
X10960539Y-11543627D02*
X10951015Y-11572198D01*
X10951015Y-11572198D02*
X10836729Y-11686484D01*
X10836729Y-11686484D02*
X10960539Y-11686484D01*
X11046253Y-11667436D02*
X11055777Y-11676960D01*
X11055777Y-11676960D02*
X11046253Y-11686484D01*
X11046253Y-11686484D02*
X11036729Y-11676960D01*
X11036729Y-11676960D02*
X11046253Y-11667436D01*
X11046253Y-11667436D02*
X11046253Y-11686484D01*
X11131967Y-11505531D02*
X11141491Y-11496008D01*
X11141491Y-11496008D02*
X11160539Y-11486484D01*
X11160539Y-11486484D02*
X11208158Y-11486484D01*
X11208158Y-11486484D02*
X11227205Y-11496008D01*
X11227205Y-11496008D02*
X11236729Y-11505531D01*
X11236729Y-11505531D02*
X11246253Y-11524579D01*
X11246253Y-11524579D02*
X11246253Y-11543627D01*
X11246253Y-11543627D02*
X11236729Y-11572198D01*
X11236729Y-11572198D02*
X11122444Y-11686484D01*
X11122444Y-11686484D02*
X11246253Y-11686484D01*
X11370062Y-11486484D02*
X11389110Y-11486484D01*
X11389110Y-11486484D02*
X11408158Y-11496008D01*
X11408158Y-11496008D02*
X11417682Y-11505531D01*
X11417682Y-11505531D02*
X11427205Y-11524579D01*
X11427205Y-11524579D02*
X11436729Y-11562674D01*
X11436729Y-11562674D02*
X11436729Y-11610293D01*
X11436729Y-11610293D02*
X11427205Y-11648388D01*
X11427205Y-11648388D02*
X11417682Y-11667436D01*
X11417682Y-11667436D02*
X11408158Y-11676960D01*
X11408158Y-11676960D02*
X11389110Y-11686484D01*
X11389110Y-11686484D02*
X11370062Y-11686484D01*
X11370062Y-11686484D02*
X11351015Y-11676960D01*
X11351015Y-11676960D02*
X11341491Y-11667436D01*
X11341491Y-11667436D02*
X11331967Y-11648388D01*
X11331967Y-11648388D02*
X11322443Y-11610293D01*
X11322443Y-11610293D02*
X11322443Y-11562674D01*
X11322443Y-11562674D02*
X11331967Y-11524579D01*
X11331967Y-11524579D02*
X11341491Y-11505531D01*
X11341491Y-11505531D02*
X11351015Y-11496008D01*
X11351015Y-11496008D02*
X11370062Y-11486484D01*
X11560539Y-11486484D02*
X11579586Y-11486484D01*
X11579586Y-11486484D02*
X11598634Y-11496008D01*
X11598634Y-11496008D02*
X11608158Y-11505531D01*
X11608158Y-11505531D02*
X11617682Y-11524579D01*
X11617682Y-11524579D02*
X11627205Y-11562674D01*
X11627205Y-11562674D02*
X11627205Y-11610293D01*
X11627205Y-11610293D02*
X11617682Y-11648388D01*
X11617682Y-11648388D02*
X11608158Y-11667436D01*
X11608158Y-11667436D02*
X11598634Y-11676960D01*
X11598634Y-11676960D02*
X11579586Y-11686484D01*
X11579586Y-11686484D02*
X11560539Y-11686484D01*
X11560539Y-11686484D02*
X11541491Y-11676960D01*
X11541491Y-11676960D02*
X11531967Y-11667436D01*
X11531967Y-11667436D02*
X11522443Y-11648388D01*
X11522443Y-11648388D02*
X11512920Y-11610293D01*
X11512920Y-11610293D02*
X11512920Y-11562674D01*
X11512920Y-11562674D02*
X11522443Y-11524579D01*
X11522443Y-11524579D02*
X11531967Y-11505531D01*
X11531967Y-11505531D02*
X11541491Y-11496008D01*
X11541491Y-11496008D02*
X11560539Y-11486484D01*
X11712920Y-11686484D02*
X11712920Y-11553150D01*
X11712920Y-11572198D02*
X11722443Y-11562674D01*
X11722443Y-11562674D02*
X11741491Y-11553150D01*
X11741491Y-11553150D02*
X11770063Y-11553150D01*
X11770063Y-11553150D02*
X11789110Y-11562674D01*
X11789110Y-11562674D02*
X11798634Y-11581722D01*
X11798634Y-11581722D02*
X11798634Y-11686484D01*
X11798634Y-11581722D02*
X11808158Y-11562674D01*
X11808158Y-11562674D02*
X11827205Y-11553150D01*
X11827205Y-11553150D02*
X11855777Y-11553150D01*
X11855777Y-11553150D02*
X11874824Y-11562674D01*
X11874824Y-11562674D02*
X11884348Y-11581722D01*
X11884348Y-11581722D02*
X11884348Y-11686484D01*
X11979586Y-11686484D02*
X11979586Y-11553150D01*
X11979586Y-11572198D02*
X11989110Y-11562674D01*
X11989110Y-11562674D02*
X12008158Y-11553150D01*
X12008158Y-11553150D02*
X12036729Y-11553150D01*
X12036729Y-11553150D02*
X12055777Y-11562674D01*
X12055777Y-11562674D02*
X12065301Y-11581722D01*
X12065301Y-11581722D02*
X12065301Y-11686484D01*
X12065301Y-11581722D02*
X12074824Y-11562674D01*
X12074824Y-11562674D02*
X12093872Y-11553150D01*
X12093872Y-11553150D02*
X12122443Y-11553150D01*
X12122443Y-11553150D02*
X12141491Y-11562674D01*
X12141491Y-11562674D02*
X12151015Y-11581722D01*
X12151015Y-11581722D02*
X12151015Y-11686484D01*
X12541491Y-11476960D02*
X12370063Y-11734103D01*
X12798634Y-11486484D02*
X12817682Y-11486484D01*
X12817682Y-11486484D02*
X12836729Y-11496008D01*
X12836729Y-11496008D02*
X12846253Y-11505531D01*
X12846253Y-11505531D02*
X12855777Y-11524579D01*
X12855777Y-11524579D02*
X12865301Y-11562674D01*
X12865301Y-11562674D02*
X12865301Y-11610293D01*
X12865301Y-11610293D02*
X12855777Y-11648388D01*
X12855777Y-11648388D02*
X12846253Y-11667436D01*
X12846253Y-11667436D02*
X12836729Y-11676960D01*
X12836729Y-11676960D02*
X12817682Y-11686484D01*
X12817682Y-11686484D02*
X12798634Y-11686484D01*
X12798634Y-11686484D02*
X12779586Y-11676960D01*
X12779586Y-11676960D02*
X12770063Y-11667436D01*
X12770063Y-11667436D02*
X12760539Y-11648388D01*
X12760539Y-11648388D02*
X12751015Y-11610293D01*
X12751015Y-11610293D02*
X12751015Y-11562674D01*
X12751015Y-11562674D02*
X12760539Y-11524579D01*
X12760539Y-11524579D02*
X12770063Y-11505531D01*
X12770063Y-11505531D02*
X12779586Y-11496008D01*
X12779586Y-11496008D02*
X12798634Y-11486484D01*
X12951015Y-11667436D02*
X12960539Y-11676960D01*
X12960539Y-11676960D02*
X12951015Y-11686484D01*
X12951015Y-11686484D02*
X12941491Y-11676960D01*
X12941491Y-11676960D02*
X12951015Y-11667436D01*
X12951015Y-11667436D02*
X12951015Y-11686484D01*
X13084348Y-11486484D02*
X13103396Y-11486484D01*
X13103396Y-11486484D02*
X13122444Y-11496008D01*
X13122444Y-11496008D02*
X13131967Y-11505531D01*
X13131967Y-11505531D02*
X13141491Y-11524579D01*
X13141491Y-11524579D02*
X13151015Y-11562674D01*
X13151015Y-11562674D02*
X13151015Y-11610293D01*
X13151015Y-11610293D02*
X13141491Y-11648388D01*
X13141491Y-11648388D02*
X13131967Y-11667436D01*
X13131967Y-11667436D02*
X13122444Y-11676960D01*
X13122444Y-11676960D02*
X13103396Y-11686484D01*
X13103396Y-11686484D02*
X13084348Y-11686484D01*
X13084348Y-11686484D02*
X13065301Y-11676960D01*
X13065301Y-11676960D02*
X13055777Y-11667436D01*
X13055777Y-11667436D02*
X13046253Y-11648388D01*
X13046253Y-11648388D02*
X13036729Y-11610293D01*
X13036729Y-11610293D02*
X13036729Y-11562674D01*
X13036729Y-11562674D02*
X13046253Y-11524579D01*
X13046253Y-11524579D02*
X13055777Y-11505531D01*
X13055777Y-11505531D02*
X13065301Y-11496008D01*
X13065301Y-11496008D02*
X13084348Y-11486484D01*
X13265301Y-11572198D02*
X13246253Y-11562674D01*
X13246253Y-11562674D02*
X13236729Y-11553150D01*
X13236729Y-11553150D02*
X13227206Y-11534103D01*
X13227206Y-11534103D02*
X13227206Y-11524579D01*
X13227206Y-11524579D02*
X13236729Y-11505531D01*
X13236729Y-11505531D02*
X13246253Y-11496008D01*
X13246253Y-11496008D02*
X13265301Y-11486484D01*
X13265301Y-11486484D02*
X13303396Y-11486484D01*
X13303396Y-11486484D02*
X13322444Y-11496008D01*
X13322444Y-11496008D02*
X13331967Y-11505531D01*
X13331967Y-11505531D02*
X13341491Y-11524579D01*
X13341491Y-11524579D02*
X13341491Y-11534103D01*
X13341491Y-11534103D02*
X13331967Y-11553150D01*
X13331967Y-11553150D02*
X13322444Y-11562674D01*
X13322444Y-11562674D02*
X13303396Y-11572198D01*
X13303396Y-11572198D02*
X13265301Y-11572198D01*
X13265301Y-11572198D02*
X13246253Y-11581722D01*
X13246253Y-11581722D02*
X13236729Y-11591246D01*
X13236729Y-11591246D02*
X13227206Y-11610293D01*
X13227206Y-11610293D02*
X13227206Y-11648388D01*
X13227206Y-11648388D02*
X13236729Y-11667436D01*
X13236729Y-11667436D02*
X13246253Y-11676960D01*
X13246253Y-11676960D02*
X13265301Y-11686484D01*
X13265301Y-11686484D02*
X13303396Y-11686484D01*
X13303396Y-11686484D02*
X13322444Y-11676960D01*
X13322444Y-11676960D02*
X13331967Y-11667436D01*
X13331967Y-11667436D02*
X13341491Y-11648388D01*
X13341491Y-11648388D02*
X13341491Y-11610293D01*
X13341491Y-11610293D02*
X13331967Y-11591246D01*
X13331967Y-11591246D02*
X13322444Y-11581722D01*
X13322444Y-11581722D02*
X13303396Y-11572198D01*
X13512920Y-11486484D02*
X13474825Y-11486484D01*
X13474825Y-11486484D02*
X13455777Y-11496008D01*
X13455777Y-11496008D02*
X13446253Y-11505531D01*
X13446253Y-11505531D02*
X13427206Y-11534103D01*
X13427206Y-11534103D02*
X13417682Y-11572198D01*
X13417682Y-11572198D02*
X13417682Y-11648388D01*
X13417682Y-11648388D02*
X13427206Y-11667436D01*
X13427206Y-11667436D02*
X13436729Y-11676960D01*
X13436729Y-11676960D02*
X13455777Y-11686484D01*
X13455777Y-11686484D02*
X13493872Y-11686484D01*
X13493872Y-11686484D02*
X13512920Y-11676960D01*
X13512920Y-11676960D02*
X13522444Y-11667436D01*
X13522444Y-11667436D02*
X13531967Y-11648388D01*
X13531967Y-11648388D02*
X13531967Y-11600769D01*
X13531967Y-11600769D02*
X13522444Y-11581722D01*
X13522444Y-11581722D02*
X13512920Y-11572198D01*
X13512920Y-11572198D02*
X13493872Y-11562674D01*
X13493872Y-11562674D02*
X13455777Y-11562674D01*
X13455777Y-11562674D02*
X13436729Y-11572198D01*
X13436729Y-11572198D02*
X13427206Y-11581722D01*
X13427206Y-11581722D02*
X13417682Y-11600769D01*
X13703396Y-11486484D02*
X13665301Y-11486484D01*
X13665301Y-11486484D02*
X13646253Y-11496008D01*
X13646253Y-11496008D02*
X13636729Y-11505531D01*
X13636729Y-11505531D02*
X13617682Y-11534103D01*
X13617682Y-11534103D02*
X13608158Y-11572198D01*
X13608158Y-11572198D02*
X13608158Y-11648388D01*
X13608158Y-11648388D02*
X13617682Y-11667436D01*
X13617682Y-11667436D02*
X13627206Y-11676960D01*
X13627206Y-11676960D02*
X13646253Y-11686484D01*
X13646253Y-11686484D02*
X13684348Y-11686484D01*
X13684348Y-11686484D02*
X13703396Y-11676960D01*
X13703396Y-11676960D02*
X13712920Y-11667436D01*
X13712920Y-11667436D02*
X13722444Y-11648388D01*
X13722444Y-11648388D02*
X13722444Y-11600769D01*
X13722444Y-11600769D02*
X13712920Y-11581722D01*
X13712920Y-11581722D02*
X13703396Y-11572198D01*
X13703396Y-11572198D02*
X13684348Y-11562674D01*
X13684348Y-11562674D02*
X13646253Y-11562674D01*
X13646253Y-11562674D02*
X13627206Y-11572198D01*
X13627206Y-11572198D02*
X13617682Y-11581722D01*
X13617682Y-11581722D02*
X13608158Y-11600769D01*
X13798634Y-11486484D02*
X13798634Y-11524579D01*
X13874825Y-11486484D02*
X13874825Y-11524579D01*
X14170063Y-11762674D02*
X14160539Y-11753150D01*
X14160539Y-11753150D02*
X14141491Y-11724579D01*
X14141491Y-11724579D02*
X14131968Y-11705531D01*
X14131968Y-11705531D02*
X14122444Y-11676960D01*
X14122444Y-11676960D02*
X14112920Y-11629341D01*
X14112920Y-11629341D02*
X14112920Y-11591246D01*
X14112920Y-11591246D02*
X14122444Y-11543627D01*
X14122444Y-11543627D02*
X14131968Y-11515055D01*
X14131968Y-11515055D02*
X14141491Y-11496008D01*
X14141491Y-11496008D02*
X14160539Y-11467436D01*
X14160539Y-11467436D02*
X14170063Y-11457912D01*
X14227206Y-11486484D02*
X14351015Y-11486484D01*
X14351015Y-11486484D02*
X14284348Y-11562674D01*
X14284348Y-11562674D02*
X14312920Y-11562674D01*
X14312920Y-11562674D02*
X14331968Y-11572198D01*
X14331968Y-11572198D02*
X14341491Y-11581722D01*
X14341491Y-11581722D02*
X14351015Y-11600769D01*
X14351015Y-11600769D02*
X14351015Y-11648388D01*
X14351015Y-11648388D02*
X14341491Y-11667436D01*
X14341491Y-11667436D02*
X14331968Y-11676960D01*
X14331968Y-11676960D02*
X14312920Y-11686484D01*
X14312920Y-11686484D02*
X14255777Y-11686484D01*
X14255777Y-11686484D02*
X14236729Y-11676960D01*
X14236729Y-11676960D02*
X14227206Y-11667436D01*
X14589110Y-11686484D02*
X14589110Y-11486484D01*
X14674825Y-11686484D02*
X14674825Y-11581722D01*
X14674825Y-11581722D02*
X14665301Y-11562674D01*
X14665301Y-11562674D02*
X14646253Y-11553150D01*
X14646253Y-11553150D02*
X14617682Y-11553150D01*
X14617682Y-11553150D02*
X14598634Y-11562674D01*
X14598634Y-11562674D02*
X14589110Y-11572198D01*
X14798634Y-11686484D02*
X14779587Y-11676960D01*
X14779587Y-11676960D02*
X14770063Y-11667436D01*
X14770063Y-11667436D02*
X14760539Y-11648388D01*
X14760539Y-11648388D02*
X14760539Y-11591246D01*
X14760539Y-11591246D02*
X14770063Y-11572198D01*
X14770063Y-11572198D02*
X14779587Y-11562674D01*
X14779587Y-11562674D02*
X14798634Y-11553150D01*
X14798634Y-11553150D02*
X14827206Y-11553150D01*
X14827206Y-11553150D02*
X14846253Y-11562674D01*
X14846253Y-11562674D02*
X14855777Y-11572198D01*
X14855777Y-11572198D02*
X14865301Y-11591246D01*
X14865301Y-11591246D02*
X14865301Y-11648388D01*
X14865301Y-11648388D02*
X14855777Y-11667436D01*
X14855777Y-11667436D02*
X14846253Y-11676960D01*
X14846253Y-11676960D02*
X14827206Y-11686484D01*
X14827206Y-11686484D02*
X14798634Y-11686484D01*
X14979587Y-11686484D02*
X14960539Y-11676960D01*
X14960539Y-11676960D02*
X14951015Y-11657912D01*
X14951015Y-11657912D02*
X14951015Y-11486484D01*
X15131968Y-11676960D02*
X15112920Y-11686484D01*
X15112920Y-11686484D02*
X15074825Y-11686484D01*
X15074825Y-11686484D02*
X15055777Y-11676960D01*
X15055777Y-11676960D02*
X15046253Y-11657912D01*
X15046253Y-11657912D02*
X15046253Y-11581722D01*
X15046253Y-11581722D02*
X15055777Y-11562674D01*
X15055777Y-11562674D02*
X15074825Y-11553150D01*
X15074825Y-11553150D02*
X15112920Y-11553150D01*
X15112920Y-11553150D02*
X15131968Y-11562674D01*
X15131968Y-11562674D02*
X15141491Y-11581722D01*
X15141491Y-11581722D02*
X15141491Y-11600769D01*
X15141491Y-11600769D02*
X15046253Y-11619817D01*
X15217682Y-11676960D02*
X15236730Y-11686484D01*
X15236730Y-11686484D02*
X15274825Y-11686484D01*
X15274825Y-11686484D02*
X15293872Y-11676960D01*
X15293872Y-11676960D02*
X15303396Y-11657912D01*
X15303396Y-11657912D02*
X15303396Y-11648388D01*
X15303396Y-11648388D02*
X15293872Y-11629341D01*
X15293872Y-11629341D02*
X15274825Y-11619817D01*
X15274825Y-11619817D02*
X15246253Y-11619817D01*
X15246253Y-11619817D02*
X15227206Y-11610293D01*
X15227206Y-11610293D02*
X15217682Y-11591246D01*
X15217682Y-11591246D02*
X15217682Y-11581722D01*
X15217682Y-11581722D02*
X15227206Y-11562674D01*
X15227206Y-11562674D02*
X15246253Y-11553150D01*
X15246253Y-11553150D02*
X15274825Y-11553150D01*
X15274825Y-11553150D02*
X15293872Y-11562674D01*
X15370063Y-11762674D02*
X15379587Y-11753150D01*
X15379587Y-11753150D02*
X15398634Y-11724579D01*
X15398634Y-11724579D02*
X15408158Y-11705531D01*
X15408158Y-11705531D02*
X15417682Y-11676960D01*
X15417682Y-11676960D02*
X15427206Y-11629341D01*
X15427206Y-11629341D02*
X15427206Y-11591246D01*
X15427206Y-11591246D02*
X15417682Y-11543627D01*
X15417682Y-11543627D02*
X15408158Y-11515055D01*
X15408158Y-11515055D02*
X15398634Y-11496008D01*
X15398634Y-11496008D02*
X15379587Y-11467436D01*
X15379587Y-11467436D02*
X15370063Y-11457912D01*
X15731968Y-11762674D02*
X15722444Y-11753150D01*
X15722444Y-11753150D02*
X15703396Y-11724579D01*
X15703396Y-11724579D02*
X15693872Y-11705531D01*
X15693872Y-11705531D02*
X15684349Y-11676960D01*
X15684349Y-11676960D02*
X15674825Y-11629341D01*
X15674825Y-11629341D02*
X15674825Y-11591246D01*
X15674825Y-11591246D02*
X15684349Y-11543627D01*
X15684349Y-11543627D02*
X15693872Y-11515055D01*
X15693872Y-11515055D02*
X15703396Y-11496008D01*
X15703396Y-11496008D02*
X15722444Y-11467436D01*
X15722444Y-11467436D02*
X15731968Y-11457912D01*
X15808158Y-11553150D02*
X15808158Y-11686484D01*
X15808158Y-11572198D02*
X15817682Y-11562674D01*
X15817682Y-11562674D02*
X15836730Y-11553150D01*
X15836730Y-11553150D02*
X15865301Y-11553150D01*
X15865301Y-11553150D02*
X15884349Y-11562674D01*
X15884349Y-11562674D02*
X15893872Y-11581722D01*
X15893872Y-11581722D02*
X15893872Y-11686484D01*
X16017682Y-11686484D02*
X15998634Y-11676960D01*
X15998634Y-11676960D02*
X15989111Y-11667436D01*
X15989111Y-11667436D02*
X15979587Y-11648388D01*
X15979587Y-11648388D02*
X15979587Y-11591246D01*
X15979587Y-11591246D02*
X15989111Y-11572198D01*
X15989111Y-11572198D02*
X15998634Y-11562674D01*
X15998634Y-11562674D02*
X16017682Y-11553150D01*
X16017682Y-11553150D02*
X16046253Y-11553150D01*
X16046253Y-11553150D02*
X16065301Y-11562674D01*
X16065301Y-11562674D02*
X16074825Y-11572198D01*
X16074825Y-11572198D02*
X16084349Y-11591246D01*
X16084349Y-11591246D02*
X16084349Y-11648388D01*
X16084349Y-11648388D02*
X16074825Y-11667436D01*
X16074825Y-11667436D02*
X16065301Y-11676960D01*
X16065301Y-11676960D02*
X16046253Y-11686484D01*
X16046253Y-11686484D02*
X16017682Y-11686484D01*
X16141492Y-11553150D02*
X16217682Y-11553150D01*
X16170063Y-11486484D02*
X16170063Y-11657912D01*
X16170063Y-11657912D02*
X16179587Y-11676960D01*
X16179587Y-11676960D02*
X16198634Y-11686484D01*
X16198634Y-11686484D02*
X16217682Y-11686484D01*
X16436730Y-11553150D02*
X16436730Y-11753150D01*
X16436730Y-11562674D02*
X16455777Y-11553150D01*
X16455777Y-11553150D02*
X16493873Y-11553150D01*
X16493873Y-11553150D02*
X16512920Y-11562674D01*
X16512920Y-11562674D02*
X16522444Y-11572198D01*
X16522444Y-11572198D02*
X16531968Y-11591246D01*
X16531968Y-11591246D02*
X16531968Y-11648388D01*
X16531968Y-11648388D02*
X16522444Y-11667436D01*
X16522444Y-11667436D02*
X16512920Y-11676960D01*
X16512920Y-11676960D02*
X16493873Y-11686484D01*
X16493873Y-11686484D02*
X16455777Y-11686484D01*
X16455777Y-11686484D02*
X16436730Y-11676960D01*
X16646253Y-11686484D02*
X16627206Y-11676960D01*
X16627206Y-11676960D02*
X16617682Y-11657912D01*
X16617682Y-11657912D02*
X16617682Y-11486484D01*
X16808158Y-11686484D02*
X16808158Y-11581722D01*
X16808158Y-11581722D02*
X16798635Y-11562674D01*
X16798635Y-11562674D02*
X16779587Y-11553150D01*
X16779587Y-11553150D02*
X16741492Y-11553150D01*
X16741492Y-11553150D02*
X16722444Y-11562674D01*
X16808158Y-11676960D02*
X16789111Y-11686484D01*
X16789111Y-11686484D02*
X16741492Y-11686484D01*
X16741492Y-11686484D02*
X16722444Y-11676960D01*
X16722444Y-11676960D02*
X16712920Y-11657912D01*
X16712920Y-11657912D02*
X16712920Y-11638865D01*
X16712920Y-11638865D02*
X16722444Y-11619817D01*
X16722444Y-11619817D02*
X16741492Y-11610293D01*
X16741492Y-11610293D02*
X16789111Y-11610293D01*
X16789111Y-11610293D02*
X16808158Y-11600769D01*
X16874825Y-11553150D02*
X16951015Y-11553150D01*
X16903396Y-11486484D02*
X16903396Y-11657912D01*
X16903396Y-11657912D02*
X16912920Y-11676960D01*
X16912920Y-11676960D02*
X16931968Y-11686484D01*
X16931968Y-11686484D02*
X16951015Y-11686484D01*
X17093873Y-11676960D02*
X17074825Y-11686484D01*
X17074825Y-11686484D02*
X17036730Y-11686484D01*
X17036730Y-11686484D02*
X17017682Y-11676960D01*
X17017682Y-11676960D02*
X17008158Y-11657912D01*
X17008158Y-11657912D02*
X17008158Y-11581722D01*
X17008158Y-11581722D02*
X17017682Y-11562674D01*
X17017682Y-11562674D02*
X17036730Y-11553150D01*
X17036730Y-11553150D02*
X17074825Y-11553150D01*
X17074825Y-11553150D02*
X17093873Y-11562674D01*
X17093873Y-11562674D02*
X17103396Y-11581722D01*
X17103396Y-11581722D02*
X17103396Y-11600769D01*
X17103396Y-11600769D02*
X17008158Y-11619817D01*
X17274825Y-11686484D02*
X17274825Y-11486484D01*
X17274825Y-11676960D02*
X17255777Y-11686484D01*
X17255777Y-11686484D02*
X17217682Y-11686484D01*
X17217682Y-11686484D02*
X17198635Y-11676960D01*
X17198635Y-11676960D02*
X17189111Y-11667436D01*
X17189111Y-11667436D02*
X17179587Y-11648388D01*
X17179587Y-11648388D02*
X17179587Y-11591246D01*
X17179587Y-11591246D02*
X17189111Y-11572198D01*
X17189111Y-11572198D02*
X17198635Y-11562674D01*
X17198635Y-11562674D02*
X17217682Y-11553150D01*
X17217682Y-11553150D02*
X17255777Y-11553150D01*
X17255777Y-11553150D02*
X17274825Y-11562674D01*
X17351016Y-11762674D02*
X17360539Y-11753150D01*
X17360539Y-11753150D02*
X17379587Y-11724579D01*
X17379587Y-11724579D02*
X17389111Y-11705531D01*
X17389111Y-11705531D02*
X17398635Y-11676960D01*
X17398635Y-11676960D02*
X17408158Y-11629341D01*
X17408158Y-11629341D02*
X17408158Y-11591246D01*
X17408158Y-11591246D02*
X17398635Y-11543627D01*
X17398635Y-11543627D02*
X17389111Y-11515055D01*
X17389111Y-11515055D02*
X17379587Y-11496008D01*
X17379587Y-11496008D02*
X17360539Y-11467436D01*
X17360539Y-11467436D02*
X17351016Y-11457912D01*
M02*
