(footprint "PCBFEAT-REV-040"
	(version 20240108)
	(generator "pcbnew")
	(generator_version "8.0")
	(layer "F.Cu")
	(descr "Revision Level Field - 40 mil\n\nSet version with global board attribute '>REV'")
	(property "Reference" "REF**"
		(at 0 0 180)
		(unlocked yes)
		(layer "F.SilkS")
		(hide yes)
		(uuid "23f5c04c-635c-48c3-b0f2-426d7b5431ba")
		(effects
			(font
				(size 1.27 1.27)
			)
		)
	)
	(property "Value" ""
		(at 0 0 180)
		(unlocked yes)
		(layer "F.Fab")
		(hide yes)
		(uuid "1f13bd05-6d65-4752-8abc-1fcb15ba3690")
		(effects
			(font
				(size 1.27 1.27)
			)
		)
	)
	(property "Footprint" ""
		(at 0 0 180)
		(unlocked yes)
		(layer "F.Fab")
		(hide yes)
		(uuid "ff69d9a1-31ba-410c-98c6-c904a672af82")
		(effects
			(font
				(size 1.27 1.27)
			)
		)
	)
	(property "Datasheet" ""
		(at 0 0 180)
		(unlocked yes)
		(layer "F.Fab")
		(hide yes)
		(uuid "b1f4374a-6a09-4b67-8dd5-aa1d278b3f25")
		(effects
			(font
				(size 1.27 1.27)
			)
		)
	)
	(property "Description" ""
		(at 0 0 180)
		(unlocked yes)
		(layer "F.Fab")
		(hide yes)
		(uuid "2ed83338-84c0-4e81-9b61-da4f6d3bcb80")
		(effects
			(font
				(size 1.27 1.27)
			)
		)
	)
	(fp_circle
		(center 0 0)
		(end 0.898 0)
		(stroke
			(width 0.3048)
			(type solid)
		)
		(fill none)
		(layer "F.SilkS")
		(uuid "55455d77-bc23-42f1-b6a7-89760dd856fe")
	)
	(fp_text user "${REV}"
		(at -0.3556 0.508 180)
		(layer "F.SilkS")
		(uuid "a1544038-fdf5-4d2a-b7d7-60581344e8bc")
		(effects
			(font
				(size 0.8128 0.8128)
				(thickness 0.2032)
			)
			(justify left bottom)
		)
	)
)