(footprint "0805-NO"
	(version 20240108)
	(generator "pcbnew")
	(generator_version "8.0")
	(layer "F.Cu")
	(property "Reference" "REF**"
		(at -1.5875 -0.9525 0)
		(unlocked yes)
		(layer "F.SilkS")
		(uuid "c34145aa-997a-4f24-b110-54b70d3a4505")
		(effects
			(font
				(size 0.692831 0.692831)
				(thickness 0.119969)
			)
			(justify left bottom)
		)
	)
	(property "Value" "10K"
		(at -0.9525 0.508 0)
		(unlocked yes)
		(layer "F.Fab")
		(uuid "94801b44-64a0-4091-a5c3-3c0c10b2e5f4")
		(effects
			(font
				(size 0.776224 0.776224)
				(thickness 0.036576)
			)
			(justify left bottom)
		)
	)
	(property "Footprint" ""
		(at 0 0 0)
		(unlocked yes)
		(layer "F.Fab")
		(hide yes)
		(uuid "d8a1257a-ad15-48b5-b159-659e69639a67")
		(effects
			(font
				(size 1.27 1.27)
			)
		)
	)
	(property "Datasheet" ""
		(at 0 0 0)
		(unlocked yes)
		(layer "F.Fab")
		(hide yes)
		(uuid "c5342766-6f75-4d66-855d-a15cb0d0b3d4")
		(effects
			(font
				(size 1.27 1.27)
			)
		)
	)
	(property "Description" ""
		(at 0 0 0)
		(unlocked yes)
		(layer "F.Fab")
		(hide yes)
		(uuid "e60b5999-4c32-4f50-8197-afc06c695c8a")
		(effects
			(font
				(size 1.27 1.27)
			)
		)
	)
	(fp_line
		(start 0 -0.508)
		(end 0 0.508)
		(stroke
			(width 0.3048)
			(type solid)
		)
		(layer "F.SilkS")
		(uuid "7455fbf2-9d7f-48fb-a215-88d7c7aed0ce")
	)
	(fp_line
		(start -0.381 -0.66)
		(end 0.381 -0.66)
		(stroke
			(width 0.1016)
			(type solid)
		)
		(layer "F.Fab")
		(uuid "8a8731c3-05d6-40a2-a912-22bbca44acbd")
	)
	(fp_line
		(start -0.356 0.66)
		(end 0.381 0.66)
		(stroke
			(width 0.1016)
			(type solid)
		)
		(layer "F.Fab")
		(uuid "3d57e00d-11d4-4b7f-849e-7f1696433f8b")
	)
	(fp_poly
		(pts
			(xy -1.0922 0.7239) (xy -0.3421 0.7239) (xy -0.3421 -0.7262) (xy -1.0922 -0.7262)
		)
		(stroke
			(width 0)
			(type default)
		)
		(fill solid)
		(layer "F.Fab")
		(uuid "661ce147-7586-473b-aad9-be6c4bf27835")
	)
	(fp_poly
		(pts
			(xy 0.3556 0.7239) (xy 1.1057 0.7239) (xy 1.1057 -0.7262) (xy 0.3556 -0.7262)
		)
		(stroke
			(width 0)
			(type default)
		)
		(fill solid)
		(layer "F.Fab")
		(uuid "55709119-919f-4522-a5e2-131e5702bb16")
	)
	(pad "1" smd rect
		(at -0.95 0)
		(size 1.3 1.5)
		(layers "F.Cu" "F.Paste" "F.Mask")
		(solder_mask_margin 0.0508)
		(thermal_bridge_angle 0)
		(uuid "6cbd1a03-e218-49cf-872a-0970fc217a0a")
	)
	(pad "2" smd rect
		(at 0.95 0)
		(size 1.3 1.5)
		(layers "F.Cu" "F.Paste" "F.Mask")
		(solder_mask_margin 0.0508)
		(thermal_bridge_angle 0)
		(uuid "7fda432e-b006-44c9-848c-51e151957db4")
	)
)