(kicad_sch
	(version 20231120)
	(generator "eeschema")
	(generator_version "8.0")
	(uuid "50215048-95b4-49b3-afd0-411b61ca84e1")
	(paper "A4")
	(lib_symbols
		(symbol "0_1"
			(power)
			(pin_names
				(offset 0)
			)
			(exclude_from_sim no)
			(in_bom yes)
			(on_board yes)
			(property "Reference" "#GND"
				(at 0 -2.54 0)
				(effects
					(font
						(size 1.27 1.27)
					)
					(hide yes)
				)
			)
			(property "Value" "0"
				(at 0 -1.778 0)
				(effects
					(font
						(size 1.27 1.27)
					)
				)
			)
			(property "Footprint" ""
				(at 0 0 0)
				(effects
					(font
						(size 1.27 1.27)
					)
					(hide yes)
				)
			)
			(property "Datasheet" "https://ngspice.sourceforge.io/docs/ngspice-html-manual/manual.xhtml#subsec_Circuit_elements__device"
				(at 0 0 0)
				(effects
					(font
						(size 1.27 1.27)
					)
					(hide yes)
				)
			)
			(property "Description" "0V reference potential for simulation"
				(at 0 0 0)
				(effects
					(font
						(size 1.27 1.27)
					)
					(hide yes)
				)
			)
			(property "ki_keywords" "simulation"
				(at 0 0 0)
				(effects
					(font
						(size 1.27 1.27)
					)
					(hide yes)
				)
			)
			(symbol "0_1_0_1"
				(polyline
					(pts
						(xy -1.27 0) (xy 0 -1.27) (xy 1.27 0) (xy -1.27 0)
					)
					(stroke
						(width 0)
						(type default)
					)
					(fill
						(type none)
					)
				)
			)
			(symbol "0_1_1_1"
				(pin power_in line
					(at 0 0 0)
					(length 0) hide
					(name "0"
						(effects
							(font
								(size 1.016 1.016)
							)
						)
					)
					(number "1"
						(effects
							(font
								(size 1.016 1.016)
							)
						)
					)
				)
			)
		)
		(symbol "Connector_Generic:Conn_01x04"
			(pin_names
				(offset 1.016) hide)
			(exclude_from_sim no)
			(in_bom yes)
			(on_board yes)
			(property "Reference" "J"
				(at 0 5.08 0)
				(effects
					(font
						(size 1.27 1.27)
					)
				)
			)
			(property "Value" "Conn_01x04"
				(at 0 -7.62 0)
				(effects
					(font
						(size 1.27 1.27)
					)
				)
			)
			(property "Footprint" ""
				(at 0 0 0)
				(effects
					(font
						(size 1.27 1.27)
					)
					(hide yes)
				)
			)
			(property "Datasheet" "~"
				(at 0 0 0)
				(effects
					(font
						(size 1.27 1.27)
					)
					(hide yes)
				)
			)
			(property "Description" "Generic connector, single row, 01x04, script generated (kicad-library-utils/schlib/autogen/connector/)"
				(at 0 0 0)
				(effects
					(font
						(size 1.27 1.27)
					)
					(hide yes)
				)
			)
			(property "ki_keywords" "connector"
				(at 0 0 0)
				(effects
					(font
						(size 1.27 1.27)
					)
					(hide yes)
				)
			)
			(property "ki_fp_filters" "Connector*:*_1x??_*"
				(at 0 0 0)
				(effects
					(font
						(size 1.27 1.27)
					)
					(hide yes)
				)
			)
			(symbol "Conn_01x04_1_1"
				(rectangle
					(start -1.27 -4.953)
					(end 0 -5.207)
					(stroke
						(width 0.1524)
						(type default)
					)
					(fill
						(type none)
					)
				)
				(rectangle
					(start -1.27 -2.413)
					(end 0 -2.667)
					(stroke
						(width 0.1524)
						(type default)
					)
					(fill
						(type none)
					)
				)
				(rectangle
					(start -1.27 0.127)
					(end 0 -0.127)
					(stroke
						(width 0.1524)
						(type default)
					)
					(fill
						(type none)
					)
				)
				(rectangle
					(start -1.27 2.667)
					(end 0 2.413)
					(stroke
						(width 0.1524)
						(type default)
					)
					(fill
						(type none)
					)
				)
				(rectangle
					(start -1.27 3.81)
					(end 1.27 -6.35)
					(stroke
						(width 0.254)
						(type default)
					)
					(fill
						(type background)
					)
				)
				(pin passive line
					(at -5.08 2.54 0)
					(length 3.81)
					(name "Pin_1"
						(effects
							(font
								(size 1.27 1.27)
							)
						)
					)
					(number "1"
						(effects
							(font
								(size 1.27 1.27)
							)
						)
					)
				)
				(pin passive line
					(at -5.08 0 0)
					(length 3.81)
					(name "Pin_2"
						(effects
							(font
								(size 1.27 1.27)
							)
						)
					)
					(number "2"
						(effects
							(font
								(size 1.27 1.27)
							)
						)
					)
				)
				(pin passive line
					(at -5.08 -2.54 0)
					(length 3.81)
					(name "Pin_3"
						(effects
							(font
								(size 1.27 1.27)
							)
						)
					)
					(number "3"
						(effects
							(font
								(size 1.27 1.27)
							)
						)
					)
				)
				(pin passive line
					(at -5.08 -5.08 0)
					(length 3.81)
					(name "Pin_4"
						(effects
							(font
								(size 1.27 1.27)
							)
						)
					)
					(number "4"
						(effects
							(font
								(size 1.27 1.27)
							)
						)
					)
				)
			)
		)
		(symbol "Device:R"
			(pin_numbers hide)
			(pin_names
				(offset 0)
			)
			(exclude_from_sim no)
			(in_bom yes)
			(on_board yes)
			(property "Reference" "R"
				(at 2.032 0 90)
				(effects
					(font
						(size 1.27 1.27)
					)
				)
			)
			(property "Value" "R"
				(at 0 0 90)
				(effects
					(font
						(size 1.27 1.27)
					)
				)
			)
			(property "Footprint" ""
				(at -1.778 0 90)
				(effects
					(font
						(size 1.27 1.27)
					)
					(hide yes)
				)
			)
			(property "Datasheet" "~"
				(at 0 0 0)
				(effects
					(font
						(size 1.27 1.27)
					)
					(hide yes)
				)
			)
			(property "Description" "Resistor"
				(at 0 0 0)
				(effects
					(font
						(size 1.27 1.27)
					)
					(hide yes)
				)
			)
			(property "ki_keywords" "R res resistor"
				(at 0 0 0)
				(effects
					(font
						(size 1.27 1.27)
					)
					(hide yes)
				)
			)
			(property "ki_fp_filters" "R_*"
				(at 0 0 0)
				(effects
					(font
						(size 1.27 1.27)
					)
					(hide yes)
				)
			)
			(symbol "R_0_1"
				(rectangle
					(start -1.016 -2.54)
					(end 1.016 2.54)
					(stroke
						(width 0.254)
						(type default)
					)
					(fill
						(type none)
					)
				)
			)
			(symbol "R_1_1"
				(pin passive line
					(at 0 3.81 270)
					(length 1.27)
					(name "~"
						(effects
							(font
								(size 1.27 1.27)
							)
						)
					)
					(number "1"
						(effects
							(font
								(size 1.27 1.27)
							)
						)
					)
				)
				(pin passive line
					(at 0 -3.81 90)
					(length 1.27)
					(name "~"
						(effects
							(font
								(size 1.27 1.27)
							)
						)
					)
					(number "2"
						(effects
							(font
								(size 1.27 1.27)
							)
						)
					)
				)
			)
		)
		(symbol "Simulation_SPICE:0"
			(power)
			(pin_numbers hide)
			(pin_names
				(offset 0) hide)
			(exclude_from_sim no)
			(in_bom yes)
			(on_board yes)
			(property "Reference" "#GND"
				(at 0 -5.08 0)
				(effects
					(font
						(size 1.27 1.27)
					)
					(hide yes)
				)
			)
			(property "Value" "0"
				(at 0 -2.54 0)
				(effects
					(font
						(size 1.27 1.27)
					)
				)
			)
			(property "Footprint" ""
				(at 0 0 0)
				(effects
					(font
						(size 1.27 1.27)
					)
					(hide yes)
				)
			)
			(property "Datasheet" "https://ngspice.sourceforge.io/docs/ngspice-html-manual/manual.xhtml#subsec_Circuit_elements__device"
				(at 0 -10.16 0)
				(effects
					(font
						(size 1.27 1.27)
					)
					(hide yes)
				)
			)
			(property "Description" "0V reference potential for simulation"
				(at 0 -7.62 0)
				(effects
					(font
						(size 1.27 1.27)
					)
					(hide yes)
				)
			)
			(property "ki_keywords" "simulation"
				(at 0 0 0)
				(effects
					(font
						(size 1.27 1.27)
					)
					(hide yes)
				)
			)
			(symbol "0_0_1"
				(polyline
					(pts
						(xy -1.27 0) (xy 0 -1.27) (xy 1.27 0) (xy -1.27 0)
					)
					(stroke
						(width 0)
						(type default)
					)
					(fill
						(type none)
					)
				)
			)
			(symbol "0_1_1"
				(pin power_in line
					(at 0 0 0)
					(length 0)
					(name "~"
						(effects
							(font
								(size 1.016 1.016)
							)
						)
					)
					(number "1"
						(effects
							(font
								(size 1.016 1.016)
							)
						)
					)
				)
			)
		)
		(symbol "parts_lib:adafruit_bno055"
			(exclude_from_sim no)
			(in_bom yes)
			(on_board yes)
			(property "Reference" "B"
				(at 0 4.318 0)
				(effects
					(font
						(size 1.27 1.27)
					)
				)
			)
			(property "Value" ""
				(at 0 0 0)
				(effects
					(font
						(size 1.27 1.27)
					)
				)
			)
			(property "Footprint" ""
				(at 0 0 0)
				(effects
					(font
						(size 1.27 1.27)
					)
					(hide yes)
				)
			)
			(property "Datasheet" ""
				(at 0 0 0)
				(effects
					(font
						(size 1.27 1.27)
					)
					(hide yes)
				)
			)
			(property "Description" ""
				(at 0 0 0)
				(effects
					(font
						(size 1.27 1.27)
					)
					(hide yes)
				)
			)
			(symbol "adafruit_bno055_0_1"
				(rectangle
					(start -3.81 3.81)
					(end 10.16 -17.78)
					(stroke
						(width 0)
						(type default)
					)
					(fill
						(type none)
					)
				)
			)
			(symbol "adafruit_bno055_1_1"
				(pin input line
					(at -6.35 2.54 0)
					(length 2.54)
					(name "Vin"
						(effects
							(font
								(size 1.27 1.27)
							)
						)
					)
					(number "1"
						(effects
							(font
								(size 1.27 1.27)
							)
						)
					)
				)
				(pin input line
					(at 12.7 -8.89 180)
					(length 2.54)
					(name "ADR"
						(effects
							(font
								(size 1.27 1.27)
							)
						)
					)
					(number "10"
						(effects
							(font
								(size 1.27 1.27)
							)
						)
					)
				)
				(pin input line
					(at -6.35 -1.27 0)
					(length 2.54)
					(name "3vo"
						(effects
							(font
								(size 1.27 1.27)
							)
						)
					)
					(number "2"
						(effects
							(font
								(size 1.27 1.27)
							)
						)
					)
				)
				(pin input line
					(at -6.35 -5.08 0)
					(length 2.54)
					(name "GND"
						(effects
							(font
								(size 1.27 1.27)
							)
						)
					)
					(number "3"
						(effects
							(font
								(size 1.27 1.27)
							)
						)
					)
				)
				(pin input line
					(at -6.35 -8.89 0)
					(length 2.54)
					(name "SDA"
						(effects
							(font
								(size 1.27 1.27)
							)
						)
					)
					(number "4"
						(effects
							(font
								(size 1.27 1.27)
							)
						)
					)
				)
				(pin input line
					(at -6.35 -12.7 0)
					(length 2.54)
					(name "SCL"
						(effects
							(font
								(size 1.27 1.27)
							)
						)
					)
					(number "5"
						(effects
							(font
								(size 1.27 1.27)
							)
						)
					)
				)
				(pin input line
					(at -6.35 -16.51 0)
					(length 2.54)
					(name "RST"
						(effects
							(font
								(size 1.27 1.27)
							)
						)
					)
					(number "6"
						(effects
							(font
								(size 1.27 1.27)
							)
						)
					)
				)
				(pin input line
					(at 12.7 2.54 180)
					(length 2.54)
					(name "PS0"
						(effects
							(font
								(size 1.27 1.27)
							)
						)
					)
					(number "7"
						(effects
							(font
								(size 1.27 1.27)
							)
						)
					)
				)
				(pin input line
					(at 12.7 -1.27 180)
					(length 2.54)
					(name "PS1"
						(effects
							(font
								(size 1.27 1.27)
							)
						)
					)
					(number "8"
						(effects
							(font
								(size 1.27 1.27)
							)
						)
					)
				)
				(pin input line
					(at 12.7 -5.08 180)
					(length 2.54)
					(name "INT"
						(effects
							(font
								(size 1.27 1.27)
							)
						)
					)
					(number "9"
						(effects
							(font
								(size 1.27 1.27)
							)
						)
					)
				)
			)
		)
	)
	(no_connect
		(at 130.81 99.06)
		(uuid "13e1940d-2e18-410e-af0e-6f47ad1118b9")
	)
	(no_connect
		(at 149.86 87.63)
		(uuid "1ac90afa-3b43-4a2a-9c8c-6e791a1fbcfb")
	)
	(no_connect
		(at 149.86 80.01)
		(uuid "39f80cf0-e36c-4d07-b1a8-11079c0ad2cb")
	)
	(no_connect
		(at 149.86 83.82)
		(uuid "ead770a9-0aa6-4b45-9365-87aa1153d8b9")
	)
	(wire
		(pts
			(xy 133.35 63.5) (xy 133.35 59.69)
		)
		(stroke
			(width 0)
			(type default)
		)
		(uuid "2f48a757-bab1-4f7d-954b-b0feee07eb37")
	)
	(wire
		(pts
			(xy 125.73 80.01) (xy 130.81 80.01)
		)
		(stroke
			(width 0)
			(type default)
		)
		(uuid "37b25fd6-d976-42cc-987f-9a3201e82907")
	)
	(wire
		(pts
			(xy 128.27 95.25) (xy 130.81 95.25)
		)
		(stroke
			(width 0)
			(type default)
		)
		(uuid "4e92dcc2-dec3-48dd-a80c-f666f9475c25")
	)
	(wire
		(pts
			(xy 128.27 83.82) (xy 130.81 83.82)
		)
		(stroke
			(width 0)
			(type default)
		)
		(uuid "501da58e-58da-48cd-84dc-5a9a0897a436")
	)
	(wire
		(pts
			(xy 144.78 60.96) (xy 147.32 60.96)
		)
		(stroke
			(width 0)
			(type default)
		)
		(uuid "5bfb2bf9-cd14-40f9-b8c1-e4f0f8fbb8e8")
	)
	(wire
		(pts
			(xy 147.32 60.96) (xy 147.32 59.69)
		)
		(stroke
			(width 0)
			(type default)
		)
		(uuid "6055d560-39cb-4628-b8a5-8d5510c8f712")
	)
	(wire
		(pts
			(xy 121.92 87.63) (xy 130.81 87.63)
		)
		(stroke
			(width 0)
			(type default)
		)
		(uuid "69506358-91a7-41ff-9da7-bd4bcba05056")
	)
	(wire
		(pts
			(xy 121.92 88.9) (xy 121.92 87.63)
		)
		(stroke
			(width 0)
			(type default)
		)
		(uuid "6d4c153d-f88c-4ec5-ba0e-074e255973e5")
	)
	(wire
		(pts
			(xy 154.94 63.5) (xy 154.94 59.69)
		)
		(stroke
			(width 0)
			(type default)
		)
		(uuid "7af65e9a-d8da-4942-b048-488f9cef86bb")
	)
	(wire
		(pts
			(xy 128.27 91.44) (xy 130.81 91.44)
		)
		(stroke
			(width 0)
			(type default)
		)
		(uuid "852d704f-8194-42b5-aa86-1e11015cc029")
	)
	(wire
		(pts
			(xy 130.81 59.69) (xy 130.81 63.5)
		)
		(stroke
			(width 0)
			(type default)
		)
		(uuid "8952d767-ce5e-4e64-8c03-7554ac81e079")
	)
	(wire
		(pts
			(xy 128.27 63.5) (xy 128.27 59.69)
		)
		(stroke
			(width 0)
			(type default)
		)
		(uuid "9d7a1055-c555-43ea-928d-dacaffc205e2")
	)
	(wire
		(pts
			(xy 123.19 60.96) (xy 125.73 60.96)
		)
		(stroke
			(width 0)
			(type default)
		)
		(uuid "c92f503d-d42e-4345-8cd9-defc6bb5d628")
	)
	(wire
		(pts
			(xy 125.73 60.96) (xy 125.73 59.69)
		)
		(stroke
			(width 0)
			(type default)
		)
		(uuid "d0f516a2-c84d-4aee-a40d-7f8c40c7a3a1")
	)
	(wire
		(pts
			(xy 152.4 59.69) (xy 152.4 63.5)
		)
		(stroke
			(width 0)
			(type default)
		)
		(uuid "d7786879-2ffe-4cbd-a5e5-e044967576d3")
	)
	(wire
		(pts
			(xy 162.56 91.44) (xy 165.1 91.44)
		)
		(stroke
			(width 0)
			(type default)
		)
		(uuid "f6c82c20-5963-4723-95ea-360d1e2f3f89")
	)
	(wire
		(pts
			(xy 149.86 63.5) (xy 149.86 59.69)
		)
		(stroke
			(width 0)
			(type default)
		)
		(uuid "fbdc6519-7288-43c4-8fa6-ce7d218079ea")
	)
	(wire
		(pts
			(xy 149.86 91.44) (xy 154.94 91.44)
		)
		(stroke
			(width 0)
			(type default)
		)
		(uuid "fe0b2238-7453-4a50-abdc-e9af63ebcb24")
	)
	(text "OPTIONAL PAD TO SET ADR PIN HIGH\nADR I2C CONFIG:\n	LOW = 0X28\n	HIGH = 0X29\n"
		(exclude_from_sim no)
		(at 169.926 99.568 0)
		(effects
			(font
				(size 1.27 1.27)
			)
		)
		(uuid "90db3ef5-dec2-4880-8d92-9ef652f4c698")
	)
	(label "3vo"
		(at 128.27 83.82 180)
		(effects
			(font
				(size 1.27 1.27)
			)
			(justify right bottom)
		)
		(uuid "01fdfa88-1ce7-40d8-84c3-227e6e8b2435")
	)
	(label "SCL"
		(at 128.27 95.25 180)
		(fields_autoplaced yes)
		(effects
			(font
				(size 1.27 1.27)
			)
			(justify right bottom)
		)
		(uuid "04c3efc3-d923-4f74-b045-0a0795ab383f")
	)
	(label "3.3V "
		(at 123.19 60.96 270)
		(fields_autoplaced yes)
		(effects
			(font
				(size 1.27 1.27)
			)
			(justify right bottom)
		)
		(uuid "145355e6-c1a1-473c-bc84-7b6166b463c5")
		(property "Netclass" ""
			(at 124.46 60.96 90)
			(effects
				(font
					(size 1.27 1.27)
					(italic yes)
				)
				(justify right)
			)
		)
	)
	(label "ADR"
		(at 149.86 91.44 0)
		(effects
			(font
				(size 1.27 1.27)
			)
			(justify left bottom)
		)
		(uuid "1dbbe05c-57fc-4082-a88e-1800680d15ad")
	)
	(label "3vo"
		(at 165.1 91.44 0)
		(fields_autoplaced yes)
		(effects
			(font
				(size 1.27 1.27)
			)
			(justify left bottom)
		)
		(uuid "252a5ec2-e1e3-467d-8972-5afbb9ef43bb")
	)
	(label "3.3V "
		(at 144.78 60.96 90)
		(fields_autoplaced yes)
		(effects
			(font
				(size 1.27 1.27)
			)
			(justify left bottom)
		)
		(uuid "45fddf89-d736-49f0-a2a4-a9ba0b789289")
		(property "Netclass" ""
			(at 146.05 60.96 90)
			(effects
				(font
					(size 1.27 1.27)
					(italic yes)
				)
				(justify left)
			)
		)
	)
	(label "3.3V "
		(at 125.73 80.01 0)
		(fields_autoplaced yes)
		(effects
			(font
				(size 1.27 1.27)
			)
			(justify left bottom)
		)
		(uuid "49af3536-e623-4ca4-8d8c-d205184d1192")
		(property "Netclass" ""
			(at 125.73 81.28 0)
			(effects
				(font
					(size 1.27 1.27)
					(italic yes)
				)
				(justify left)
			)
		)
	)
	(label "SCL"
		(at 149.86 63.5 270)
		(fields_autoplaced yes)
		(effects
			(font
				(size 1.27 1.27)
			)
			(justify right bottom)
		)
		(uuid "4ef99063-da4d-4886-a3cd-c624fa4f4c61")
	)
	(label "SDA"
		(at 154.94 63.5 0)
		(fields_autoplaced yes)
		(effects
			(font
				(size 1.27 1.27)
			)
			(justify left bottom)
		)
		(uuid "8681f7ad-5089-45f8-ad4e-820d361c7bbb")
	)
	(label "SCL"
		(at 128.27 63.5 270)
		(fields_autoplaced yes)
		(effects
			(font
				(size 1.27 1.27)
			)
			(justify right bottom)
		)
		(uuid "93c7b9fb-91af-4061-b1dd-e049903b2636")
	)
	(label "SDA"
		(at 128.27 91.44 180)
		(fields_autoplaced yes)
		(effects
			(font
				(size 1.27 1.27)
			)
			(justify right bottom)
		)
		(uuid "abd3416f-3c29-4d5a-aaec-b10bd84a5ea1")
	)
	(label "SDA"
		(at 133.35 63.5 0)
		(fields_autoplaced yes)
		(effects
			(font
				(size 1.27 1.27)
			)
			(justify left bottom)
		)
		(uuid "bc54cfe7-f270-4426-a101-c37cf9dda397")
	)
	(symbol
		(lib_id "parts_lib:adafruit_bno055")
		(at 137.16 82.55 0)
		(unit 1)
		(exclude_from_sim no)
		(in_bom yes)
		(on_board yes)
		(dnp no)
		(fields_autoplaced yes)
		(uuid "509dde29-d7ef-474a-8630-5cd3940696bd")
		(property "Reference" "B1"
			(at 140.335 74.93 0)
			(effects
				(font
					(size 1.27 1.27)
				)
			)
		)
		(property "Value" "~"
			(at 140.335 77.47 0)
			(effects
				(font
					(size 1.27 1.27)
				)
			)
		)
		(property "Footprint" "parts_lib:adafruit_bno055"
			(at 137.16 82.55 0)
			(effects
				(font
					(size 1.27 1.27)
				)
				(hide yes)
			)
		)
		(property "Datasheet" ""
			(at 137.16 82.55 0)
			(effects
				(font
					(size 1.27 1.27)
				)
				(hide yes)
			)
		)
		(property "Description" ""
			(at 137.16 82.55 0)
			(effects
				(font
					(size 1.27 1.27)
				)
				(hide yes)
			)
		)
		(pin "9"
			(uuid "28a57075-13df-444c-9642-fb44713a5003")
		)
		(pin "2"
			(uuid "fefb920f-2fdb-4e1a-b2a4-54e340048968")
		)
		(pin "7"
			(uuid "59a90701-23e9-4160-b063-7e7b9b4a5176")
		)
		(pin "3"
			(uuid "ad8f8797-1136-4e4d-8fdc-507963376a96")
		)
		(pin "5"
			(uuid "f16d4774-3810-41ba-8baf-a9530a0a520a")
		)
		(pin "10"
			(uuid "c8b228bd-1e54-43ff-afb8-5def63f3f817")
		)
		(pin "1"
			(uuid "361188b9-4877-4b65-be8b-d1167ef62cd7")
		)
		(pin "6"
			(uuid "1fc96efd-150a-4d04-abdd-feaa17857cff")
		)
		(pin "4"
			(uuid "03cfd6ce-b870-4f5f-9744-cdce5dc18058")
		)
		(pin "8"
			(uuid "bd319355-99fb-4ec2-8046-d66e39dbf186")
		)
		(instances
			(project "bn055-i2c-pcb"
				(path "/50215048-95b4-49b3-afd0-411b61ca84e1"
					(reference "B1")
					(unit 1)
				)
			)
		)
	)
	(symbol
		(lib_id "Connector_Generic:Conn_01x04")
		(at 149.86 54.61 90)
		(unit 1)
		(exclude_from_sim no)
		(in_bom yes)
		(on_board yes)
		(dnp no)
		(fields_autoplaced yes)
		(uuid "73840413-ee3e-40fa-b8ea-70dcbb0a5111")
		(property "Reference" "J2"
			(at 151.13 50.8 90)
			(effects
				(font
					(size 1.27 1.27)
				)
			)
		)
		(property "Value" "~"
			(at 151.13 50.8 90)
			(effects
				(font
					(size 1.27 1.27)
				)
				(hide yes)
			)
		)
		(property "Footprint" "Connector_JST:JST_XH_S4B-XH-A-1_1x04_P2.50mm_Horizontal"
			(at 149.86 54.61 0)
			(effects
				(font
					(size 1.27 1.27)
				)
				(hide yes)
			)
		)
		(property "Datasheet" "~"
			(at 149.86 54.61 0)
			(effects
				(font
					(size 1.27 1.27)
				)
				(hide yes)
			)
		)
		(property "Description" "Generic connector, single row, 01x04, script generated (kicad-library-utils/schlib/autogen/connector/)"
			(at 149.86 54.61 0)
			(effects
				(font
					(size 1.27 1.27)
				)
				(hide yes)
			)
		)
		(pin "2"
			(uuid "d90b3d13-d83e-48ae-aa1c-487ca27136a6")
		)
		(pin "1"
			(uuid "d6c7b653-e49b-4d52-9242-b66f75ede905")
		)
		(pin "3"
			(uuid "715aca19-d942-48b2-8a46-19e20012be26")
		)
		(pin "4"
			(uuid "b3a887be-73ab-4662-a856-f74b3f067e5c")
		)
		(instances
			(project "bn055-i2c-pcb"
				(path "/50215048-95b4-49b3-afd0-411b61ca84e1"
					(reference "J2")
					(unit 1)
				)
			)
		)
	)
	(symbol
		(lib_id "Connector_Generic:Conn_01x04")
		(at 128.27 54.61 90)
		(unit 1)
		(exclude_from_sim no)
		(in_bom yes)
		(on_board yes)
		(dnp no)
		(fields_autoplaced yes)
		(uuid "77b9b770-1534-420e-a967-a3c3791d6b63")
		(property "Reference" "J1"
			(at 129.54 50.8 90)
			(effects
				(font
					(size 1.27 1.27)
				)
			)
		)
		(property "Value" "~"
			(at 129.54 50.8 90)
			(effects
				(font
					(size 1.27 1.27)
				)
				(hide yes)
			)
		)
		(property "Footprint" "Connector_JST:JST_XH_S4B-XH-A-1_1x04_P2.50mm_Horizontal"
			(at 128.27 54.61 0)
			(effects
				(font
					(size 1.27 1.27)
				)
				(hide yes)
			)
		)
		(property "Datasheet" "~"
			(at 128.27 54.61 0)
			(effects
				(font
					(size 1.27 1.27)
				)
				(hide yes)
			)
		)
		(property "Description" "Generic connector, single row, 01x04, script generated (kicad-library-utils/schlib/autogen/connector/)"
			(at 128.27 54.61 0)
			(effects
				(font
					(size 1.27 1.27)
				)
				(hide yes)
			)
		)
		(pin "2"
			(uuid "ad991dbd-e2c7-461f-b853-d4e54cea2400")
		)
		(pin "1"
			(uuid "8ca76b56-4dcb-4df1-bca1-3b1281062b04")
		)
		(pin "3"
			(uuid "64786e3f-f155-440d-ad74-aba960297d02")
		)
		(pin "4"
			(uuid "28cc9533-be7c-4fa6-8d63-039947bba5dd")
		)
		(instances
			(project "bn055-i2c-pcb"
				(path "/50215048-95b4-49b3-afd0-411b61ca84e1"
					(reference "J1")
					(unit 1)
				)
			)
		)
	)
	(symbol
		(lib_id "Device:R")
		(at 158.75 91.44 90)
		(unit 1)
		(exclude_from_sim no)
		(in_bom yes)
		(on_board yes)
		(dnp no)
		(fields_autoplaced yes)
		(uuid "9f58e683-1318-4787-abe5-719829d9069c")
		(property "Reference" "R1"
			(at 158.75 85.09 90)
			(effects
				(font
					(size 1.27 1.27)
				)
			)
		)
		(property "Value" "0"
			(at 158.75 87.63 90)
			(effects
				(font
					(size 1.27 1.27)
				)
			)
		)
		(property "Footprint" "Resistor_SMD:R_0805_2012Metric"
			(at 158.75 93.218 90)
			(effects
				(font
					(size 1.27 1.27)
				)
				(hide yes)
			)
		)
		(property "Datasheet" "~"
			(at 158.75 91.44 0)
			(effects
				(font
					(size 1.27 1.27)
				)
				(hide yes)
			)
		)
		(property "Description" "Resistor"
			(at 158.75 91.44 0)
			(effects
				(font
					(size 1.27 1.27)
				)
				(hide yes)
			)
		)
		(pin "2"
			(uuid "d4e3f07c-8a39-40b4-8254-705861e87575")
		)
		(pin "1"
			(uuid "42abfedb-0efd-4e52-b55e-a26bd0ab24aa")
		)
		(instances
			(project "bn055-i2c-pcb"
				(path "/50215048-95b4-49b3-afd0-411b61ca84e1"
					(reference "R1")
					(unit 1)
				)
			)
		)
	)
	(symbol
		(lib_id "Simulation_SPICE:0")
		(at 152.4 63.5 0)
		(unit 1)
		(exclude_from_sim no)
		(in_bom yes)
		(on_board yes)
		(dnp no)
		(fields_autoplaced yes)
		(uuid "c19076d4-0baa-46d0-990b-55ff3b57938e")
		(property "Reference" "#GND03"
			(at 152.4 68.58 0)
			(effects
				(font
					(size 1.27 1.27)
				)
				(hide yes)
			)
		)
		(property "Value" "0"
			(at 152.4 60.96 0)
			(effects
				(font
					(size 1.27 1.27)
				)
			)
		)
		(property "Footprint" ""
			(at 152.4 63.5 0)
			(effects
				(font
					(size 1.27 1.27)
				)
				(hide yes)
			)
		)
		(property "Datasheet" "https://ngspice.sourceforge.io/docs/ngspice-html-manual/manual.xhtml#subsec_Circuit_elements__device"
			(at 152.4 73.66 0)
			(effects
				(font
					(size 1.27 1.27)
				)
				(hide yes)
			)
		)
		(property "Description" "0V reference potential for simulation"
			(at 152.4 71.12 0)
			(effects
				(font
					(size 1.27 1.27)
				)
				(hide yes)
			)
		)
		(pin "1"
			(uuid "23cd786c-2069-4c22-9bd8-7730f090d876")
		)
		(instances
			(project "bn055-i2c-pcb"
				(path "/50215048-95b4-49b3-afd0-411b61ca84e1"
					(reference "#GND03")
					(unit 1)
				)
			)
		)
	)
	(symbol
		(lib_id "Simulation_SPICE:0")
		(at 130.81 63.5 0)
		(unit 1)
		(exclude_from_sim no)
		(in_bom yes)
		(on_board yes)
		(dnp no)
		(fields_autoplaced yes)
		(uuid "e5e4ef64-b854-4d80-8f52-5158cf536e78")
		(property "Reference" "#GND02"
			(at 130.81 68.58 0)
			(effects
				(font
					(size 1.27 1.27)
				)
				(hide yes)
			)
		)
		(property "Value" "0"
			(at 130.81 60.96 0)
			(effects
				(font
					(size 1.27 1.27)
				)
			)
		)
		(property "Footprint" ""
			(at 130.81 63.5 0)
			(effects
				(font
					(size 1.27 1.27)
				)
				(hide yes)
			)
		)
		(property "Datasheet" "https://ngspice.sourceforge.io/docs/ngspice-html-manual/manual.xhtml#subsec_Circuit_elements__device"
			(at 130.81 73.66 0)
			(effects
				(font
					(size 1.27 1.27)
				)
				(hide yes)
			)
		)
		(property "Description" "0V reference potential for simulation"
			(at 130.81 71.12 0)
			(effects
				(font
					(size 1.27 1.27)
				)
				(hide yes)
			)
		)
		(pin "1"
			(uuid "f8be4373-01f4-4939-b7c3-543273c69cd0")
		)
		(instances
			(project "bn055-i2c-pcb"
				(path "/50215048-95b4-49b3-afd0-411b61ca84e1"
					(reference "#GND02")
					(unit 1)
				)
			)
		)
	)
	(symbol
		(lib_name "0_1")
		(lib_id "Simulation_SPICE:0")
		(at 121.92 88.9 0)
		(unit 1)
		(exclude_from_sim no)
		(in_bom yes)
		(on_board yes)
		(dnp no)
		(fields_autoplaced yes)
		(uuid "e72ee6bc-0df0-43f5-8047-891f8c8ef12b")
		(property "Reference" "#GND01"
			(at 121.92 91.44 0)
			(effects
				(font
					(size 1.27 1.27)
				)
				(hide yes)
			)
		)
		(property "Value" "0"
			(at 121.92 86.36 0)
			(effects
				(font
					(size 1.27 1.27)
				)
			)
		)
		(property "Footprint" ""
			(at 121.92 88.9 0)
			(effects
				(font
					(size 1.27 1.27)
				)
				(hide yes)
			)
		)
		(property "Datasheet" "https://ngspice.sourceforge.io/docs/ngspice-html-manual/manual.xhtml#subsec_Circuit_elements__device"
			(at 121.92 88.9 0)
			(effects
				(font
					(size 1.27 1.27)
				)
				(hide yes)
			)
		)
		(property "Description" "0V reference potential for simulation"
			(at 121.92 88.9 0)
			(effects
				(font
					(size 1.27 1.27)
				)
				(hide yes)
			)
		)
		(pin "1"
			(uuid "2d91a016-81d4-49d1-a426-6f59af48ba64")
		)
		(instances
			(project "bn055-i2c-pcb"
				(path "/50215048-95b4-49b3-afd0-411b61ca84e1"
					(reference "#GND01")
					(unit 1)
				)
			)
		)
	)
	(sheet_instances
		(path "/"
			(page "1")
		)
	)
)