{
  "project_info": {
    "project_number": "420021837988",
    "project_id": "rnnotification-21d32",
    "storage_bucket": "rnnotification-21d32.appspot.com"
  },
  "client": [
    {
      "client_info": {
        "mobilesdk_app_id": "1:420021837988:android:bee066d2c18f6a822f4631",
        "android_client_info": {
          "package_name": "com.accordapp"
        }
      },
      "oauth_client": [
        {
          "client_id": "420021837988-hruabverlsh3mi9l3srfd2lvr0ridqjh.apps.googleusercontent.com",
          "client_type": 3
        }
      ],
      "api_key": [
        {
          "current_key": "AIzaSyBcPZ-nHNmA9nuR1aCkNeiMN5SkuArL-Yg"
        }
      ],
      "services": {
        "appinvite_service": {
          "other_platform_oauth_client": [
            {
              "client_id": "420021837988-hruabverlsh3mi9l3srfd2lvr0ridqjh.apps.googleusercontent.com",
              "client_type": 3
            }
          ]
        }
      }
    }
  ],
  "configuration_version": "1"
}