{
    "55" : {
        "folder" : "5.5",
        "apache" : "php:5.5-apache",
        "fpm" : "php:5.5-fpm",
        "cli" : "php:5.5-cli",
        "repo" : "debian_jessie_source.list",
        "type": "STABLE"
    },
    "56" : {
        "folder" : "5.6",
        "apache" : "php:5.6-apache-stretch",
        "fpm" : "php:5.6-fpm-stretch",
        "cli" : "php:5.6-cli-stretch",
        "repo" : "debian_stretch_source.list",
        "type": "STABLE"
    },
    "70" : {
        "folder" : "7.0",
        "apache" : "php:7.0-apache-stretch",
        "fpm" : "php:7.0-fpm-stretch",
        "cli" : "php:7.0-cli-stretch",
        "repo" : "debian_stretch_source.list",
        "type": "STABLE"
    },
    "71" : {
        "folder" : "7.1",
        "apache" : "php:7.1-apache-buster",
        "fpm" : "php:7.1-fpm-buster",
        "cli" : "php:7.1-cli-buster",
        "repo" : "",
        "type": "STABLE"
    },
    "72" : {
        "folder" : "7.2",
        "apache" : "php:7.2-apache-buster",
        "fpm" : "php:7.2-fpm-buster",
        "cli" : "php:7.2-cli-buster",
        "repo" : "",
        "type": "STABLE"
    },
    "73" : {
        "folder" : "7.3",
        "apache" : "php:7.3-apache-bullseye",
        "fpm" : "php:7.3-fpm-bullseye",
        "cli" : "php:7.3-cli-bullseye",
        "repo" : "",
        "type": "STABLE"
    },
    "74" : {
        "folder" : "7.4",
        "apache" : "php:7.4-apache-bullseye",
        "fpm" : "php:7.4-fpm-bullseye",
        "cli" : "php:7.4-cli-bullseye",
        "repo" : "",
        "type": "STABLE"
    },
    "80" : {
        "folder" : "8.0",
        "apache" : "php:8.0-apache-bullseye",
        "fpm" : "php:8.0-fpm-bullseye",
        "cli" : "php:8.0-cli-bullseye",
        "repo" : "",
        "type": "STABLE"
    },
    "81" : {
        "folder" : "8.1",
        "apache" : "php:8.1-apache-bookworm",
        "fpm" : "php:8.1-fpm-bookworm",
        "cli" : "php:8.1-cli-bookworm",
        "repo" : "",
        "type": "STABLE"
    },
    "82" : {
        "folder" : "8.2",
        "apache" : "php:8.2-apache-bookworm",
        "fpm" : "php:8.2-fpm-bookworm",
        "cli" : "php:8.2-cli-bookworm",
        "repo" : "",
        "type": "STABLE"
    },
    "83" : {
        "folder" : "8.3",
        "apache" : "php:8.3-apache-bookworm",
        "fpm" : "php:8.3-fpm-bookworm",
        "cli" : "php:8.3-cli-bookworm",
        "repo" : "",
        "type" : "STABLE"
    },
    "84" : {
        "folder" : "8.4",
        "apache" : "php:8.4-rc-apache-bookworm",
        "fpm" : "php:8.4-rc-fpm-bookworm",
        "cli" : "php:8.4-rc-cli-bookworm",
        "repo" : "",
        "type" : "RC"
    }
}