HACK: cd to /tmp and call the runtime tests

72 jobs for master-tmp-runtime-tests in 4 minutes and 7 seconds (queued for 3 seconds)
latest
Status Name Job ID Coverage
  Test
passed check-DEVELOPERS #116014968

00:01:14

passed check-flake8 #116014969

00:01:49

failed check-gitlab-ci.yml #116014967

00:01:12

passed check-package #116014970

00:01:17

failed tests.boot.test_atf.TestATFAllwinner #116014971

00:01:10

failed tests.boot.test_atf.TestATFMarvell #116014972

00:01:13

failed tests.boot.test_atf.TestATFVexpress #116014973

00:01:12

failed tests.core.test_file_capabilities.TestFileCapabilities #116014974

00:01:08

failed tests.core.test_hardening.TestFortifyConserv #116014975

00:01:05

failed tests.core.test_hardening.TestFortifyNone #116014976

00:01:09

failed tests.core.test_hardening.TestRelro #116014977

00:01:12

failed tests.core.test_hardening.TestRelroPartial #116014978

00:01:11

failed tests.core.test_hardening.TestSspNone #116014979

00:01:04

failed tests.core.test_hardening.TestSspStrong #116014980

00:01:08

failed tests.core.test_post_scripts.TestPostScripts #116014981

00:01:12

failed tests.core.test_rootfs_overlay.TestRootfsOverlay #116014982

00:01:16

failed tests.core.test_timezone.TestGlibcAllTimezone #116014983

00:01:04

failed tests.core.test_timezone.TestGlibcNonDefaultLimitedTimezone #116014984

00:01:09

failed tests.core.test_timezone.TestNoTimezone #116014985

00:01:09

failed tests.fs.test_ext.TestExt2 #116014986

00:01:08

failed tests.fs.test_ext.TestExt2r1 #116014987

00:01:06

failed tests.fs.test_ext.TestExt3 #116014988

00:01:13

failed tests.fs.test_ext.TestExt4 #116014989

00:01:04

failed tests.fs.test_iso9660.TestIso9660Grub2External #116014990

00:01:10

failed tests.fs.test_iso9660.TestIso9660Grub2ExternalCompress #116014991

00:01:11

failed tests.fs.test_iso9660.TestIso9660Grub2Internal #116014992

00:01:12

failed tests.fs.test_iso9660.TestIso9660SyslinuxExternal #116014993

00:01:15

failed tests.fs.test_iso9660.TestIso9660SyslinuxExternalCompress #116014994

00:01:14

failed tests.fs.test_iso9660.TestIso9660SyslinuxInternal #116014995

00:01:08

failed tests.fs.test_jffs2.TestJffs2 #116014996

00:01:13

failed tests.fs.test_squashfs.TestSquashfs #116014997

00:01:12

failed tests.fs.test_ubi.TestUbi #116014998

00:01:13

failed tests.fs.test_yaffs2.TestYaffs2 #116014999

00:01:11

failed tests.init.test_busybox.TestInitSystemBusyboxRo #116015000

00:01:11

failed tests.init.test_busybox.TestInitSystemBusyboxRoNet #116015001

00:01:09

failed tests.init.test_busybox.TestInitSystemBusyboxRw #116015002

00:01:12

failed tests.init.test_busybox.TestInitSystemBusyboxRwNet #116015003

00:01:05

failed tests.init.test_none.TestInitSystemNone #116015004

00:01:05

failed tests.init.test_systemd.TestInitSystemSystemdRoFull #116015005

00:01:13

failed tests.init.test_systemd.TestInitSystemSystemdRoIfupdown #116015006

00:01:11

failed tests.init.test_systemd.TestInitSystemSystemdRoNetworkd #116015007

00:01:17

failed tests.init.test_systemd.TestInitSystemSystemdRwFull #116015008

00:01:07

failed tests.init.test_systemd.TestInitSystemSystemdRwIfupdown #116015009

00:01:05

failed tests.init.test_systemd.TestInitSystemSystemdRwNetworkd #116015010

00:01:11

failed tests.package.test_dropbear.TestDropbear #116015011

00:01:05

failed tests.package.test_ipython.TestIPythonPy2 #116015012

00:01:06

failed tests.package.test_ipython.TestIPythonPy3 #116015013

00:01:15

failed tests.package.test_python.TestPython2 #116015014

00:01:12

failed tests.package.test_python.TestPython3 #116015015

00:01:09

failed tests.package.test_python_autobahn.TestPythonPy2Autobahn #116015016

00:01:05

failed tests.package.test_python_autobahn.TestPythonPy3Autobahn #116015017

00:01:09

failed tests.package.test_python_cryptography.TestPythonPy2Cryptography #116015018

00:01:08

failed tests.package.test_python_cryptography.TestPythonPy3Cryptography #116015019

00:01:11

failed tests.package.test_python_incremental.TestPythonPy2Incremental #116015020

00:01:03

failed tests.package.test_python_incremental.TestPythonPy3Incremental #116015021

00:01:14

failed tests.package.test_python_twisted.TestPythonPy2Twisted #116015022

00:01:14

failed tests.package.test_python_twisted.TestPythonPy3Twisted #116015023

00:01:10

failed tests.package.test_python_txaio.TestPythonPy2Txaio #116015024

00:01:12

failed tests.package.test_python_txaio.TestPythonPy3Txaio #116015025

00:01:11

failed tests.package.test_python_txtorcon.TestPythonPy2Txtorcon #116015026

00:01:08

failed tests.package.test_python_txtorcon.TestPythonPy3Txtorcon #116015027

00:01:05

failed tests.package.test_rust.TestRust #116015028

00:01:03

failed tests.package.test_rust.TestRustBin #116015029

00:01:02

failed tests.package.test_syslog_ng.TestSyslogNg #116015030

00:01:12

failed tests.toolchain.test_external.TestExternalToolchainBuildrootMusl #116015031

00:01:08

failed tests.toolchain.test_external.TestExternalToolchainBuildrootuClibc #116015032

00:01:05

failed tests.toolchain.test_external.TestExternalToolchainCCache #116015033

00:01:02

failed tests.toolchain.test_external.TestExternalToolchainCtngMusl #116015034

00:01:04

failed tests.toolchain.test_external.TestExternalToolchainLinaroArm #116015035

00:01:02

failed tests.toolchain.test_external.TestExternalToolchainSourceryArmv4 #116015036

00:01:10

failed tests.toolchain.test_external.TestExternalToolchainSourceryArmv5 #116015037

00:01:12

failed tests.toolchain.test_external.TestExternalToolchainSourceryArmv7 #116015038

00:01:02

 
Name Stage Failure
failed
tests.toolchain.test_external.TestExternalToolchainSourceryArmv5 Test
Ran 1 test in 0.012s

FAILED (errors=1)
Uploading artifacts...
test-output/*.log: found 1 matching files
test-output/*/.config: found 1 matching files

WARNING: test-output/*/images/*: no matching files
Uploading artifacts to coordinator... ok
id=116015037 responseStatus=201 Created token=HN_vHs82
ERROR: Job failed: exit code 1
failed
tests.init.test_busybox.TestInitSystemBusyboxRoNet Test
Ran 1 test in 0.011s

FAILED (errors=1)
Uploading artifacts...
test-output/*.log: found 1 matching files
test-output/*/.config: found 1 matching files

WARNING: test-output/*/images/*: no matching files
Uploading artifacts to coordinator... ok
id=116015001 responseStatus=201 Created token=NCYNd9wb
ERROR: Job failed: exit code 1
failed
check-gitlab-ci.yml Test
     # runner will clean up those files for us.
# Multiply every emulator timeout by 10 to avoid sporadic failures in
# elastic runners.
- script: cd /tmp && ../builds/RicardoMartincoski/buildroot/support/testing/run-tests -o /builds/RicardoMartincoski/buildroot/test-output/ -d test-dl/ -k --timeout-multiplier 10 ${CI_JOB_NAME}
+ script: ./support/testing/run-tests -o test-output/ -d test-dl/ -k --timeout-multiplier 10 ${CI_JOB_NAME}
artifacts:
when: always
expire_in: 2 weeks
ERROR: Job failed: exit code 1
failed
tests.boot.test_atf.TestATFAllwinner Test
Ran 1 test in 0.011s

FAILED (errors=1)
Uploading artifacts...
test-output/*.log: found 1 matching files
test-output/*/.config: found 1 matching files

WARNING: test-output/*/images/*: no matching files
Uploading artifacts to coordinator... ok
id=116014971 responseStatus=201 Created token=Ha3xvVdm
ERROR: Job failed: exit code 1
failed
tests.boot.test_atf.TestATFMarvell Test
Ran 1 test in 0.010s

FAILED (errors=1)
Uploading artifacts...
test-output/*.log: found 1 matching files
test-output/*/.config: found 1 matching files

WARNING: test-output/*/images/*: no matching files
Uploading artifacts to coordinator... ok
id=116014972 responseStatus=201 Created token=EsuP63KM
ERROR: Job failed: exit code 1
failed
tests.boot.test_atf.TestATFVexpress Test
Ran 1 test in 0.015s

FAILED (errors=1)
Uploading artifacts...
test-output/*.log: found 1 matching files
test-output/*/.config: found 1 matching files

WARNING: test-output/*/images/*: no matching files
Uploading artifacts to coordinator... ok
id=116014973 responseStatus=201 Created token=Jv23a12M
ERROR: Job failed: exit code 1
failed
tests.core.test_file_capabilities.TestFileCapabilities Test
Ran 1 test in 0.011s

FAILED (errors=1)
Uploading artifacts...
test-output/*.log: found 1 matching files
test-output/*/.config: found 1 matching files

WARNING: test-output/*/images/*: no matching files
Uploading artifacts to coordinator... ok
id=116014974 responseStatus=201 Created token=7jR_K7WX
ERROR: Job failed: exit code 1
failed
tests.core.test_hardening.TestFortifyConserv Test
Ran 1 test in 0.011s

FAILED (errors=1)
Uploading artifacts...
test-output/*.log: found 1 matching files
test-output/*/.config: found 1 matching files

WARNING: test-output/*/images/*: no matching files
Uploading artifacts to coordinator... ok
id=116014975 responseStatus=201 Created token=y2gtPySj
ERROR: Job failed: exit code 1
failed
tests.core.test_hardening.TestFortifyNone Test
Ran 1 test in 0.011s

FAILED (errors=1)
Uploading artifacts...
test-output/*.log: found 1 matching files
test-output/*/.config: found 1 matching files

WARNING: test-output/*/images/*: no matching files
Uploading artifacts to coordinator... ok
id=116014976 responseStatus=201 Created token=WSdMU49c
ERROR: Job failed: exit code 1
failed
tests.core.test_hardening.TestRelro Test
Ran 1 test in 0.011s

FAILED (errors=1)
Uploading artifacts...
test-output/*.log: found 1 matching files
test-output/*/.config: found 1 matching files

WARNING: test-output/*/images/*: no matching files
Uploading artifacts to coordinator... ok
id=116014977 responseStatus=201 Created token=GQMPnxqy
ERROR: Job failed: exit code 1
failed
tests.core.test_hardening.TestRelroPartial Test
Ran 1 test in 0.011s

FAILED (errors=1)
Uploading artifacts...
test-output/*.log: found 1 matching files
test-output/*/.config: found 1 matching files

WARNING: test-output/*/images/*: no matching files
Uploading artifacts to coordinator... ok
id=116014978 responseStatus=201 Created token=_pd3LMx1
ERROR: Job failed: exit code 1
failed
tests.core.test_hardening.TestSspNone Test
Ran 1 test in 0.021s

FAILED (errors=1)
Uploading artifacts...
test-output/*.log: found 1 matching files
test-output/*/.config: found 1 matching files

WARNING: test-output/*/images/*: no matching files
Uploading artifacts to coordinator... ok
id=116014979 responseStatus=201 Created token=3rqEF8j7
ERROR: Job failed: exit code 1
failed
tests.core.test_hardening.TestSspStrong Test
Ran 1 test in 0.010s

FAILED (errors=1)
Uploading artifacts...
test-output/*.log: found 1 matching files
test-output/*/.config: found 1 matching files

WARNING: test-output/*/images/*: no matching files
Uploading artifacts to coordinator... ok
id=116014980 responseStatus=201 Created token=B6VyUi53
ERROR: Job failed: exit code 1
failed
tests.core.test_rootfs_overlay.TestRootfsOverlay Test
Ran 1 test in 0.012s

FAILED (errors=1)
Uploading artifacts...
test-output/*.log: found 1 matching files
test-output/*/.config: found 1 matching files

WARNING: test-output/*/images/*: no matching files
Uploading artifacts to coordinator... ok
id=116014982 responseStatus=201 Created token=rEnBshYm
ERROR: Job failed: exit code 1
failed
tests.core.test_timezone.TestGlibcAllTimezone Test
Ran 1 test in 0.011s

FAILED (errors=1)
Uploading artifacts...
test-output/*.log: found 1 matching files
test-output/*/.config: found 1 matching files

WARNING: test-output/*/images/*: no matching files
Uploading artifacts to coordinator... ok
id=116014983 responseStatus=201 Created token=6_ekZq34
ERROR: Job failed: exit code 1
failed
tests.core.test_timezone.TestGlibcNonDefaultLimitedTimezone Test
Ran 1 test in 0.011s

FAILED (errors=1)
Uploading artifacts...
test-output/*.log: found 1 matching files
test-output/*/.config: found 1 matching files

WARNING: test-output/*/images/*: no matching files
Uploading artifacts to coordinator... ok
id=116014984 responseStatus=201 Created token=bxUt-ZaC
ERROR: Job failed: exit code 1
failed
tests.core.test_timezone.TestNoTimezone Test
Ran 1 test in 0.011s

FAILED (errors=1)
Uploading artifacts...
test-output/*.log: found 1 matching files
test-output/*/.config: found 1 matching files

WARNING: test-output/*/images/*: no matching files
Uploading artifacts to coordinator... ok
id=116014985 responseStatus=201 Created token=3qWp9yGp
ERROR: Job failed: exit code 1
failed
tests.fs.test_ext.TestExt2 Test
Ran 1 test in 0.011s

FAILED (errors=1)
Uploading artifacts...
test-output/*.log: found 1 matching files
test-output/*/.config: found 1 matching files

WARNING: test-output/*/images/*: no matching files
Uploading artifacts to coordinator... ok
id=116014986 responseStatus=201 Created token=zUhj-kvi
ERROR: Job failed: exit code 1
failed
tests.fs.test_ext.TestExt2r1 Test
Ran 1 test in 0.012s

FAILED (errors=1)
Uploading artifacts...
test-output/*.log: found 1 matching files
test-output/*/.config: found 1 matching files

WARNING: test-output/*/images/*: no matching files
Uploading artifacts to coordinator... ok
id=116014987 responseStatus=201 Created token=zw5JjuV6
ERROR: Job failed: exit code 1
failed
tests.fs.test_ext.TestExt3 Test
Ran 1 test in 0.012s

FAILED (errors=1)
Uploading artifacts...
test-output/*.log: found 1 matching files
test-output/*/.config: found 1 matching files

WARNING: test-output/*/images/*: no matching files
Uploading artifacts to coordinator... ok
id=116014988 responseStatus=201 Created token=r_pCqw8q
ERROR: Job failed: exit code 1
failed
tests.fs.test_ext.TestExt4 Test
Ran 1 test in 0.011s

FAILED (errors=1)
Uploading artifacts...
test-output/*.log: found 1 matching files
test-output/*/.config: found 1 matching files

WARNING: test-output/*/images/*: no matching files
Uploading artifacts to coordinator... ok
id=116014989 responseStatus=201 Created token=NsAs6UF3
ERROR: Job failed: exit code 1
failed
tests.fs.test_iso9660.TestIso9660Grub2ExternalCompress Test
Ran 1 test in 0.011s

FAILED (errors=1)
Uploading artifacts...
test-output/*.log: found 1 matching files
test-output/*/.config: found 1 matching files

WARNING: test-output/*/images/*: no matching files
Uploading artifacts to coordinator... ok
id=116014991 responseStatus=201 Created token=ZykgiMik
ERROR: Job failed: exit code 1
failed
tests.fs.test_iso9660.TestIso9660Grub2Internal Test
Ran 1 test in 0.011s

FAILED (errors=1)
Uploading artifacts...
test-output/*.log: found 1 matching files
test-output/*/.config: found 1 matching files

WARNING: test-output/*/images/*: no matching files
Uploading artifacts to coordinator... ok
id=116014992 responseStatus=201 Created token=YxBiCrbh
ERROR: Job failed: exit code 1
failed
tests.fs.test_iso9660.TestIso9660SyslinuxExternal Test
Ran 1 test in 0.012s

FAILED (errors=1)
Uploading artifacts...
test-output/*.log: found 1 matching files
test-output/*/.config: found 1 matching files

WARNING: test-output/*/images/*: no matching files
Uploading artifacts to coordinator... ok
id=116014993 responseStatus=201 Created token=Bdy42Zus
ERROR: Job failed: exit code 1
failed
tests.fs.test_iso9660.TestIso9660SyslinuxExternalCompress Test
Ran 1 test in 0.010s

FAILED (errors=1)
Uploading artifacts...
test-output/*.log: found 1 matching files
test-output/*/.config: found 1 matching files

WARNING: test-output/*/images/*: no matching files
Uploading artifacts to coordinator... ok
id=116014994 responseStatus=201 Created token=sjTtBxSp
ERROR: Job failed: exit code 1
failed
tests.fs.test_iso9660.TestIso9660SyslinuxInternal Test
Ran 1 test in 0.012s

FAILED (errors=1)
Uploading artifacts...
test-output/*.log: found 1 matching files
test-output/*/.config: found 1 matching files

WARNING: test-output/*/images/*: no matching files
Uploading artifacts to coordinator... ok
id=116014995 responseStatus=201 Created token=V6miorBr
ERROR: Job failed: exit code 1
failed
tests.fs.test_jffs2.TestJffs2 Test
Ran 1 test in 0.010s

FAILED (errors=1)
Uploading artifacts...
test-output/*.log: found 1 matching files
test-output/*/.config: found 1 matching files

WARNING: test-output/*/images/*: no matching files
Uploading artifacts to coordinator... ok
id=116014996 responseStatus=201 Created token=SRZ_sUxk
ERROR: Job failed: exit code 1
failed
tests.fs.test_squashfs.TestSquashfs Test
Ran 1 test in 0.012s

FAILED (errors=1)
Uploading artifacts...
test-output/*.log: found 1 matching files
test-output/*/.config: found 1 matching files

WARNING: test-output/*/images/*: no matching files
Uploading artifacts to coordinator... ok
id=116014997 responseStatus=201 Created token=pCpAEBuE
ERROR: Job failed: exit code 1
failed
tests.fs.test_ubi.TestUbi Test
Ran 1 test in 0.011s

FAILED (errors=1)
Uploading artifacts...
test-output/*.log: found 1 matching files
test-output/*/.config: found 1 matching files

WARNING: test-output/*/images/*: no matching files
Uploading artifacts to coordinator... ok
id=116014998 responseStatus=201 Created token=iJsR83xJ
ERROR: Job failed: exit code 1
failed
tests.fs.test_yaffs2.TestYaffs2 Test
Ran 1 test in 0.012s

FAILED (errors=1)
Uploading artifacts...
test-output/*.log: found 1 matching files
test-output/*/.config: found 1 matching files

WARNING: test-output/*/images/*: no matching files
Uploading artifacts to coordinator... ok
id=116014999 responseStatus=201 Created token=7QHfxJC5
ERROR: Job failed: exit code 1
failed
tests.init.test_busybox.TestInitSystemBusyboxRw Test
Ran 1 test in 0.011s

FAILED (errors=1)
Uploading artifacts...
test-output/*.log: found 1 matching files
test-output/*/.config: found 1 matching files

WARNING: test-output/*/images/*: no matching files
Uploading artifacts to coordinator... ok
id=116015002 responseStatus=201 Created token=zqqAWRLA
ERROR: Job failed: exit code 1
failed
tests.init.test_busybox.TestInitSystemBusyboxRwNet Test
Ran 1 test in 0.012s

FAILED (errors=1)
Uploading artifacts...
test-output/*.log: found 1 matching files
test-output/*/.config: found 1 matching files

WARNING: test-output/*/images/*: no matching files
Uploading artifacts to coordinator... ok
id=116015003 responseStatus=201 Created token=QXkK1Mmm
ERROR: Job failed: exit code 1
failed
tests.init.test_none.TestInitSystemNone Test
Ran 1 test in 0.010s

FAILED (errors=1)
Uploading artifacts...
test-output/*.log: found 1 matching files
test-output/*/.config: found 1 matching files

WARNING: test-output/*/images/*: no matching files
Uploading artifacts to coordinator... ok
id=116015004 responseStatus=201 Created token=ZPups_kP
ERROR: Job failed: exit code 1
failed
tests.init.test_systemd.TestInitSystemSystemdRoFull Test
Ran 1 test in 0.012s

FAILED (errors=1)
Uploading artifacts...
test-output/*.log: found 1 matching files
test-output/*/.config: found 1 matching files

WARNING: test-output/*/images/*: no matching files
Uploading artifacts to coordinator... ok
id=116015005 responseStatus=201 Created token=YTCAfx6z
ERROR: Job failed: exit code 1
failed
tests.init.test_systemd.TestInitSystemSystemdRoIfupdown Test
Ran 1 test in 0.013s

FAILED (errors=1)
Uploading artifacts...
test-output/*.log: found 1 matching files
test-output/*/.config: found 1 matching files

WARNING: test-output/*/images/*: no matching files
Uploading artifacts to coordinator... ok
id=116015006 responseStatus=201 Created token=ADrY8gBi
ERROR: Job failed: exit code 1
failed
tests.init.test_systemd.TestInitSystemSystemdRoNetworkd Test
Ran 1 test in 0.012s

FAILED (errors=1)
Uploading artifacts...
test-output/*.log: found 1 matching files
test-output/*/.config: found 1 matching files

WARNING: test-output/*/images/*: no matching files
Uploading artifacts to coordinator... ok
id=116015007 responseStatus=201 Created token=zb1QaBw9
ERROR: Job failed: exit code 1
failed
tests.init.test_systemd.TestInitSystemSystemdRwFull Test
Ran 1 test in 0.011s

FAILED (errors=1)
Uploading artifacts...
test-output/*.log: found 1 matching files
test-output/*/.config: found 1 matching files

WARNING: test-output/*/images/*: no matching files
Uploading artifacts to coordinator... ok
id=116015008 responseStatus=201 Created token=cLf3EzKw
ERROR: Job failed: exit code 1
failed
tests.init.test_systemd.TestInitSystemSystemdRwIfupdown Test
Ran 1 test in 0.011s

FAILED (errors=1)
Uploading artifacts...
test-output/*.log: found 1 matching files
test-output/*/.config: found 1 matching files

WARNING: test-output/*/images/*: no matching files
Uploading artifacts to coordinator... ok
id=116015009 responseStatus=201 Created token=3boyKsEv
ERROR: Job failed: exit code 1
failed
tests.package.test_dropbear.TestDropbear Test
Ran 1 test in 0.011s

FAILED (errors=1)
Uploading artifacts...
test-output/*.log: found 1 matching files
test-output/*/.config: found 1 matching files

WARNING: test-output/*/images/*: no matching files
Uploading artifacts to coordinator... ok
id=116015011 responseStatus=201 Created token=U1Hr3ADQ
ERROR: Job failed: exit code 1
failed
tests.package.test_ipython.TestIPythonPy2 Test
Ran 1 test in 0.010s

FAILED (errors=1)
Uploading artifacts...
test-output/*.log: found 1 matching files
test-output/*/.config: found 1 matching files

WARNING: test-output/*/images/*: no matching files
Uploading artifacts to coordinator... ok
id=116015012 responseStatus=201 Created token=BAixK1aE
ERROR: Job failed: exit code 1
failed
tests.package.test_ipython.TestIPythonPy3 Test
Ran 1 test in 0.012s

FAILED (errors=1)
Uploading artifacts...
test-output/*.log: found 1 matching files
test-output/*/.config: found 1 matching files

WARNING: test-output/*/images/*: no matching files
Uploading artifacts to coordinator... ok
id=116015013 responseStatus=201 Created token=fvByZSTd
ERROR: Job failed: exit code 1
failed
tests.package.test_python.TestPython2 Test
Ran 1 test in 0.011s

FAILED (errors=1)
Uploading artifacts...
test-output/*.log: found 1 matching files
test-output/*/.config: found 1 matching files

WARNING: test-output/*/images/*: no matching files
Uploading artifacts to coordinator... ok
id=116015014 responseStatus=201 Created token=A8-sx1aL
ERROR: Job failed: exit code 1
failed
tests.package.test_python.TestPython3 Test
Ran 1 test in 0.011s

FAILED (errors=1)
Uploading artifacts...
test-output/*.log: found 1 matching files
test-output/*/.config: found 1 matching files

WARNING: test-output/*/images/*: no matching files
Uploading artifacts to coordinator... ok
id=116015015 responseStatus=201 Created token=sUnvc6TG
ERROR: Job failed: exit code 1
failed
tests.package.test_python_autobahn.TestPythonPy2Autobahn Test
Ran 1 test in 0.010s

FAILED (errors=1)
Uploading artifacts...
test-output/*.log: found 1 matching files
test-output/*/.config: found 1 matching files

WARNING: test-output/*/images/*: no matching files
Uploading artifacts to coordinator... ok
id=116015016 responseStatus=201 Created token=Jc8wjgRH
ERROR: Job failed: exit code 1
failed
tests.package.test_python_autobahn.TestPythonPy3Autobahn Test
Ran 1 test in 0.010s

FAILED (errors=1)
Uploading artifacts...
test-output/*.log: found 1 matching files
test-output/*/.config: found 1 matching files

WARNING: test-output/*/images/*: no matching files
Uploading artifacts to coordinator... ok
id=116015017 responseStatus=201 Created token=Qjx_1JsD
ERROR: Job failed: exit code 1
failed
tests.package.test_python_cryptography.TestPythonPy2Cryptography Test
Ran 1 test in 0.010s

FAILED (errors=1)
Uploading artifacts...
test-output/*.log: found 1 matching files
test-output/*/.config: found 1 matching files

WARNING: test-output/*/images/*: no matching files
Uploading artifacts to coordinator... ok
id=116015018 responseStatus=201 Created token=QP8RQv_q
ERROR: Job failed: exit code 1
failed
tests.package.test_python_incremental.TestPythonPy3Incremental Test
Ran 1 test in 0.012s

FAILED (errors=1)
Uploading artifacts...
test-output/*.log: found 1 matching files
test-output/*/.config: found 1 matching files

WARNING: test-output/*/images/*: no matching files
Uploading artifacts to coordinator... ok
id=116015021 responseStatus=201 Created token=U4tfz-9n
ERROR: Job failed: exit code 1
failed
tests.package.test_python_twisted.TestPythonPy2Twisted Test
FAILED (errors=1)
Uploading artifacts...
test-output/*.log: found 1 matching files
test-output/*/.config: found 1 matching files

WARNING: test-output/*/images/*: no matching files
WARNING: Uploading artifacts to coordinator... failed id=116015022 responseStatus=500 Internal Server Error status=500 Internal Server Error token=1HYsuizL
WARNING: Retrying...
Uploading artifacts to coordinator... ok
id=116015022 responseStatus=201 Created token=1HYsuizL
ERROR: Job failed: exit code 1
failed
tests.package.test_python_twisted.TestPythonPy3Twisted Test
Ran 1 test in 0.010s

FAILED (errors=1)
Uploading artifacts...
test-output/*.log: found 1 matching files
test-output/*/.config: found 1 matching files

WARNING: test-output/*/images/*: no matching files
Uploading artifacts to coordinator... ok
id=116015023 responseStatus=201 Created token=XgjsXXpg
ERROR: Job failed: exit code 1
failed
tests.package.test_python_txaio.TestPythonPy2Txaio Test
Ran 1 test in 0.011s

FAILED (errors=1)
Uploading artifacts...
test-output/*.log: found 1 matching files
test-output/*/.config: found 1 matching files

WARNING: test-output/*/images/*: no matching files
Uploading artifacts to coordinator... ok
id=116015024 responseStatus=201 Created token=qAHZ6Pom
ERROR: Job failed: exit code 1
failed
tests.package.test_python_txaio.TestPythonPy3Txaio Test
Ran 1 test in 0.010s

FAILED (errors=1)
Uploading artifacts...
test-output/*.log: found 1 matching files
test-output/*/.config: found 1 matching files

WARNING: test-output/*/images/*: no matching files
Uploading artifacts to coordinator... ok
id=116015025 responseStatus=201 Created token=N8Qr6agN
ERROR: Job failed: exit code 1
failed
tests.package.test_python_txtorcon.TestPythonPy2Txtorcon Test
Ran 1 test in 0.013s

FAILED (errors=1)
Uploading artifacts...
test-output/*.log: found 1 matching files
test-output/*/.config: found 1 matching files

WARNING: test-output/*/images/*: no matching files
Uploading artifacts to coordinator... ok
id=116015026 responseStatus=201 Created token=GxQxHK5P
ERROR: Job failed: exit code 1
failed
tests.package.test_python_txtorcon.TestPythonPy3Txtorcon Test
Ran 1 test in 0.013s

FAILED (errors=1)
Uploading artifacts...
test-output/*.log: found 1 matching files
test-output/*/.config: found 1 matching files

WARNING: test-output/*/images/*: no matching files
Uploading artifacts to coordinator... ok
id=116015027 responseStatus=201 Created token=SWd14xEV
ERROR: Job failed: exit code 1
failed
tests.package.test_rust.TestRust Test
Ran 1 test in 0.011s

FAILED (errors=1)
Uploading artifacts...
test-output/*.log: found 1 matching files
test-output/*/.config: found 1 matching files

WARNING: test-output/*/images/*: no matching files
Uploading artifacts to coordinator... ok
id=116015028 responseStatus=201 Created token=cqf2d58Z
ERROR: Job failed: exit code 1
failed
tests.package.test_rust.TestRustBin Test
Ran 1 test in 0.012s

FAILED (errors=1)
Uploading artifacts...
test-output/*.log: found 1 matching files
test-output/*/.config: found 1 matching files

WARNING: test-output/*/images/*: no matching files
Uploading artifacts to coordinator... ok
id=116015029 responseStatus=201 Created token=Fq52ccST
ERROR: Job failed: exit code 1
failed
tests.package.test_syslog_ng.TestSyslogNg Test
Ran 1 test in 0.011s

FAILED (errors=1)
Uploading artifacts...
test-output/*.log: found 1 matching files
test-output/*/.config: found 1 matching files

WARNING: test-output/*/images/*: no matching files
Uploading artifacts to coordinator... ok
id=116015030 responseStatus=201 Created token=etVzNEqj
ERROR: Job failed: exit code 1
failed
tests.toolchain.test_external.TestExternalToolchainBuildrootMusl Test
Ran 1 test in 0.012s

FAILED (errors=1)
Uploading artifacts...
test-output/*.log: found 1 matching files
test-output/*/.config: found 1 matching files

WARNING: test-output/*/images/*: no matching files
Uploading artifacts to coordinator... ok
id=116015031 responseStatus=201 Created token=geoxXnE2
ERROR: Job failed: exit code 1
failed
tests.toolchain.test_external.TestExternalToolchainBuildrootuClibc Test
Ran 1 test in 0.011s

FAILED (errors=1)
Uploading artifacts...
test-output/*.log: found 1 matching files
test-output/*/.config: found 1 matching files

WARNING: test-output/*/images/*: no matching files
Uploading artifacts to coordinator... ok
id=116015032 responseStatus=201 Created token=sHkusN1r
ERROR: Job failed: exit code 1
failed
tests.toolchain.test_external.TestExternalToolchainCCache Test
Ran 1 test in 0.011s

FAILED (errors=1)
Uploading artifacts...
test-output/*.log: found 1 matching files
test-output/*/.config: found 1 matching files

WARNING: test-output/*/images/*: no matching files
Uploading artifacts to coordinator... ok
id=116015033 responseStatus=201 Created token=WexMenXb
ERROR: Job failed: exit code 1
failed
tests.toolchain.test_external.TestExternalToolchainLinaroArm Test
Ran 1 test in 0.011s

FAILED (errors=1)
Uploading artifacts...
test-output/*.log: found 1 matching files
test-output/*/.config: found 1 matching files

WARNING: test-output/*/images/*: no matching files
Uploading artifacts to coordinator... ok
id=116015035 responseStatus=201 Created token=zNLi1Ffd
ERROR: Job failed: exit code 1
failed
tests.package.test_python_incremental.TestPythonPy2Incremental Test
Ran 1 test in 0.012s

FAILED (errors=1)
Uploading artifacts...
test-output/*.log: found 1 matching files
test-output/*/.config: found 1 matching files

WARNING: test-output/*/images/*: no matching files
Uploading artifacts to coordinator... ok
id=116015020 responseStatus=201 Created token=dnhujGwu
ERROR: Job failed: exit code 1
failed
tests.toolchain.test_external.TestExternalToolchainCtngMusl Test
Ran 1 test in 0.012s

FAILED (errors=1)
Uploading artifacts...
test-output/*.log: found 1 matching files
test-output/*/.config: found 1 matching files

WARNING: test-output/*/images/*: no matching files
Uploading artifacts to coordinator... ok
id=116015034 responseStatus=201 Created token=1QGCGicm
ERROR: Job failed: exit code 1
failed
tests.toolchain.test_external.TestExternalToolchainSourceryArmv4 Test
Ran 1 test in 0.012s

FAILED (errors=1)
Uploading artifacts...
test-output/*.log: found 1 matching files
test-output/*/.config: found 1 matching files

WARNING: test-output/*/images/*: no matching files
Uploading artifacts to coordinator... ok
id=116015036 responseStatus=201 Created token=4ztUVtPr
ERROR: Job failed: exit code 1
failed
tests.init.test_busybox.TestInitSystemBusyboxRo Test
Ran 1 test in 0.013s

FAILED (errors=1)
Uploading artifacts...
test-output/*.log: found 1 matching files
test-output/*/.config: found 1 matching files

WARNING: test-output/*/images/*: no matching files
Uploading artifacts to coordinator... ok
id=116015000 responseStatus=201 Created token=rFvCVqx6
ERROR: Job failed: exit code 1
failed
tests.package.test_python_cryptography.TestPythonPy3Cryptography Test
Ran 1 test in 0.010s

FAILED (errors=1)
Uploading artifacts...
test-output/*.log: found 1 matching files
test-output/*/.config: found 1 matching files

WARNING: test-output/*/images/*: no matching files
Uploading artifacts to coordinator... ok
id=116015019 responseStatus=201 Created token=LbbjvVfX
ERROR: Job failed: exit code 1
failed
tests.fs.test_iso9660.TestIso9660Grub2External Test
Ran 1 test in 0.012s

FAILED (errors=1)
Uploading artifacts...
test-output/*.log: found 1 matching files
test-output/*/.config: found 1 matching files

WARNING: test-output/*/images/*: no matching files
Uploading artifacts to coordinator... ok
id=116014990 responseStatus=201 Created token=bPVTgJ-8
ERROR: Job failed: exit code 1
failed
tests.core.test_post_scripts.TestPostScripts Test
Ran 1 test in 0.012s

FAILED (errors=1)
Uploading artifacts...
test-output/*.log: found 1 matching files
test-output/*/.config: found 1 matching files

WARNING: test-output/*/images/*: no matching files
Uploading artifacts to coordinator... ok
id=116014981 responseStatus=201 Created token=xgAgkBo9
ERROR: Job failed: exit code 1
failed
tests.toolchain.test_external.TestExternalToolchainSourceryArmv7 Test
Ran 1 test in 0.010s

FAILED (errors=1)
Uploading artifacts...
test-output/*.log: found 1 matching files
test-output/*/.config: found 1 matching files

WARNING: test-output/*/images/*: no matching files
Uploading artifacts to coordinator... ok
id=116015038 responseStatus=201 Created token=Pxs2rWeM
ERROR: Job failed: exit code 1
failed
tests.init.test_systemd.TestInitSystemSystemdRwNetworkd Test
Ran 1 test in 0.013s

FAILED (errors=1)
Uploading artifacts...
test-output/*.log: found 1 matching files
test-output/*/.config: found 1 matching files

WARNING: test-output/*/images/*: no matching files
Uploading artifacts to coordinator... ok
id=116015010 responseStatus=201 Created token=R7szsZDf
ERROR: Job failed: exit code 1