{
    "name": "com.rhinox.npoi.openxmlformats",
    "references": [
        "GUID:7624da8af76f5554fbbea032f0e72b82"
    ],
    "includePlatforms": [
        "Editor",
        "WSA",
        "WindowsStandalone32",
        "WindowsStandalone64",
		"Android"
    ],
    "excludePlatforms": [],
    "allowUnsafeCode": false,
    "overrideReferences": false,
    "precompiledReferences": [],
    "autoReferenced": true,
    "defineConstraints": [],
    "versionDefines": [],
    "noEngineReferences": false
}