﻿627412
بانک اقتصاد نوین
627381
بانک انصار
505785
بانک ایران‌زمین
622106
بانک پارسیان
639194
بانک پارسیان
627884
بانک پارسیان
502229
بانک پاسارگاد
639347
بانک پاسارگاد
636214
بانک آینده
627353
بانک تجارت
502938
بانک دی
589463
بانک رفاه‌کارگران
621986
بانک سامان
589210
بانک سپه
639607
بانک سرمایه
639346
بانک سینا
502806
بانک شهر
603769
بانک صادرات‌ایران
627961
بانک صنعت و معدن
606373
بانک قرض‌الحسنه مهر
639599
بانک قوامین
627488
بانک کارآفرین
502910
بانک کارآفرین
603770
بانک کشاورزی
639217
بانک کشاورزی
505416
بانک گردشگری
628023
بانک مسکن
610433
بانک ملت
991975
بانک ملت
603799
بانک ملی ایران
639370
بانک مهراقتصاد
627760
پست‌بانک ایران