module gitlab.com/RedSerenity/CoreDns/MultiFilter/coredns

go 1.22

toolchain go1.22.1

require (
	github.com/coredns/coredns v1.11.2
	gitlab.com/RedSerenity/CoreDns/MultiFilter v1.0.5
)

require (
	cloud.google.com/go/compute v1.24.0 // indirect
	cloud.google.com/go/compute/metadata v0.2.3 // indirect
	github.com/Azure/azure-sdk-for-go v68.0.0+incompatible // indirect
	github.com/Azure/go-autorest v14.2.0+incompatible // indirect
	github.com/Azure/go-autorest/autorest v0.11.29 // indirect
	github.com/Azure/go-autorest/autorest/adal v0.9.22 // indirect
	github.com/Azure/go-autorest/autorest/azure/auth v0.5.12 // indirect
	github.com/Azure/go-autorest/autorest/azure/cli v0.4.5 // indirect
	github.com/Azure/go-autorest/autorest/date v0.3.0 // indirect
	github.com/Azure/go-autorest/autorest/to v0.2.0 // indirect
	github.com/Azure/go-autorest/logger v0.2.1 // indirect
	github.com/Azure/go-autorest/tracing v0.6.0 // indirect
	github.com/DataDog/appsec-internal-go v1.0.0 // indirect
	github.com/DataDog/datadog-agent/pkg/obfuscate v0.48.0 // indirect
	github.com/DataDog/datadog-agent/pkg/remoteconfig/state v0.48.1 // indirect
	github.com/DataDog/datadog-go/v5 v5.3.0 // indirect
	github.com/DataDog/go-libddwaf v1.5.0 // indirect
	github.com/DataDog/go-tuf v1.0.2-0.5.2 // indirect
	github.com/DataDog/sketches-go v1.4.2 // indirect
	github.com/Microsoft/go-winio v0.6.1 // indirect
	github.com/antonmedv/expr v1.15.5 // indirect
	github.com/apparentlymart/go-cidr v1.1.0 // indirect
	github.com/aws/aws-sdk-go v1.50.10 // indirect
	github.com/beorn7/perks v1.0.1 // indirect
	github.com/cespare/xxhash/v2 v2.3.0 // indirect
	github.com/coredns/caddy v1.1.1 // indirect
	github.com/coreos/go-semver v0.3.0 // indirect
	github.com/coreos/go-systemd/v22 v22.3.2 // indirect
	github.com/davecgh/go-spew v1.1.2-0.20180830191138-d8f796af33cc // indirect
	github.com/dimchansky/utfbom v1.1.1 // indirect
	github.com/dnstap/golang-dnstap v0.4.0 // indirect
	github.com/dustin/go-humanize v1.0.1 // indirect
	github.com/ebitengine/purego v0.5.0-alpha.1 // indirect
	github.com/emicklei/go-restful/v3 v3.11.0 // indirect
	github.com/farsightsec/golang-framestream v0.3.0 // indirect
	github.com/felixge/httpsnoop v1.0.4 // indirect
	github.com/flynn/go-shlex v0.0.0-20150515145356-3f9db97f8568 // indirect
	github.com/go-logr/logr v1.4.1 // indirect
	github.com/go-logr/stdr v1.2.2 // indirect
	github.com/go-openapi/jsonpointer v0.19.6 // indirect
	github.com/go-openapi/jsonreference v0.20.2 // indirect
	github.com/go-openapi/swag v0.22.3 // indirect
	github.com/go-task/slim-sprig v0.0.0-20230315185526-52ccab3ef572 // indirect
	github.com/gogo/protobuf v1.3.2 // indirect
	github.com/golang-jwt/jwt/v4 v4.5.0 // indirect
	github.com/golang/groupcache v0.0.0-20210331224755-41bb18bfe9da // indirect
	github.com/golang/protobuf v1.5.4 // indirect
	github.com/google/gnostic-models v0.6.8 // indirect
	github.com/google/go-cmp v0.6.0 // indirect
	github.com/google/gofuzz v1.2.0 // indirect
	github.com/google/pprof v0.0.0-20240415144954-be81aee2d733 // indirect
	github.com/google/s2a-go v0.1.7 // indirect
	github.com/google/uuid v1.6.0 // indirect
	github.com/googleapis/enterprise-certificate-proxy v0.3.2 // indirect
	github.com/googleapis/gax-go/v2 v2.12.0 // indirect
	github.com/grpc-ecosystem/grpc-opentracing v0.0.0-20180507213350-8e809c8a8645 // indirect
	github.com/imdario/mergo v0.3.12 // indirect
	github.com/infobloxopen/go-trees v0.0.0-20200715205103-96a057b8dfb9 // indirect
	github.com/jmespath/go-jmespath v0.4.0 // indirect
	github.com/josharian/intern v1.0.0 // indirect
	github.com/json-iterator/go v1.1.12 // indirect
	github.com/mailru/easyjson v0.7.7 // indirect
	github.com/matttproud/golang_protobuf_extensions v1.0.4 // indirect
	github.com/miekg/dns v1.1.58 // indirect
	github.com/mitchellh/go-homedir v1.1.0 // indirect
	github.com/modern-go/concurrent v0.0.0-20180306012644-bacd9c7ef1dd // indirect
	github.com/modern-go/reflect2 v1.0.2 // indirect
	github.com/munnerz/goautoneg v0.0.0-20191010083416-a7dc8b61c822 // indirect
	github.com/onsi/ginkgo/v2 v2.17.1 // indirect
	github.com/opentracing-contrib/go-observer v0.0.0-20170622124052-a52f23424492 // indirect
	github.com/opentracing/opentracing-go v1.2.0 // indirect
	github.com/openzipkin-contrib/zipkin-go-opentracing v0.5.0 // indirect
	github.com/openzipkin/zipkin-go v0.4.2 // indirect
	github.com/oschwald/geoip2-golang v1.9.0 // indirect
	github.com/oschwald/maxminddb-golang v1.11.0 // indirect
	github.com/outcaste-io/ristretto v0.2.3 // indirect
	github.com/philhofer/fwd v1.1.2 // indirect
	github.com/pkg/errors v0.9.1 // indirect
	github.com/prometheus/client_golang v1.19.0 // indirect
	github.com/prometheus/client_model v0.6.1 // indirect
	github.com/prometheus/common v0.52.3 // indirect
	github.com/prometheus/procfs v0.13.0 // indirect
	github.com/quic-go/quic-go v0.42.0 // indirect
	github.com/secure-systems-lab/go-securesystemslib v0.7.0 // indirect
	github.com/spf13/pflag v1.0.5 // indirect
	github.com/tinylib/msgp v1.1.8 // indirect
	go.etcd.io/etcd/api/v3 v3.5.12 // indirect
	go.etcd.io/etcd/client/pkg/v3 v3.5.11 // indirect
	go.etcd.io/etcd/client/v3 v3.5.11 // indirect
	go.opencensus.io v0.24.0 // indirect
	go.opentelemetry.io/contrib/instrumentation/net/http/otelhttp v0.47.0 // indirect
	go.opentelemetry.io/otel v1.22.0 // indirect
	go.opentelemetry.io/otel/metric v1.22.0 // indirect
	go.opentelemetry.io/otel/trace v1.22.0 // indirect
	go.uber.org/atomic v1.11.0 // indirect
	go.uber.org/mock v0.4.0 // indirect
	go.uber.org/multierr v1.6.0 // indirect
	go.uber.org/zap v1.17.0 // indirect
	go4.org/intern v0.0.0-20230525184215-6c62f75575cb // indirect
	go4.org/unsafe/assume-no-moving-gc v0.0.0-20230525183740-e7c30c78aeb2 // indirect
	golang.org/x/crypto v0.22.0 // indirect
	golang.org/x/exp v0.0.0-20240409090435-93d18d7e34b8 // indirect
	golang.org/x/mod v0.17.0 // indirect
	golang.org/x/net v0.24.0 // indirect
	golang.org/x/oauth2 v0.18.0 // indirect
	golang.org/x/sync v0.7.0 // indirect
	golang.org/x/sys v0.19.0 // indirect
	golang.org/x/term v0.19.0 // indirect
	golang.org/x/text v0.14.0 // indirect
	golang.org/x/time v0.5.0 // indirect
	golang.org/x/tools v0.20.0 // indirect
	golang.org/x/xerrors v0.0.0-20220907171357-04be3eba64a2 // indirect
	google.golang.org/api v0.162.0 // indirect
	google.golang.org/appengine v1.6.8 // indirect
	google.golang.org/genproto v0.0.0-20240227224415-6ceb2ff114de // indirect
	google.golang.org/genproto/googleapis/api v0.0.0-20240227224415-6ceb2ff114de // indirect
	google.golang.org/genproto/googleapis/rpc v0.0.0-20240415180920-8c6c420018be // indirect
	google.golang.org/grpc v1.63.2 // indirect
	google.golang.org/protobuf v1.33.0 // indirect
	gopkg.in/DataDog/dd-trace-go.v1 v1.57.0 // indirect
	gopkg.in/inf.v0 v0.9.1 // indirect
	gopkg.in/yaml.v2 v2.4.0 // indirect
	gopkg.in/yaml.v3 v3.0.1 // indirect
	inet.af/netaddr v0.0.0-20230525184311-b8eac61e914a // indirect
	k8s.io/api v0.28.4 // indirect
	k8s.io/apimachinery v0.28.4 // indirect
	k8s.io/client-go v0.28.3 // indirect
	k8s.io/klog/v2 v2.110.1 // indirect
	k8s.io/kube-openapi v0.0.0-20230717233707-2695361300d9 // indirect
	k8s.io/utils v0.0.0-20230406110748-d93618cff8a2 // indirect
	sigs.k8s.io/json v0.0.0-20221116044647-bc3834ca7abd // indirect
	sigs.k8s.io/structured-merge-diff/v4 v4.2.3 // indirect
	sigs.k8s.io/yaml v1.3.0 // indirect
)
