{
	"Namespace": "ServiceRegistration",
	"Title": "Cloudburst Service Registration",
	"Description": "Automatic Service Discovery and Registration with Consul",
	"RepositoryName": "ServiceRegistration"
}
