{
	"Namespace": "ServiceRegistration.Models",
	"Title": "Cloudburst Service Registration Models",
	"Description": "Automatic Service Discovery and Registration with Consul",
	"RepositoryName": "ServiceRegistration"
}
