{
	"Namespace": "Configuration.Abstractions",
	"Title": "Cloudburst Configuration Abstractions",
	"Description": "Expanded configuration including Consul KeyValue configuration storage",
	"RepositoryName": "Configuration"
}
