{
	"Namespace": "Microservice",
	"Title": "Microservice",
	"Description": "This is my cool MicroService",
	"ProjectLicenseType": "MIT",
	"ProjectLicenseFile": "LICENSE",
	"ProjectAuthor": "Your Name Here",
	"ProjectCopyright": "Copyright \u00A9 2020 Your Name Here",
	"Version": {
		"Major": 0,
		"Minor": 1,
		"Patch": 0,
		"Build": 0
	}
}
