train_test.py
Namespace(acoustic_model='/data/coros1/qraymondaud/acoustic_models/finalf6.raw', architecture='tdnn', batch_size=128, data='/data/coros1/qraymondaud/MELD/meld-mfcc-hires', feature_size=1536, kaldi_pybind_path='/users/qraymondaud/kaldi/src/pybind', load_egs='exp/pytorch_egs/', load_model='', lr=0.001, max_seq_len=400, mode='train-test', model_dir='exp/pytorch_resnet_block256_ecapatdnn_good/tdnn_sentiment/finalf6', multi_gpu=True, num_epochs=5, num_iterations=75, output_size=3, rollback_threshold=10, task='sentiment', use_cuda=True, weight_decay=0.001)
AdamW

-=-=-=-=-=-=-=-=-=-=-=-=-=-=-=-- Train epoch 0 --=-=-=-=-=-=-=-=-=-=-=-=-=-


-=-=-=-=-=-=-=-=-=-=-=-=-=-=-=-- Test iteration 0 on DEV -- LR :0.0009934 C-LOSS : 1.2015283107757568 AVG-LOSS :1.2015283107757568

Confusion Matrix : 
[[  0   0 405]
 [  0   0 469]
 [  0   0 233]]
F-Measure : 0.07319634887891167
> Save best model exp/pytorch_resnet_block256_ecapatdnn_good/tdnn_sentiment/finalf6/finalf6_tdnn_sentiment_pid-35093.mat

-=-=-=-=-=-=-=-=-=-=-=-=-=-=-=-- Test iteration 1 on DEV -- LR :0.0009868000000000001 C-LOSS : 59.35667037963867 AVG-LOSS :30.279099345207214

Confusion Matrix : 
[[406   0   0]
 [469   0   0]
 [232   0   0]]
F-Measure : 0.19683191324092134
> Save best model exp/pytorch_resnet_block256_ecapatdnn_good/tdnn_sentiment/finalf6/finalf6_tdnn_sentiment_pid-35093.mat

-=-=-=-=-=-=-=-=-=-=-=-=-=-=-=-- Test iteration 2 on DEV -- LR :0.0009802 C-LOSS : 24.409330368041992 AVG-LOSS :28.32250968615214

Confusion Matrix : 
[[  0 406   0]
 [  0 469   0]
 [  0 232   0]]
F-Measure : 0.25215747504344754
> Save best model exp/pytorch_resnet_block256_ecapatdnn_good/tdnn_sentiment/finalf6/finalf6_tdnn_sentiment_pid-35093.mat

-=-=-=-=-=-=-=-=-=-=-=-=-=-=-=-- Test iteration 3 on DEV -- LR :0.0009735999999999998 C-LOSS : 9.925050735473633 AVG-LOSS :23.723144948482513

Confusion Matrix : 
[[  0   0 406]
 [  0   0 469]
 [  0   0 232]]
F-Measure : 0.07262359902663006

-=-=-=-=-=-=-=-=-=-=-=-=-=-=-=-- Test iteration 4 on DEV -- LR :0.0009670000000000002 C-LOSS : 2.6370339393615723 AVG-LOSS :19.505922746658324

Confusion Matrix : 
[[  0   3 403]
 [  0   3 466]
 [  0   1 231]]
F-Measure : 0.07803092427673966

-=-=-=-=-=-=-=-=-=-=-=-=-=-=-=-- Test iteration 5 on DEV -- LR :0.0009604 C-LOSS : 3.9705278873443604 AVG-LOSS :16.916690270106

Confusion Matrix : 
[[405   1   0]
 [467   2   0]
 [231   1   0]]
F-Measure : 0.20045038746894547

-=-=-=-=-=-=-=-=-=-=-=-=-=-=-=-- Test iteration 6 on DEV -- LR :0.0009537999999999999 C-LOSS : 7.433177947998047 AVG-LOSS :15.561902795519147

Confusion Matrix : 
[[  0 406   0]
 [  0 469   0]
 [  0 232   0]]
F-Measure : 0.25215747504344754

-=-=-=-=-=-=-=-=-=-=-=-=-=-=-=-- Test iteration 7 on DEV -- LR :0.0009472000000000001 C-LOSS : 3.396007537841797 AVG-LOSS :14.041165888309479

Confusion Matrix : 
[[  0 406   0]
 [  0 469   0]
 [  0 232   0]]
F-Measure : 0.25215747504344754

-=-=-=-=-=-=-=-=-=-=-=-=-=-=-=-- Test iteration 8 on DEV -- LR :0.0009406 C-LOSS : 2.4198994636535645 AVG-LOSS :12.74991406334771

Confusion Matrix : 
[[406   0   0]
 [469   0   0]
 [232   0   0]]
F-Measure : 0.19683191324092134

-=-=-=-=-=-=-=-=-=-=-=-=-=-=-=-- Test iteration 9 on DEV -- LR :0.0009339999999999998 C-LOSS : 2.6626009941101074 AVG-LOSS :11.74118275642395

Confusion Matrix : 
[[395   0  11]
 [453   0  16]
 [221   0  11]]
F-Measure : 0.21350907963986523

-=-=-=-=-=-=-=-=-=-=-=-=-=-=-=-- Test iteration 10 on DEV -- LR :0.0009274000000000001 C-LOSS : 4.15696907043457 AVG-LOSS :11.051708784970371

Confusion Matrix : 
[[  1   0 405]
 [  0   0 469]
 [  1   0 231]]
F-Measure : 0.07421656309435146

-=-=-=-=-=-=-=-=-=-=-=-=-=-=-=-- Test iteration 11 on DEV -- LR :0.0009207999999999999 C-LOSS : 2.9425034523010254 AVG-LOSS :10.37594167391459

Confusion Matrix : 
[[  1   0 405]
 [  1   0 468]
 [  1   0 231]]
F-Measure : 0.07426637306551877

-=-=-=-=-=-=-=-=-=-=-=-=-=-=-=-- Test iteration 12 on DEV -- LR :0.0009141999999999998 C-LOSS : 2.258122444152832 AVG-LOSS :9.751494040855995

Confusion Matrix : 
[[394   0  12]
 [450   0  19]
 [226   0   6]]
F-Measure : 0.20515160787087394

-=-=-=-=-=-=-=-=-=-=-=-=-=-=-=-- Test iteration 13 on DEV -- LR :0.0009076 C-LOSS : 1.3238494396209717 AVG-LOSS :9.149519426482064

Confusion Matrix : 
[[404   0   2]
 [461   0   8]
 [231   0   1]]
F-Measure : 0.19902160952569434

-=-=-=-=-=-=-=-=-=-=-=-=-=-=-=-- Test iteration 14 on DEV -- LR :0.0009009999999999999 C-LOSS : 1.2122671604156494 AVG-LOSS :8.62036927541097

Confusion Matrix : 
[[244 162   0]
 [213 256   0]
 [120 112   0]]
F-Measure : 0.39920758229201403
> Save best model exp/pytorch_resnet_block256_ecapatdnn_good/tdnn_sentiment/finalf6/finalf6_tdnn_sentiment_pid-35093.mat

-=-=-=-=-=-=-=-=-=-=-=-=-=-=-=-- Test iteration 15 on DEV -- LR :0.0008944000000000003 C-LOSS : 1.5225213766098022 AVG-LOSS :8.176753781735897

Confusion Matrix : 
[[ 16 390   0]
 [  5 464   0]
 [  7 225   0]]
F-Measure : 0.2810235832068526

-=-=-=-=-=-=-=-=-=-=-=-=-=-=-=-- Test iteration 16 on DEV -- LR :0.0008878000000000001 C-LOSS : 1.6677348613739014 AVG-LOSS :7.79387031583225

Confusion Matrix : 
[[ 16 390   0]
 [  5 464   0]
 [  6 226   0]]
F-Measure : 0.2809220709659763

-=-=-=-=-=-=-=-=-=-=-=-=-=-=-=-- Test iteration 17 on DEV -- LR :0.0008812 C-LOSS : 1.171012282371521 AVG-LOSS :7.425933758417766

Confusion Matrix : 
[[104 302   0]
 [ 58 411   0]
 [ 52 180   0]]
F-Measure : 0.3787347019413067

-=-=-=-=-=-=-=-=-=-=-=-=-=-=-=-- Test iteration 18 on DEV -- LR :0.0008746000000000002 C-LOSS : 1.1428158283233643 AVG-LOSS :7.095243341044376

Confusion Matrix : 
[[394  12   0]
 [432  37   0]
 [225   7   0]]
F-Measure : 0.2580728324174876

-=-=-=-=-=-=-=-=-=-=-=-=-=-=-=-- Test iteration 19 on DEV -- LR :0.0008680000000000001 C-LOSS : 1.1661031246185303 AVG-LOSS :6.798786330223083

Confusion Matrix : 
[[406   0   0]
 [469   0   0]
 [232   0   0]]
F-Measure : 0.19683191324092134

-=-=-=-=-=-=-=-=-=-=-=-=-=-=-=-- Test iteration 20 on DEV -- LR :0.0008613999999999999 C-LOSS : 1.2589858770370483 AVG-LOSS :6.534986308642796

Confusion Matrix : 
[[405   0   1]
 [469   0   0]
 [232   0   0]]
F-Measure : 0.19647696476964768

-=-=-=-=-=-=-=-=-=-=-=-=-=-=-=-- Test iteration 21 on DEV -- LR :0.0008548000000000002 C-LOSS : 1.2083745002746582 AVG-LOSS :6.292867590080608

Confusion Matrix : 
[[384   0  22]
 [437   0  32]
 [219   0  13]]
F-Measure : 0.21301605042029134

-=-=-=-=-=-=-=-=-=-=-=-=-=-=-=-- Test iteration 22 on DEV -- LR :0.0008482 C-LOSS : 1.1441882848739624 AVG-LOSS :6.069011968115102

Confusion Matrix : 
[[349   0  57]
 [375   0  94]
 [206   0  26]]
F-Measure : 0.21825934867696775

-=-=-=-=-=-=-=-=-=-=-=-=-=-=-=-- Test iteration 23 on DEV -- LR :0.0008415999999999999 C-LOSS : 1.0992931127548218 AVG-LOSS :5.861940349141757

Confusion Matrix : 
[[369   0  37]
 [411   0  58]
 [213   0  19]]
F-Measure : 0.21648848192107273

-=-=-=-=-=-=-=-=-=-=-=-=-=-=-=-- Test iteration 24 on DEV -- LR :0.0008350000000000001 C-LOSS : 1.080280065536499 AVG-LOSS :5.670673937797546

Confusion Matrix : 
[[386   0  20]
 [447   0  22]
 [222   0  10]]
F-Measure : 0.2085551401509587

-=-=-=-=-=-=-=-=-=-=-=-=-=-=-=-- Test iteration 25 on DEV -- LR :0.0008284 C-LOSS : 1.0934644937515259 AVG-LOSS :5.494627420718853

Confusion Matrix : 
[[400   0   6]
 [464   0   5]
 [229   0   3]]
F-Measure : 0.20084581912871963

-=-=-=-=-=-=-=-=-=-=-=-=-=-=-=-- Test iteration 26 on DEV -- LR :0.0008217999999999999 C-LOSS : 1.0856250524520874 AVG-LOSS :5.331331036708973

Confusion Matrix : 
[[402   3   1]
 [461   8   0]
 [231   1   0]]
F-Measure : 0.21067464462586416

-=-=-=-=-=-=-=-=-=-=-=-=-=-=-=-- Test iteration 27 on DEV -- LR :0.0008152000000000002 C-LOSS : 1.1531827449798584 AVG-LOSS :5.182111454861505

Confusion Matrix : 
[[398   8   0]
 [453  16   0]
 [229   3   0]]
F-Measure : 0.22379272722523608

-=-=-=-=-=-=-=-=-=-=-=-=-=-=-=-- Test iteration 28 on DEV -- LR :0.0008086 C-LOSS : 1.0856322050094604 AVG-LOSS :5.040853549694193

Confusion Matrix : 
[[399   7   0]
 [458  11   0]
 [231   1   0]]
F-Measure : 0.2149980852519917

-=-=-=-=-=-=-=-=-=-=-=-=-=-=-=-- Test iteration 29 on DEV -- LR :0.0008019999999999999 C-LOSS : 1.0824004411697388 AVG-LOSS :4.908905112743378

Confusion Matrix : 
[[405   1   0]
 [465   4   0]
 [232   0   0]]
F-Measure : 0.2041486313380931

-=-=-=-=-=-=-=-=-=-=-=-=-=-=-=-- Test iteration 30 on DEV -- LR :0.0007954000000000001 C-LOSS : 1.1295886039733887 AVG-LOSS :4.786991676976604

Confusion Matrix : 
[[406   0   0]
 [469   0   0]
 [232   0   0]]
F-Measure : 0.19683191324092134

-=-=-=-=-=-=-=-=-=-=-=-=-=-=-=-- Test iteration 31 on DEV -- LR :0.0007888 C-LOSS : 1.0948100090026855 AVG-LOSS :4.671610999852419

Confusion Matrix : 
[[406   0   0]
 [469   0   0]
 [232   0   0]]
F-Measure : 0.19683191324092134

-=-=-=-=-=-=-=-=-=-=-=-=-=-=-=-- Test iteration 32 on DEV -- LR :0.0007821999999999998 C-LOSS : 1.1129580736160278 AVG-LOSS :4.56377303239071

Confusion Matrix : 
[[406   0   0]
 [469   0   0]
 [232   0   0]]
F-Measure : 0.19683191324092134

-=-=-=-=-=-=-=-=-=-=-=-=-=-=-=-- Test iteration 33 on DEV -- LR :0.0007756000000000001 C-LOSS : 1.0867549180984497 AVG-LOSS :4.461507793735056

Confusion Matrix : 
[[406   0   0]
 [469   0   0]
 [232   0   0]]
F-Measure : 0.19683191324092134

-=-=-=-=-=-=-=-=-=-=-=-=-=-=-=-- Test iteration 34 on DEV -- LR :0.0007689999999999999 C-LOSS : 1.099104881286621 AVG-LOSS :4.365439139093671

Confusion Matrix : 
[[406   0   0]
 [469   0   0]
 [232   0   0]]
F-Measure : 0.19683191324092134

-=-=-=-=-=-=-=-=-=-=-=-=-=-=-=-- Test iteration 35 on DEV -- LR :0.0007623999999999998 C-LOSS : 1.0751583576202393 AVG-LOSS :4.27404245071941

Confusion Matrix : 
[[406   0   0]
 [469   0   0]
 [232   0   0]]
F-Measure : 0.19683191324092134

-=-=-=-=-=-=-=-=-=-=-=-=-=-=-=-- Test iteration 36 on DEV -- LR :0.0007558 C-LOSS : 1.0951672792434692 AVG-LOSS :4.188126905544384

Confusion Matrix : 
[[406   0   0]
 [469   0   0]
 [232   0   0]]
F-Measure : 0.19683191324092134

-=-=-=-=-=-=-=-=-=-=-=-=-=-=-=-- Test iteration 37 on DEV -- LR :0.0007492 C-LOSS : 1.0807770490646362 AVG-LOSS :4.10635454090018

Confusion Matrix : 
[[405   0   1]
 [469   0   0]
 [230   0   2]]
F-Measure : 0.20030444050624344

-=-=-=-=-=-=-=-=-=-=-=-=-=-=-=-- Test iteration 38 on DEV -- LR :0.0007426000000000002 C-LOSS : 1.1245245933532715 AVG-LOSS :4.029897362757952

Confusion Matrix : 
[[402   0   4]
 [468   0   1]
 [228   0   4]]
F-Measure : 0.2030157893909948

-=-=-=-=-=-=-=-=-=-=-=-=-=-=-=-- Test iteration 39 on DEV -- LR :0.0007360000000000001 C-LOSS : 1.048771619796753 AVG-LOSS :3.955369219183922

Confusion Matrix : 
[[403   0   3]
 [468   0   1]
 [228   0   4]]
F-Measure : 0.20340188931605074

-=-=-=-=-=-=-=-=-=-=-=-=-=-=-=-- Test iteration 40 on DEV -- LR :0.0007294 C-LOSS : 1.076321005821228 AVG-LOSS :3.885148531053124

Confusion Matrix : 
[[403   0   3]
 [467   0   2]
 [228   0   4]]
F-Measure : 0.20350349816879174

-=-=-=-=-=-=-=-=-=-=-=-=-=-=-=-- Test iteration 41 on DEV -- LR :0.0007227999999999998 C-LOSS : 1.1025876998901367 AVG-LOSS :3.818897082692101

Confusion Matrix : 
[[403   0   3]
 [468   0   1]
 [229   0   3]]
F-Measure : 0.20154692718456782

-=-=-=-=-=-=-=-=-=-=-=-=-=-=-=-- Test iteration 42 on DEV -- LR :0.0007162000000000001 C-LOSS : 1.0806690454483032 AVG-LOSS :3.7552173608957333

Confusion Matrix : 
[[406   0   0]
 [469   0   0]
 [232   0   0]]
F-Measure : 0.19683191324092134

-=-=-=-=-=-=-=-=-=-=-=-=-=-=-=-- Test iteration 43 on DEV -- LR :0.0007095999999999999 C-LOSS : 1.1169939041137695 AVG-LOSS :3.6952577368779616

Confusion Matrix : 
[[406   0   0]
 [469   0   0]
 [232   0   0]]
F-Measure : 0.19683191324092134

-=-=-=-=-=-=-=-=-=-=-=-=-=-=-=-- Test iteration 44 on DEV -- LR :0.0007030000000000002 C-LOSS : 1.0812606811523438 AVG-LOSS :3.6371689134173923

Confusion Matrix : 
[[406   0   0]
 [469   0   0]
 [232   0   0]]
F-Measure : 0.19683191324092134

-=-=-=-=-=-=-=-=-=-=-=-=-=-=-=-- Test iteration 45 on DEV -- LR :0.0006964 C-LOSS : 1.0786736011505127 AVG-LOSS :3.581549450107243

Confusion Matrix : 
[[406   0   0]
 [469   0   0]
 [232   0   0]]
F-Measure : 0.19683191324092134

-=-=-=-=-=-=-=-=-=-=-=-=-=-=-=-- Test iteration 46 on DEV -- LR :0.0006898 C-LOSS : 1.0614445209503174 AVG-LOSS :3.5279301962953933

Confusion Matrix : 
[[406   0   0]
 [469   0   0]
 [232   0   0]]
F-Measure : 0.19683191324092134

-=-=-=-=-=-=-=-=-=-=-=-=-=-=-=-- Test iteration 47 on DEV -- LR :0.0006832000000000001 C-LOSS : 1.1125357151031494 AVG-LOSS :3.4776094779372215

Confusion Matrix : 
[[406   0   0]
 [469   0   0]
 [232   0   0]]
F-Measure : 0.19683191324092134

-=-=-=-=-=-=-=-=-=-=-=-=-=-=-=-- Test iteration 48 on DEV -- LR :0.0006766000000000001 C-LOSS : 1.0621192455291748 AVG-LOSS :3.428313758908486

Confusion Matrix : 
[[406   0   0]
 [469   0   0]
 [232   0   0]]
F-Measure : 0.19683191324092134

-=-=-=-=-=-=-=-=-=-=-=-=-=-=-=-- Test iteration 49 on DEV -- LR :0.0006699999999999998 C-LOSS : 1.0920803546905518 AVG-LOSS :3.3815890908241273

Confusion Matrix : 
[[406   0   0]
 [469   0   0]
 [232   0   0]]
F-Measure : 0.19683191324092134

-=-=-=-=-=-=-=-=-=-=-=-=-=-=-=-- Test iteration 50 on DEV -- LR :0.0006634000000000002 C-LOSS : 1.068812370300293 AVG-LOSS :3.336240527676601

Confusion Matrix : 
[[406   0   0]
 [469   0   0]
 [232   0   0]]
F-Measure : 0.19683191324092134

-=-=-=-=-=-=-=-=-=-=-=-=-=-=-=-- Test iteration 51 on DEV -- LR :0.0006568 C-LOSS : 1.0566065311431885 AVG-LOSS :3.2924014123586507

Confusion Matrix : 
[[405   0   1]
 [468   1   0]
 [231   1   0]]
F-Measure : 0.19853621219620288

-=-=-=-=-=-=-=-=-=-=-=-=-=-=-=-- Test iteration 52 on DEV -- LR :0.0006501999999999999 C-LOSS : 1.0632268190383911 AVG-LOSS :3.2503415143714762

Confusion Matrix : 
[[404   1   1]
 [466   1   2]
 [231   1   0]]
F-Measure : 0.1984373095505161

-=-=-=-=-=-=-=-=-=-=-=-=-=-=-=-- Test iteration 53 on DEV -- LR :0.0006436000000000001 C-LOSS : 1.091465711593628 AVG-LOSS :3.210362332838553

Confusion Matrix : 
[[402   2   2]
 [466   1   2]
 [227   1   4]]
F-Measure : 0.20522803914593263

-=-=-=-=-=-=-=-=-=-=-=-=-=-=-=-- Test iteration 54 on DEV -- LR :0.000637 C-LOSS : 1.0709279775619507 AVG-LOSS :3.1714635263789783

Confusion Matrix : 
[[398   1   7]
 [464   1   4]
 [225   1   6]]
F-Measure : 0.20743344911819692

-=-=-=-=-=-=-=-=-=-=-=-=-=-=-=-- Test iteration 55 on DEV -- LR :0.0006303999999999998 C-LOSS : 1.059627652168274 AVG-LOSS :3.133752171482359

Confusion Matrix : 
[[390   0  16]
 [461   2   6]
 [224   1   7]]
F-Measure : 0.2079923351185778

-=-=-=-=-=-=-=-=-=-=-=-=-=-=-=-- Test iteration 56 on DEV -- LR :0.0006238000000000001 C-LOSS : 1.0538538694381714 AVG-LOSS :3.0972627275868465

Confusion Matrix : 
[[388   0  18]
 [460   0   9]
 [223   0   9]]
F-Measure : 0.20676616659826266

-=-=-=-=-=-=-=-=-=-=-=-=-=-=-=-- Test iteration 57 on DEV -- LR :0.0006172 C-LOSS : 1.099423885345459 AVG-LOSS :3.062817230306823

Confusion Matrix : 
[[389   0  17]
 [459   0  10]
 [224   0   8]]
F-Measure : 0.2056149481197687

-=-=-=-=-=-=-=-=-=-=-=-=-=-=-=-- Test iteration 58 on DEV -- LR :0.0006105999999999998 C-LOSS : 1.082255244255066 AVG-LOSS :3.0292483830856063

Confusion Matrix : 
[[393   0  13]
 [462   0   7]
 [226   0   6]]
F-Measure : 0.20360848974269655

-=-=-=-=-=-=-=-=-=-=-=-=-=-=-=-- Test iteration 59 on DEV -- LR :0.0006040000000000002 C-LOSS : 1.0608636140823364 AVG-LOSS :2.996441970268885

Confusion Matrix : 
[[402   0   4]
 [467   0   2]
 [228   0   4]]
F-Measure : 0.20311748709498662

-=-=-=-=-=-=-=-=-=-=-=-=-=-=-=-- Test iteration 60 on DEV -- LR :0.0005973999999999999 C-LOSS : 1.0542024374008179 AVG-LOSS :2.964601977926786

Confusion Matrix : 
[[405   0   1]
 [469   0   0]
 [231   0   1]]
F-Measure : 0.198398238835215

-=-=-=-=-=-=-=-=-=-=-=-=-=-=-=-- Test iteration 61 on DEV -- LR :0.0005908000000000003 C-LOSS : 1.0293866395950317 AVG-LOSS :2.933388827308532

Confusion Matrix : 
[[406   0   0]
 [469   0   0]
 [232   0   0]]
F-Measure : 0.19683191324092134

-=-=-=-=-=-=-=-=-=-=-=-=-=-=-=-- Test iteration 62 on DEV -- LR :0.0005842000000000001 C-LOSS : 1.0541355609893799 AVG-LOSS :2.903559410382831

Confusion Matrix : 
[[406   0   0]
 [469   0   0]
 [232   0   0]]
F-Measure : 0.19683191324092134

-=-=-=-=-=-=-=-=-=-=-=-=-=-=-=-- Test iteration 63 on DEV -- LR :0.0005775999999999999 C-LOSS : 1.098044991493225 AVG-LOSS :2.875348247587681

Confusion Matrix : 
[[406   0   0]
 [469   0   0]
 [232   0   0]]
F-Measure : 0.19683191324092134

-=-=-=-=-=-=-=-=-=-=-=-=-=-=-=-- Test iteration 64 on DEV -- LR :0.0005709999999999998 C-LOSS : 1.0759657621383667 AVG-LOSS :2.8476654401192296

Confusion Matrix : 
[[406   0   0]
 [469   0   0]
 [232   0   0]]
F-Measure : 0.19683191324092134

-=-=-=-=-=-=-=-=-=-=-=-=-=-=-=-- Test iteration 65 on DEV -- LR :0.0005644000000000001 C-LOSS : 1.0868529081344604 AVG-LOSS :2.8209864623618848

Confusion Matrix : 
[[406   0   0]
 [469   0   0]
 [232   0   0]]
F-Measure : 0.19683191324092134

-=-=-=-=-=-=-=-=-=-=-=-=-=-=-=-- Test iteration 66 on DEV -- LR :0.0005577999999999999 C-LOSS : 1.0560861825942993 AVG-LOSS :2.794644667141473

Confusion Matrix : 
[[406   0   0]
 [469   0   0]
 [232   0   0]]
F-Measure : 0.19683191324092134

-=-=-=-=-=-=-=-=-=-=-=-=-=-=-=-- Test iteration 67 on DEV -- LR :0.0005512000000000002 C-LOSS : 1.1148786544799805 AVG-LOSS :2.769942225778804

Confusion Matrix : 
[[406   0   0]
 [469   0   0]
 [232   0   0]]
F-Measure : 0.19683191324092134

-=-=-=-=-=-=-=-=-=-=-=-=-=-=-=-- Test iteration 68 on DEV -- LR :0.0005446000000000001 C-LOSS : 1.0962110757827759 AVG-LOSS :2.745685252590456

Confusion Matrix : 
[[406   0   0]
 [467   2   0]
 [232   0   0]]
F-Measure : 0.2006904712962966

-=-=-=-=-=-=-=-=-=-=-=-=-=-=-=-- Test iteration 69 on DEV -- LR :0.0005379999999999998 C-LOSS : 1.0636992454528809 AVG-LOSS :2.721656881059919

Confusion Matrix : 
[[403   3   0]
 [465   4   0]
 [231   1   0]]
F-Measure : 0.2035215774451473

-=-=-=-=-=-=-=-=-=-=-=-=-=-=-=-- Test iteration 70 on DEV -- LR :0.0005314000000000002 C-LOSS : 1.074270486831665 AVG-LOSS :2.6984542557890987

Confusion Matrix : 
[[403   3   0]
 [464   5   0]
 [231   1   0]]
F-Measure : 0.20540997573689793

-=-=-=-=-=-=-=-=-=-=-=-=-=-=-=-- Test iteration 71 on DEV -- LR :0.0005248 C-LOSS : 1.0971026420593262 AVG-LOSS :2.676213261153963

Confusion Matrix : 
[[399   7   0]
 [457  12   0]
 [230   2   0]]
F-Measure : 0.2169119806862565

-=-=-=-=-=-=-=-=-=-=-=-=-=-=-=-- Test iteration 72 on DEV -- LR :0.0005181999999999999 C-LOSS : 1.0219299793243408 AVG-LOSS :2.653551846334379

Confusion Matrix : 
[[394  11   1]
 [454  14   1]
 [225   6   1]]
F-Measure : 0.22091435733993

-=-=-=-=-=-=-=-=-=-=-=-=-=-=-=-- Test iteration 73 on DEV -- LR :0.0005116000000000002 C-LOSS : 1.0861982107162476 AVG-LOSS :2.632371391798999

Confusion Matrix : 
[[393  12   1]
 [452  17   0]
 [225   7   0]]
F-Measure : 0.22382971061994825

-=-=-=-=-=-=-=-=-=-=-=-=-=-=-=-- Test iteration 74 on DEV -- LR :0.000505 C-LOSS : 1.053581714630127 AVG-LOSS :2.6113208627700804

Confusion Matrix : 
[[390  16   0]
 [443  25   1]
 [223   9   0]]
F-Measure : 0.23648638794660812

-=-=-=-=-=-=-=-=-=-=-=-=-=-=-=-- Train epoch 1 --=-=-=-=-=-=-=-=-=-=-=-=-=-


-=-=-=-=-=-=-=-=-=-=-=-=-=-=-=-- Test iteration 75 on DEV -- LR :0.0004983999999999999 C-LOSS : 1.275188684463501 AVG-LOSS :2.593740176213415

Confusion Matrix : 
[[401   5   0]
 [463   6   0]
 [231   1   0]]
F-Measure : 0.20653177085474253

-=-=-=-=-=-=-=-=-=-=-=-=-=-=-=-- Test iteration 76 on DEV -- LR :0.0004918000000000001 C-LOSS : 1.0353879928588867 AVG-LOSS :2.5735018361698496

Confusion Matrix : 
[[400   6   0]
 [462   7   0]
 [230   2   0]]
F-Measure : 0.20811973406415668

-=-=-=-=-=-=-=-=-=-=-=-=-=-=-=-- Test iteration 77 on DEV -- LR :0.0004852 C-LOSS : 1.1313127279281616 AVG-LOSS :2.5550122322180333

Confusion Matrix : 
[[399   7   0]
 [462   7   0]
 [229   3   0]]
F-Measure : 0.2078408372018258

-=-=-=-=-=-=-=-=-=-=-=-=-=-=-=-- Test iteration 78 on DEV -- LR :0.00047860000000000025 C-LOSS : 1.0645197629928589 AVG-LOSS :2.536145238936702

Confusion Matrix : 
[[399   7   0]
 [461   8   0]
 [229   3   0]]
F-Measure : 0.2096865451679155

-=-=-=-=-=-=-=-=-=-=-=-=-=-=-=-- Test iteration 79 on DEV -- LR :0.0004720000000000001 C-LOSS : 1.0910886526107788 AVG-LOSS :2.518082031607628

Confusion Matrix : 
[[398   8   0]
 [461   8   0]
 [229   3   0]]
F-Measure : 0.20929808452443308

-=-=-=-=-=-=-=-=-=-=-=-=-=-=-=-- Test iteration 80 on DEV -- LR :0.00046540000000000004 C-LOSS : 1.064546823501587 AVG-LOSS :2.5001371524952076

Confusion Matrix : 
[[401   5   0]
 [461   8   0]
 [229   3   0]]
F-Measure : 0.2104623766822021

-=-=-=-=-=-=-=-=-=-=-=-=-=-=-=-- Test iteration 81 on DEV -- LR :0.0004587999999999999 C-LOSS : 1.0609660148620605 AVG-LOSS :2.482586284963096

Confusion Matrix : 
[[400   6   0]
 [460   9   0]
 [229   3   0]]
F-Measure : 0.21191709787022486

-=-=-=-=-=-=-=-=-=-=-=-=-=-=-=-- Test iteration 82 on DEV -- LR :0.00045220000000000015 C-LOSS : 1.0918848514556885 AVG-LOSS :2.4658308460051757

Confusion Matrix : 
[[398   7   1]
 [461   7   1]
 [228   4   0]]
F-Measure : 0.20771758206677193

-=-=-=-=-=-=-=-=-=-=-=-=-=-=-=-- Test iteration 83 on DEV -- LR :0.0004456 C-LOSS : 1.0751426219940186 AVG-LOSS :2.4492750338145663

Confusion Matrix : 
[[399   6   1]
 [461   7   1]
 [229   3   0]]
F-Measure : 0.2079968614280035

-=-=-=-=-=-=-=-=-=-=-=-=-=-=-=-- Test iteration 84 on DEV -- LR :0.00043900000000000026 C-LOSS : 1.0564318895339966 AVG-LOSS :2.4328886438818538

Confusion Matrix : 
[[398   8   0]
 [462   7   0]
 [228   4   0]]
F-Measure : 0.20756174202439603

-=-=-=-=-=-=-=-=-=-=-=-=-=-=-=-- Test iteration 85 on DEV -- LR :0.0004324000000000001 C-LOSS : 1.059836745262146 AVG-LOSS :2.416922924130462

Confusion Matrix : 
[[397   9   0]
 [458  11   0]
 [228   4   0]]
F-Measure : 0.21447695024631208

-=-=-=-=-=-=-=-=-=-=-=-=-=-=-=-- Test iteration 86 on DEV -- LR :0.00042579999999999994 C-LOSS : 1.0448232889175415 AVG-LOSS :2.4011516639556008

Confusion Matrix : 
[[397   9   0]
 [455  14   0]
 [228   4   0]]
F-Measure : 0.21988243685241526

-=-=-=-=-=-=-=-=-=-=-=-=-=-=-=-- Test iteration 87 on DEV -- LR :0.0004191999999999998 C-LOSS : 1.0514554977416992 AVG-LOSS :2.385814207521352

Confusion Matrix : 
[[397   9   0]
 [455  14   0]
 [227   5   0]]
F-Measure : 0.21996627813134806

-=-=-=-=-=-=-=-=-=-=-=-=-=-=-=-- Test iteration 88 on DEV -- LR :0.00041260000000000005 C-LOSS : 1.071623682975769 AVG-LOSS :2.3710480218523005

Confusion Matrix : 
[[395  11   0]
 [452  17   0]
 [224   8   0]]
F-Measure : 0.2246907278482636

-=-=-=-=-=-=-=-=-=-=-=-=-=-=-=-- Test iteration 89 on DEV -- LR :0.0004059999999999999 C-LOSS : 1.1057294607162476 AVG-LOSS :2.3569889267285666

Confusion Matrix : 
[[391  15   0]
 [449  20   0]
 [224   8   0]]
F-Measure : 0.22820377360519636

-=-=-=-=-=-=-=-=-=-=-=-=-=-=-=-- Test iteration 90 on DEV -- LR :0.0003994000000000003 C-LOSS : 1.0586774349212646 AVG-LOSS :2.342721767477937

Confusion Matrix : 
[[395  11   0]
 [451  18   0]
 [224   8   0]]
F-Measure : 0.2264418355628154

-=-=-=-=-=-=-=-=-=-=-=-=-=-=-=-- Test iteration 91 on DEV -- LR :0.0003928000000000001 C-LOSS : 1.0803568363189697 AVG-LOSS :2.3290004095305568

Confusion Matrix : 
[[396  10   0]
 [455  14   0]
 [227   5   0]]
F-Measure : 0.21955620884793628

-=-=-=-=-=-=-=-=-=-=-=-=-=-=-=-- Test iteration 92 on DEV -- LR :0.00038619999999999995 C-LOSS : 1.0597670078277588 AVG-LOSS :2.315352738544505

Confusion Matrix : 
[[398   8   0]
 [459  10   0]
 [228   4   0]]
F-Measure : 0.21305785308282565

-=-=-=-=-=-=-=-=-=-=-=-=-=-=-=-- Test iteration 93 on DEV -- LR :0.0003795999999999998 C-LOSS : 1.0448734760284424 AVG-LOSS :2.301837001709228

Confusion Matrix : 
[[398   7   1]
 [462   7   0]
 [228   4   0]]
F-Measure : 0.20758669971946844

-=-=-=-=-=-=-=-=-=-=-=-=-=-=-=-- Test iteration 94 on DEV -- LR :0.00037300000000000007 C-LOSS : 1.0692102909088135 AVG-LOSS :2.2888619837008024

Confusion Matrix : 
[[401   3   2]
 [463   5   1]
 [230   1   1]]
F-Measure : 0.20673214439273127

-=-=-=-=-=-=-=-=-=-=-=-=-=-=-=-- Test iteration 95 on DEV -- LR :0.0003663999999999999 C-LOSS : 1.0544662475585938 AVG-LOSS :2.2760036947826543

Confusion Matrix : 
[[400   1   5]
 [464   2   3]
 [230   1   1]]
F-Measure : 0.20092576142563237

-=-=-=-=-=-=-=-=-=-=-=-=-=-=-=-- Test iteration 96 on DEV -- LR :0.0003598000000000002 C-LOSS : 1.090042233467102 AVG-LOSS :2.2637772879649685

Confusion Matrix : 
[[398   0   8]
 [465   0   4]
 [226   1   5]]
F-Measure : 0.20369332116937597

-=-=-=-=-=-=-=-=-=-=-=-=-=-=-=-- Test iteration 97 on DEV -- LR :0.0003532 C-LOSS : 1.0791819095611572 AVG-LOSS :2.2516895800220724

Confusion Matrix : 
[[392   0  14]
 [460   0   9]
 [222   1   9]]
F-Measure : 0.20857132076644272

-=-=-=-=-=-=-=-=-=-=-=-=-=-=-=-- Test iteration 98 on DEV -- LR :0.00034659999999999986 C-LOSS : 1.1347910165786743 AVG-LOSS :2.240407776350927

Confusion Matrix : 
[[388   0  18]
 [459   0  10]
 [220   0  12]]
F-Measure : 0.21170541378083935

-=-=-=-=-=-=-=-=-=-=-=-=-=-=-=-- Test iteration 99 on DEV -- LR :0.00034000000000000013 C-LOSS : 1.0459814071655273 AVG-LOSS :2.228463512659073

Confusion Matrix : 
[[387   0  19]
 [461   0   8]
 [222   1   9]]
F-Measure : 0.2063997548117697

-=-=-=-=-=-=-=-=-=-=-=-=-=-=-=-- Test iteration 100 on DEV -- LR :0.00033339999999999997 C-LOSS : 1.0737863779067993 AVG-LOSS :2.2170310657803376

Confusion Matrix : 
[[394   0  12]
 [462   0   7]
 [221   1  10]]
F-Measure : 0.210937718377958

-=-=-=-=-=-=-=-=-=-=-=-=-=-=-=-- Test iteration 101 on DEV -- LR :0.0003267999999999999 C-LOSS : 1.0456446409225464 AVG-LOSS :2.205546885144477

Confusion Matrix : 
[[396   0  10]
 [462   3   4]
 [225   1   6]]
F-Measure : 0.21043227144489557

-=-=-=-=-=-=-=-=-=-=-=-=-=-=-=-- Test iteration 102 on DEV -- LR :0.0003202000000000002 C-LOSS : 1.053011417388916 AVG-LOSS :2.194357220408986

Confusion Matrix : 
[[399   1   6]
 [462   3   4]
 [230   1   1]]
F-Measure : 0.2025935172364358

-=-=-=-=-=-=-=-=-=-=-=-=-=-=-=-- Test iteration 103 on DEV -- LR :0.00031360000000000003 C-LOSS : 1.0483505725860596 AVG-LOSS :2.183337925718381

Confusion Matrix : 
[[400   4   2]
 [464   3   2]
 [230   1   1]]
F-Measure : 0.20270145466096542

-=-=-=-=-=-=-=-=-=-=-=-=-=-=-=-- Test iteration 104 on DEV -- LR :0.00030699999999999987 C-LOSS : 1.0764309167861938 AVG-LOSS :2.172795954204741

Confusion Matrix : 
[[400   4   2]
 [466   3   0]
 [230   1   1]]
F-Measure : 0.20245604861073027

-=-=-=-=-=-=-=-=-=-=-=-=-=-=-=-- Test iteration 105 on DEV -- LR :0.00030040000000000015 C-LOSS : 1.061807632446289 AVG-LOSS :2.1623149323013595

Confusion Matrix : 
[[402   4   0]
 [467   2   0]
 [230   1   1]]
F-Measure : 0.20128781936351856

-=-=-=-=-=-=-=-=-=-=-=-=-=-=-=-- Test iteration 106 on DEV -- LR :0.0002938 C-LOSS : 1.049187421798706 AVG-LOSS :2.1519118714555403

Confusion Matrix : 
[[402   4   0]
 [467   2   0]
 [230   1   1]]
F-Measure : 0.20128781936351856

-=-=-=-=-=-=-=-=-=-=-=-=-=-=-=-- Test iteration 107 on DEV -- LR :0.00028720000000000026 C-LOSS : 1.0597312450408936 AVG-LOSS :2.1417990878776267

Confusion Matrix : 
[[402   4   0]
 [467   2   0]
 [230   1   1]]
F-Measure : 0.20128781936351856

-=-=-=-=-=-=-=-=-=-=-=-=-=-=-=-- Test iteration 108 on DEV -- LR :0.0002806000000000001 C-LOSS : 1.0692119598388672 AVG-LOSS :2.131958838996537

Confusion Matrix : 
[[402   4   0]
 [467   2   0]
 [230   1   1]]
F-Measure : 0.20128781936351856

-=-=-=-=-=-=-=-=-=-=-=-=-=-=-=-- Test iteration 109 on DEV -- LR :0.00027399999999999994 C-LOSS : 1.0833345651626587 AVG-LOSS :2.122425891052593

Confusion Matrix : 
[[401   3   2]
 [466   3   0]
 [230   1   1]]
F-Measure : 0.2028253086629247

-=-=-=-=-=-=-=-=-=-=-=-=-=-=-=-- Test iteration 110 on DEV -- LR :0.0002673999999999998 C-LOSS : 1.0788785219192505 AVG-LOSS :2.113024563402743

Confusion Matrix : 
[[399   3   4]
 [463   3   3]
 [230   1   1]]
F-Measure : 0.20246203421047101

-=-=-=-=-=-=-=-=-=-=-=-=-=-=-=-- Test iteration 111 on DEV -- LR :0.00026080000000000005 C-LOSS : 1.1118618249893188 AVG-LOSS :2.1040856103811945

Confusion Matrix : 
[[395   2   9]
 [462   3   4]
 [229   1   2]]
F-Measure : 0.2029399149910426

-=-=-=-=-=-=-=-=-=-=-=-=-=-=-=-- Test iteration 112 on DEV -- LR :0.0002542 C-LOSS : 1.057530164718628 AVG-LOSS :2.0948240577647117

Confusion Matrix : 
[[393   1  12]
 [464   1   4]
 [227   1   4]]
F-Measure : 0.20191886141030665

-=-=-=-=-=-=-=-=-=-=-=-=-=-=-=-- Test iteration 113 on DEV -- LR :0.00024760000000000027 C-LOSS : 1.0293126106262207 AVG-LOSS :2.085477466123146

Confusion Matrix : 
[[391   1  14]
 [462   0   7]
 [227   0   5]]
F-Measure : 0.20112709931061176

-=-=-=-=-=-=-=-=-=-=-=-=-=-=-=-- Test iteration 114 on DEV -- LR :0.0002410000000000001 C-LOSS : 1.0764495134353638 AVG-LOSS :2.0767033100128174

Confusion Matrix : 
[[394   0  12]
 [461   0   8]
 [226   0   6]]
F-Measure : 0.20410177420927805

-=-=-=-=-=-=-=-=-=-=-=-=-=-=-=-- Test iteration 115 on DEV -- LR :0.00023439999999999995 C-LOSS : 1.066465973854065 AVG-LOSS :2.0679943674597245

Confusion Matrix : 
[[395   0  11]
 [462   0   7]
 [226   0   6]]
F-Measure : 0.20440949680372114

-=-=-=-=-=-=-=-=-=-=-=-=-=-=-=-- Test iteration 116 on DEV -- LR :0.0002277999999999998 C-LOSS : 1.0894261598587036 AVG-LOSS :2.059630536625528

Confusion Matrix : 
[[396   0  10]
 [465   0   4]
 [228   0   4]]
F-Measure : 0.2010017613665546

-=-=-=-=-=-=-=-=-=-=-=-=-=-=-=-- Test iteration 117 on DEV -- LR :0.00022120000000000006 C-LOSS : 1.0419301986694336 AVG-LOSS :2.051005957490307

Confusion Matrix : 
[[399   1   6]
 [465   0   4]
 [231   0   1]]
F-Measure : 0.1967096353084001

-=-=-=-=-=-=-=-=-=-=-=-=-=-=-=-- Test iteration 118 on DEV -- LR :0.0002145999999999999 C-LOSS : 1.0559343099594116 AVG-LOSS :2.0426440108724

Confusion Matrix : 
[[401   1   4]
 [465   1   3]
 [231   0   1]]
F-Measure : 0.19924681541391157

-=-=-=-=-=-=-=-=-=-=-=-=-=-=-=-- Test iteration 119 on DEV -- LR :0.00020800000000000018 C-LOSS : 1.0722990036010742 AVG-LOSS :2.0345578024784725

Confusion Matrix : 
[[404   1   1]
 [466   1   2]
 [231   0   1]]
F-Measure : 0.20021718397718272

-=-=-=-=-=-=-=-=-=-=-=-=-=-=-=-- Test iteration 120 on DEV -- LR :0.00020140000000000002 C-LOSS : 1.0688011646270752 AVG-LOSS :2.0265763426615186

Confusion Matrix : 
[[403   2   1]
 [467   2   0]
 [230   1   1]]
F-Measure : 0.20165211608036926

-=-=-=-=-=-=-=-=-=-=-=-=-=-=-=-- Test iteration 121 on DEV -- LR :0.00019479999999999986 C-LOSS : 1.0262768268585205 AVG-LOSS :2.0183771663024777

Confusion Matrix : 
[[404   2   0]
 [467   2   0]
 [230   1   1]]
F-Measure : 0.2020162924598139

-=-=-=-=-=-=-=-=-=-=-=-=-=-=-=-- Test iteration 122 on DEV -- LR :0.00018820000000000013 C-LOSS : 1.050955891609192 AVG-LOSS :2.0105119526870854

Confusion Matrix : 
[[404   2   0]
 [467   2   0]
 [231   0   1]]
F-Measure : 0.20189345185997887

-=-=-=-=-=-=-=-=-=-=-=-=-=-=-=-- Test iteration 123 on DEV -- LR :0.00018160000000000008 C-LOSS : 1.054940104484558 AVG-LOSS :2.0028057281048066

Confusion Matrix : 
[[405   1   0]
 [468   1   0]
 [231   0   1]]
F-Measure : 0.20033514291798504

-=-=-=-=-=-=-=-=-=-=-=-=-=-=-=-- Test iteration 124 on DEV -- LR :0.00017499999999999992 C-LOSS : 1.0248814821243286 AVG-LOSS :1.9949823341369628

Confusion Matrix : 
[[405   1   0]
 [468   1   0]
 [231   0   1]]
F-Measure : 0.20033514291798504

-=-=-=-=-=-=-=-=-=-=-=-=-=-=-=-- Test iteration 125 on DEV -- LR :0.0001684000000000002 C-LOSS : 1.0538537502288818 AVG-LOSS :1.9875130596615018

Confusion Matrix : 
[[405   1   0]
 [468   1   0]
 [231   0   1]]
F-Measure : 0.20033514291798504

-=-=-=-=-=-=-=-=-=-=-=-=-=-=-=-- Test iteration 126 on DEV -- LR :0.00016180000000000003 C-LOSS : 1.0551429986953735 AVG-LOSS :1.9801715631184615

Confusion Matrix : 
[[405   1   0]
 [468   1   0]
 [231   0   1]]
F-Measure : 0.20033514291798504

-=-=-=-=-=-=-=-=-=-=-=-=-=-=-=-- Test iteration 127 on DEV -- LR :0.00015519999999999987 C-LOSS : 1.0367141962051392 AVG-LOSS :1.9728008024394512

Confusion Matrix : 
[[405   1   0]
 [468   1   0]
 [231   0   1]]
F-Measure : 0.20033514291798504

-=-=-=-=-=-=-=-=-=-=-=-=-=-=-=-- Test iteration 128 on DEV -- LR :0.00014860000000000014 C-LOSS : 1.029075026512146 AVG-LOSS :1.9654850987500923

Confusion Matrix : 
[[405   1   0]
 [468   1   0]
 [231   0   1]]
F-Measure : 0.20033514291798504

-=-=-=-=-=-=-=-=-=-=-=-=-=-=-=-- Test iteration 129 on DEV -- LR :0.00014199999999999998 C-LOSS : 1.0273083448410034 AVG-LOSS :1.9582683544892532

Confusion Matrix : 
[[405   1   0]
 [468   1   0]
 [231   0   1]]
F-Measure : 0.20033514291798504

-=-=-=-=-=-=-=-=-=-=-=-=-=-=-=-- Test iteration 130 on DEV -- LR :0.00013540000000000026 C-LOSS : 1.0446312427520752 AVG-LOSS :1.9512940253920228

Confusion Matrix : 
[[405   1   0]
 [468   1   0]
 [231   0   1]]
F-Measure : 0.20033514291798504

-=-=-=-=-=-=-=-=-=-=-=-=-=-=-=-- Test iteration 131 on DEV -- LR :0.0001288000000000001 C-LOSS : 1.023400902748108 AVG-LOSS :1.9442645320386598

Confusion Matrix : 
[[405   1   0]
 [468   1   0]
 [231   0   1]]
F-Measure : 0.20033514291798504

-=-=-=-=-=-=-=-=-=-=-=-=-=-=-=-- Test iteration 132 on DEV -- LR :0.00012219999999999993 C-LOSS : 1.0105558633804321 AVG-LOSS :1.9372441661088986

Confusion Matrix : 
[[405   1   0]
 [468   1   0]
 [231   0   1]]
F-Measure : 0.20033514291798504

-=-=-=-=-=-=-=-=-=-=-=-=-=-=-=-- Test iteration 133 on DEV -- LR :0.00011559999999999977 C-LOSS : 1.0386112928390503 AVG-LOSS :1.9305379506367355

Confusion Matrix : 
[[405   1   0]
 [468   1   0]
 [231   0   1]]
F-Measure : 0.20033514291798504

-=-=-=-=-=-=-=-=-=-=-=-=-=-=-=-- Test iteration 134 on DEV -- LR :0.00010900000000000016 C-LOSS : 1.0807890892028809 AVG-LOSS :1.9242435146261145

Confusion Matrix : 
[[405   1   0]
 [468   1   0]
 [231   0   1]]
F-Measure : 0.20033514291798504

-=-=-=-=-=-=-=-=-=-=-=-=-=-=-=-- Test iteration 135 on DEV -- LR :0.0001024 C-LOSS : 1.0421323776245117 AVG-LOSS :1.917757403324632

Confusion Matrix : 
[[403   2   1]
 [467   1   1]
 [231   0   1]]
F-Measure : 0.19973419233255607

-=-=-=-=-=-=-=-=-=-=-=-=-=-=-=-- Test iteration 136 on DEV -- LR :9.580000000000027e-05 C-LOSS : 1.0118625164031982 AVG-LOSS :1.9111450318872494

Confusion Matrix : 
[[403   2   1]
 [467   1   1]
 [231   0   1]]
F-Measure : 0.19973419233255607

-=-=-=-=-=-=-=-=-=-=-=-=-=-=-=-- Test iteration 137 on DEV -- LR :8.920000000000011e-05 C-LOSS : 1.0629233121871948 AVG-LOSS :1.9049984976865244

Confusion Matrix : 
[[402   2   2]
 [467   1   1]
 [231   0   1]]
F-Measure : 0.19936982277739135

-=-=-=-=-=-=-=-=-=-=-=-=-=-=-=-- Test iteration 138 on DEV -- LR :8.259999999999995e-05 C-LOSS : 1.0316351652145386 AVG-LOSS :1.8987153082442798

Confusion Matrix : 
[[402   2   2]
 [467   1   1]
 [231   0   1]]
F-Measure : 0.19936982277739135

-=-=-=-=-=-=-=-=-=-=-=-=-=-=-=-- Test iteration 139 on DEV -- LR :7.599999999999979e-05 C-LOSS : 1.0910786390304565 AVG-LOSS :1.8929464748927525

Confusion Matrix : 
[[401   2   3]
 [467   1   1]
 [230   1   1]]
F-Measure : 0.19913119513411562

-=-=-=-=-=-=-=-=-=-=-=-=-=-=-=-- Test iteration 140 on DEV -- LR :6.940000000000006e-05 C-LOSS : 1.0250771045684814 AVG-LOSS :1.886791372975559

Confusion Matrix : 
[[401   2   3]
 [466   2   1]
 [230   1   1]]
F-Measure : 0.20104516324590324

-=-=-=-=-=-=-=-=-=-=-=-=-=-=-=-- Test iteration 141 on DEV -- LR :6.27999999999999e-05 C-LOSS : 1.0222725868225098 AVG-LOSS :1.8807032125096925

Confusion Matrix : 
[[400   2   4]
 [466   2   1]
 [230   1   1]]
F-Measure : 0.20067966792854144

-=-=-=-=-=-=-=-=-=-=-=-=-=-=-=-- Test iteration 142 on DEV -- LR :5.6200000000000173e-05 C-LOSS : 1.0621633529663086 AVG-LOSS :1.8749791575478507

Confusion Matrix : 
[[400   2   4]
 [466   2   1]
 [230   1   1]]
F-Measure : 0.20067966792854144

-=-=-=-=-=-=-=-=-=-=-=-=-=-=-=-- Test iteration 143 on DEV -- LR :4.960000000000001e-05 C-LOSS : 1.0554084777832031 AVG-LOSS :1.8692876944939296

Confusion Matrix : 
[[399   2   5]
 [466   2   1]
 [230   1   1]]
F-Measure : 0.20031375769389165

-=-=-=-=-=-=-=-=-=-=-=-=-=-=-=-- Test iteration 144 on DEV -- LR :4.299999999999996e-05 C-LOSS : 1.057732105255127 AVG-LOSS :1.8636907593957308

Confusion Matrix : 
[[399   2   5]
 [466   2   1]
 [230   1   1]]
F-Measure : 0.20031375769389165

-=-=-=-=-=-=-=-=-=-=-=-=-=-=-=-- Test iteration 145 on DEV -- LR :3.63999999999998e-05 C-LOSS : 1.0070513486862183 AVG-LOSS :1.8578233661716932

Confusion Matrix : 
[[399   2   5]
 [466   2   1]
 [230   1   1]]
F-Measure : 0.20031375769389165

-=-=-=-=-=-=-=-=-=-=-=-=-=-=-=-- Test iteration 146 on DEV -- LR :2.9800000000000074e-05 C-LOSS : 1.0580902099609375 AVG-LOSS :1.8523830045648173

Confusion Matrix : 
[[399   2   5]
 [466   2   1]
 [230   1   1]]
F-Measure : 0.20031375769389165

-=-=-=-=-=-=-=-=-=-=-=-=-=-=-=-- Test iteration 147 on DEV -- LR :2.3199999999999913e-05 C-LOSS : 1.0331308841705322 AVG-LOSS :1.846847517264856

Confusion Matrix : 
[[399   2   5]
 [465   3   1]
 [230   1   1]]
F-Measure : 0.202220084119655

-=-=-=-=-=-=-=-=-=-=-=-=-=-=-=-- Test iteration 148 on DEV -- LR :1.6600000000000078e-05 C-LOSS : 1.051501750946045 AVG-LOSS :1.8415096262157364

Confusion Matrix : 
[[399   2   5]
 [465   3   1]
 [230   1   1]]
F-Measure : 0.202220084119655

-=-=-=-=-=-=-=-=-=-=-=-=-=-=-=-- Test iteration 149 on DEV -- LR :1.0000000000000026e-05 C-LOSS : 1.0160958766937256 AVG-LOSS :1.8360068678855896

Confusion Matrix : 
[[399   2   5]
 [465   3   1]
 [230   1   1]]
F-Measure : 0.202220084119655

-=-=-=-=-=-=-=-=-=-=-=-=-=-=-=-- Train epoch 2 --=-=-=-=-=-=-=-=-=-=-=-=-=-


-=-=-=-=-=-=-=-=-=-=-=-=-=-=-=-- Test iteration 150 on DEV -- LR :1.6600000000000078e-05 C-LOSS : 2.663398504257202 AVG-LOSS :1.8414862826959977

Confusion Matrix : 
[[404   0   2]
 [469   0   0]
 [231   0   1]]
F-Measure : 0.1980350489710336

-=-=-=-=-=-=-=-=-=-=-=-=-=-=-=-- Test iteration 151 on DEV -- LR :2.3200000000000347e-05 C-LOSS : 1.0733405351638794 AVG-LOSS :1.8364326922517074

Confusion Matrix : 
[[404   0   2]
 [469   0   0]
 [231   0   1]]
F-Measure : 0.1980350489710336

-=-=-=-=-=-=-=-=-=-=-=-=-=-=-=-- Test iteration 152 on DEV -- LR :2.9800000000000074e-05 C-LOSS : 1.1003526449203491 AVG-LOSS :1.8316217115501952

Confusion Matrix : 
[[404   0   2]
 [469   0   0]
 [231   0   1]]
F-Measure : 0.1980350489710336

-=-=-=-=-=-=-=-=-=-=-=-=-=-=-=-- Test iteration 153 on DEV -- LR :3.63999999999998e-05 C-LOSS : 1.0033665895462036 AVG-LOSS :1.8262434315371823

Confusion Matrix : 
[[404   0   2]
 [469   0   0]
 [231   0   1]]
F-Measure : 0.1980350489710336

-=-=-=-=-=-=-=-=-=-=-=-=-=-=-=-- Test iteration 154 on DEV -- LR :4.299999999999996e-05 C-LOSS : 1.0049397945404053 AVG-LOSS :1.8209446983952675

Confusion Matrix : 
[[404   0   2]
 [468   0   1]
 [231   0   1]]
F-Measure : 0.19815754521807855

-=-=-=-=-=-=-=-=-=-=-=-=-=-=-=-- Test iteration 155 on DEV -- LR :4.960000000000001e-05 C-LOSS : 1.0992149114608765 AVG-LOSS :1.8163182254020984

Confusion Matrix : 
[[404   0   2]
 [468   0   1]
 [231   0   1]]
F-Measure : 0.19815754521807855

-=-=-=-=-=-=-=-=-=-=-=-=-=-=-=-- Test iteration 156 on DEV -- LR :5.6200000000000173e-05 C-LOSS : 1.0517935752868652 AVG-LOSS :1.8114486416434026

Confusion Matrix : 
[[404   0   2]
 [467   1   1]
 [231   0   1]]
F-Measure : 0.20009061238864306

-=-=-=-=-=-=-=-=-=-=-=-=-=-=-=-- Test iteration 157 on DEV -- LR :6.27999999999999e-05 C-LOSS : 1.044643521308899 AVG-LOSS :1.8065954446792603

Confusion Matrix : 
[[403   1   2]
 [466   1   2]
 [231   0   1]]
F-Measure : 0.19985320139933213

-=-=-=-=-=-=-=-=-=-=-=-=-=-=-=-- Test iteration 158 on DEV -- LR :6.940000000000006e-05 C-LOSS : 1.1224949359893799 AVG-LOSS :1.8022929257566824

Confusion Matrix : 
[[402   1   3]
 [465   1   3]
 [231   0   1]]
F-Measure : 0.19961171099159292

-=-=-=-=-=-=-=-=-=-=-=-=-=-=-=-- Test iteration 159 on DEV -- LR :7.599999999999979e-05 C-LOSS : 1.0968718528747559 AVG-LOSS :1.7978840440511703

Confusion Matrix : 
[[400   1   5]
 [464   1   4]
 [231   0   1]]
F-Measure : 0.19900445957867954

-=-=-=-=-=-=-=-=-=-=-=-=-=-=-=-- Test iteration 160 on DEV -- LR :8.259999999999995e-05 C-LOSS : 1.0383338928222656 AVG-LOSS :1.7931663412485064

Confusion Matrix : 
[[397   2   7]
 [463   1   5]
 [231   0   1]]
F-Measure : 0.1980317787232765

-=-=-=-=-=-=-=-=-=-=-=-=-=-=-=-- Test iteration 161 on DEV -- LR :8.920000000000011e-05 C-LOSS : 1.0471928119659424 AVG-LOSS :1.7885615663763919

Confusion Matrix : 
[[396   2   8]
 [462   3   4]
 [230   1   1]]
F-Measure : 0.20148780825653734

-=-=-=-=-=-=-=-=-=-=-=-=-=-=-=-- Test iteration 162 on DEV -- LR :9.580000000000027e-05 C-LOSS : 1.068306803703308 AVG-LOSS :1.7841428255010967

Confusion Matrix : 
[[395   3   8]
 [462   3   4]
 [230   1   1]]
F-Measure : 0.2011154879891501

-=-=-=-=-=-=-=-=-=-=-=-=-=-=-=-- Test iteration 163 on DEV -- LR :0.0001024 C-LOSS : 1.0707943439483643 AVG-LOSS :1.7797931396379703

Confusion Matrix : 
[[391   4  11]
 [461   4   4]
 [230   1   1]]
F-Measure : 0.2015254017134284

-=-=-=-=-=-=-=-=-=-=-=-=-=-=-=-- Test iteration 164 on DEV -- LR :0.00010900000000000016 C-LOSS : 1.0459226369857788 AVG-LOSS :1.7753454396218964

Confusion Matrix : 
[[391   5  10]
 [459   5   5]
 [230   1   1]]
F-Measure : 0.20352055280045217

-=-=-=-=-=-=-=-=-=-=-=-=-=-=-=-- Test iteration 165 on DEV -- LR :0.00011559999999999977 C-LOSS : 1.1138209104537964 AVG-LOSS :1.7713603520967873

Confusion Matrix : 
[[391   5  10]
 [459   5   5]
 [230   1   1]]
F-Measure : 0.20352055280045217

-=-=-=-=-=-=-=-=-=-=-=-=-=-=-=-- Test iteration 166 on DEV -- LR :0.00012219999999999993 C-LOSS : 1.0449867248535156 AVG-LOSS :1.767010809418684

Confusion Matrix : 
[[390   4  12]
 [460   4   5]
 [229   1   2]]
F-Measure : 0.20307055898178947

-=-=-=-=-=-=-=-=-=-=-=-=-=-=-=-- Test iteration 167 on DEV -- LR :0.0001288000000000001 C-LOSS : 1.054335355758667 AVG-LOSS :1.7627686936230886

Confusion Matrix : 
[[390   3  13]
 [459   4   6]
 [227   1   4]]
F-Measure : 0.20671045166315086

-=-=-=-=-=-=-=-=-=-=-=-=-=-=-=-- Test iteration 168 on DEV -- LR :0.00013540000000000026 C-LOSS : 1.0317707061767578 AVG-LOSS :1.758443261744708

Confusion Matrix : 
[[390   3  13]
 [458   4   7]
 [224   1   7]]
F-Measure : 0.2119863464747366

-=-=-=-=-=-=-=-=-=-=-=-=-=-=-=-- Test iteration 169 on DEV -- LR :0.00014199999999999998 C-LOSS : 1.054076075553894 AVG-LOSS :1.7542999253553502

Confusion Matrix : 
[[388   2  16]
 [457   2  10]
 [224   0   8]]
F-Measure : 0.20914033307602575

-=-=-=-=-=-=-=-=-=-=-=-=-=-=-=-- Test iteration 170 on DEV -- LR :0.0001485999999999997 C-LOSS : 1.0677533149719238 AVG-LOSS :1.7502850328969677

Confusion Matrix : 
[[391   0  15]
 [458   1  10]
 [224   0   8]]
F-Measure : 0.20837394626678327

-=-=-=-=-=-=-=-=-=-=-=-=-=-=-=-- Test iteration 171 on DEV -- LR :0.00015519999999999987 C-LOSS : 1.0375009775161743 AVG-LOSS :1.7461409395517304

Confusion Matrix : 
[[394   0  12]
 [461   1   7]
 [229   0   3]]
F-Measure : 0.20071620430440013

-=-=-=-=-=-=-=-=-=-=-=-=-=-=-=-- Test iteration 172 on DEV -- LR :0.00016180000000000003 C-LOSS : 1.0288159847259521 AVG-LOSS :1.741994552529616

Confusion Matrix : 
[[395   1  10]
 [463   1   5]
 [231   0   1]]
F-Measure : 0.1972938402827464

-=-=-=-=-=-=-=-=-=-=-=-=-=-=-=-- Test iteration 173 on DEV -- LR :0.0001684000000000002 C-LOSS : 1.0494461059570312 AVG-LOSS :1.7380143890435669

Confusion Matrix : 
[[399   3   4]
 [465   2   2]
 [230   1   1]]
F-Measure : 0.20043622066698538

-=-=-=-=-=-=-=-=-=-=-=-=-=-=-=-- Test iteration 174 on DEV -- LR :0.00017500000000000035 C-LOSS : 1.024906039237976 AVG-LOSS :1.7339394841875349

Confusion Matrix : 
[[400   3   3]
 [466   3   0]
 [230   1   1]]
F-Measure : 0.20245968659312305

-=-=-=-=-=-=-=-=-=-=-=-=-=-=-=-- Test iteration 175 on DEV -- LR :0.00018160000000000008 C-LOSS : 0.9827773571014404 AVG-LOSS :1.729671517556364

Confusion Matrix : 
[[402   3   1]
 [466   3   0]
 [230   1   1]]
F-Measure : 0.20319051917917033

-=-=-=-=-=-=-=-=-=-=-=-=-=-=-=-- Test iteration 176 on DEV -- LR :0.0001881999999999997 C-LOSS : 1.0446890592575073 AVG-LOSS :1.7258015601648449

Confusion Matrix : 
[[403   3   0]
 [465   4   0]
 [230   1   1]]
F-Measure : 0.20545110393932295

-=-=-=-=-=-=-=-=-=-=-=-=-=-=-=-- Test iteration 177 on DEV -- LR :0.00019479999999999986 C-LOSS : 1.1017861366271973 AVG-LOSS :1.7222958555382288

Confusion Matrix : 
[[402   4   0]
 [465   4   0]
 [230   1   1]]
F-Measure : 0.20507897508626646

-=-=-=-=-=-=-=-=-=-=-=-=-=-=-=-- Test iteration 178 on DEV -- LR :0.00020140000000000002 C-LOSS : 1.0582401752471924 AVG-LOSS :1.7185860472684467

Confusion Matrix : 
[[402   4   0]
 [465   4   0]
 [230   1   1]]
F-Measure : 0.20507897508626646

-=-=-=-=-=-=-=-=-=-=-=-=-=-=-=-- Test iteration 179 on DEV -- LR :0.00020800000000000018 C-LOSS : 1.0988942384719849 AVG-LOSS :1.7151433149973552

Confusion Matrix : 
[[400   4   2]
 [465   4   0]
 [230   1   1]]
F-Measure : 0.20434770950383305

-=-=-=-=-=-=-=-=-=-=-=-=-=-=-=-- Test iteration 180 on DEV -- LR :0.00021460000000000034 C-LOSS : 1.0262545347213745 AVG-LOSS :1.7113372996367144

Confusion Matrix : 
[[397   4   5]
 [464   4   1]
 [230   1   1]]
F-Measure : 0.20337019723498911

-=-=-=-=-=-=-=-=-=-=-=-=-=-=-=-- Test iteration 181 on DEV -- LR :0.00022120000000000006 C-LOSS : 1.0524615049362183 AVG-LOSS :1.7077171029625358

Confusion Matrix : 
[[394   3   9]
 [460   3   6]
 [229   1   2]]
F-Measure : 0.20280004775089966

-=-=-=-=-=-=-=-=-=-=-=-=-=-=-=-- Test iteration 182 on DEV -- LR :0.0002277999999999998 C-LOSS : 1.0472880601882935 AVG-LOSS :1.7041082010894526

Confusion Matrix : 
[[382   2  22]
 [457   3   9]
 [222   1   9]]
F-Measure : 0.2102241985826008

-=-=-=-=-=-=-=-=-=-=-=-=-=-=-=-- Test iteration 183 on DEV -- LR :0.00023439999999999995 C-LOSS : 1.0578545331954956 AVG-LOSS :1.7005959528943766

Confusion Matrix : 
[[362   2  42]
 [449   2  18]
 [203   1  28]]
F-Measure : 0.22724536839076914

-=-=-=-=-=-=-=-=-=-=-=-=-=-=-=-- Test iteration 184 on DEV -- LR :0.0002410000000000001 C-LOSS : 1.0256258249282837 AVG-LOSS :1.6969474657161816

Confusion Matrix : 
[[341   1  64]
 [444   1  24]
 [188   0  44]]
F-Measure : 0.23384941074209467

-=-=-=-=-=-=-=-=-=-=-=-=-=-=-=-- Test iteration 185 on DEV -- LR :0.00024760000000000027 C-LOSS : 1.0573071241378784 AVG-LOSS :1.6935085391485563

Confusion Matrix : 
[[335   0  71]
 [439   1  29]
 [180   0  52]]
F-Measure : 0.2392446105659777

-=-=-=-=-=-=-=-=-=-=-=-=-=-=-=-- Test iteration 186 on DEV -- LR :0.0002542 C-LOSS : 1.0259933471679688 AVG-LOSS :1.6899389391914408

Confusion Matrix : 
[[342   0  64]
 [442   1  26]
 [184   0  48]]
F-Measure : 0.23875688924421823

-=-=-=-=-=-=-=-=-=-=-=-=-=-=-=-- Test iteration 187 on DEV -- LR :0.00026080000000000005 C-LOSS : 1.0767269134521484 AVG-LOSS :1.6866771730970829

Confusion Matrix : 
[[361   0  45]
 [449   1  19]
 [199   0  33]]
F-Measure : 0.23098211575769656

-=-=-=-=-=-=-=-=-=-=-=-=-=-=-=-- Test iteration 188 on DEV -- LR :0.0002673999999999998 C-LOSS : 1.088362216949463 AVG-LOSS :1.6835114854984183

Confusion Matrix : 
[[387   0  19]
 [456   1  12]
 [218   0  14]]
F-Measure : 0.21649105435936083

-=-=-=-=-=-=-=-=-=-=-=-=-=-=-=-- Test iteration 189 on DEV -- LR :0.00027399999999999994 C-LOSS : 1.0186935663223267 AVG-LOSS :1.680012443818544

Confusion Matrix : 
[[396   2   8]
 [462   1   6]
 [230   0   2]]
F-Measure : 0.19960084849332865

-=-=-=-=-=-=-=-=-=-=-=-=-=-=-=-- Test iteration 190 on DEV -- LR :0.0002806000000000001 C-LOSS : 1.00103759765625 AVG-LOSS :1.6764576016920398

Confusion Matrix : 
[[398   4   4]
 [465   3   1]
 [230   1   1]]
F-Measure : 0.2018458420644004

-=-=-=-=-=-=-=-=-=-=-=-=-=-=-=-- Test iteration 191 on DEV -- LR :0.00028720000000000026 C-LOSS : 0.9596639275550842 AVG-LOSS :1.6727243013059099

Confusion Matrix : 
[[401   4   1]
 [464   4   1]
 [230   1   1]]
F-Measure : 0.20483639304934045

-=-=-=-=-=-=-=-=-=-=-=-=-=-=-=-- Test iteration 192 on DEV -- LR :0.0002938 C-LOSS : 1.0451661348342896 AVG-LOSS :1.6694727045884403

Confusion Matrix : 
[[400   6   0]
 [464   5   0]
 [231   1   0]]
F-Measure : 0.204281475791526

-=-=-=-=-=-=-=-=-=-=-=-=-=-=-=-- Test iteration 193 on DEV -- LR :0.0003003999999999997 C-LOSS : 0.9873838424682617 AVG-LOSS :1.6659567826187487

Confusion Matrix : 
[[400   6   0]
 [464   5   0]
 [231   1   0]]
F-Measure : 0.204281475791526

-=-=-=-=-=-=-=-=-=-=-=-=-=-=-=-- Test iteration 194 on DEV -- LR :0.00030699999999999987 C-LOSS : 1.0507025718688965 AVG-LOSS :1.6628016328200317

Confusion Matrix : 
[[402   4   0]
 [466   3   0]
 [231   1   0]]
F-Measure : 0.2012578087850012

-=-=-=-=-=-=-=-=-=-=-=-=-=-=-=-- Test iteration 195 on DEV -- LR :0.00031360000000000003 C-LOSS : 1.0498074293136597 AVG-LOSS :1.6596741113735705

Confusion Matrix : 
[[403   3   0]
 [468   1   0]
 [232   0   0]]
F-Measure : 0.1976867956975213

-=-=-=-=-=-=-=-=-=-=-=-=-=-=-=-- Test iteration 196 on DEV -- LR :0.0003202000000000002 C-LOSS : 1.0580832958221436 AVG-LOSS :1.656620350888538

Confusion Matrix : 
[[403   2   1]
 [467   1   1]
 [232   0   0]]
F-Measure : 0.1978204951541041

-=-=-=-=-=-=-=-=-=-=-=-=-=-=-=-- Test iteration 197 on DEV -- LR :0.00032680000000000035 C-LOSS : 1.0324326753616333 AVG-LOSS :1.6534678878808262

Confusion Matrix : 
[[402   2   2]
 [467   1   1]
 [232   0   0]]
F-Measure : 0.19746383376842364

-=-=-=-=-=-=-=-=-=-=-=-=-=-=-=-- Test iteration 198 on DEV -- LR :0.00033339999999999997 C-LOSS : 1.0408036708831787 AVG-LOSS :1.6503891732225466

Confusion Matrix : 
[[402   1   3]
 [464   1   4]
 [230   0   2]]
F-Measure : 0.20159743588863183

-=-=-=-=-=-=-=-=-=-=-=-=-=-=-=-- Test iteration 199 on DEV -- LR :0.0003399999999999997 C-LOSS : 1.0435771942138672 AVG-LOSS :1.6473551133275033

Confusion Matrix : 
[[397   2   7]
 [460   1   8]
 [226   0   6]]
F-Measure : 0.2073064304807931

-=-=-=-=-=-=-=-=-=-=-=-=-=-=-=-- Test iteration 200 on DEV -- LR :0.00034659999999999986 C-LOSS : 1.0296052694320679 AVG-LOSS :1.6442817310195657

Confusion Matrix : 
[[386   3  17]
 [453   2  14]
 [209   0  23]]
F-Measure : 0.2320124916199041

-=-=-=-=-=-=-=-=-=-=-=-=-=-=-=-- Test iteration 201 on DEV -- LR :0.0003532 C-LOSS : 0.9877407550811768 AVG-LOSS :1.6410315281683856

Confusion Matrix : 
[[364   5  37]
 [429   8  32]
 [196   4  32]]
F-Measure : 0.2456238665904753

-=-=-=-=-=-=-=-=-=-=-=-=-=-=-=-- Test iteration 202 on DEV -- LR :0.0003598000000000002 C-LOSS : 1.074172854423523 AVG-LOSS :1.6382391209085587

Confusion Matrix : 
[[351   6  49]
 [413  15  41]
 [186   6  40]]
F-Measure : 0.261809841394652

-=-=-=-=-=-=-=-=-=-=-=-=-=-=-=-- Test iteration 203 on DEV -- LR :0.00036640000000000034 C-LOSS : 1.0894503593444824 AVG-LOSS :1.6355489799204994

Confusion Matrix : 
[[365   5  36]
 [425  15  29]
 [195   4  33]]
F-Measure : 0.2601709916502701

-=-=-=-=-=-=-=-=-=-=-=-=-=-=-=-- Test iteration 204 on DEV -- LR :0.00037300000000000007 C-LOSS : 1.0134673118591309 AVG-LOSS :1.6325144351982488

Confusion Matrix : 
[[393   3  10]
 [453   6  10]
 [219   4   9]]
F-Measure : 0.22097062860819136

-=-=-=-=-=-=-=-=-=-=-=-=-=-=-=-- Test iteration 205 on DEV -- LR :0.0003795999999999998 C-LOSS : 1.052793264389038 AVG-LOSS :1.6297002547574275

Confusion Matrix : 
[[397   3   6]
 [459   3   7]
 [225   2   5]]
F-Measure : 0.20954610222037193

-=-=-=-=-=-=-=-=-=-=-=-=-=-=-=-- Test iteration 206 on DEV -- LR :0.00038619999999999995 C-LOSS : 1.0279295444488525 AVG-LOSS :1.6267931498767096

Confusion Matrix : 
[[400   3   3]
 [462   4   3]
 [230   1   1]]
F-Measure : 0.2047241920441983

-=-=-=-=-=-=-=-=-=-=-=-=-=-=-=-- Test iteration 207 on DEV -- LR :0.0003928000000000001 C-LOSS : 1.093815803527832 AVG-LOSS :1.6242307587884939

Confusion Matrix : 
[[398   5   3]
 [460   6   3]
 [231   1   0]]
F-Measure : 0.2058463063765291

-=-=-=-=-=-=-=-=-=-=-=-=-=-=-=-- Test iteration 208 on DEV -- LR :0.0003994000000000003 C-LOSS : 1.0518193244934082 AVG-LOSS :1.621491948098087

Confusion Matrix : 
[[397   7   2]
 [453  15   1]
 [227   4   1]]
F-Measure : 0.22381502882028292

-=-=-=-=-=-=-=-=-=-=-=-=-=-=-=-- Test iteration 209 on DEV -- LR :0.0004059999999999999 C-LOSS : 1.0209970474243164 AVG-LOSS :1.6186324485710688

Confusion Matrix : 
[[397   7   2]
 [451  17   1]
 [227   4   1]]
F-Measure : 0.22738667599881363

-=-=-=-=-=-=-=-=-=-=-=-=-=-=-=-- Test iteration 210 on DEV -- LR :0.00041260000000000005 C-LOSS : 1.0815774202346802 AVG-LOSS :1.6160871640765837

Confusion Matrix : 
[[397   7   2]
 [459   9   1]
 [228   3   1]]
F-Measure : 0.2128427821816921

-=-=-=-=-=-=-=-=-=-=-=-=-=-=-=-- Test iteration 211 on DEV -- LR :0.0004191999999999998 C-LOSS : 1.049497365951538 AVG-LOSS :1.6134145706892014

Confusion Matrix : 
[[399   5   2]
 [460   8   1]
 [230   1   1]]
F-Measure : 0.21157788152653678

-=-=-=-=-=-=-=-=-=-=-=-=-=-=-=-- Test iteration 212 on DEV -- LR :0.00042579999999999994 C-LOSS : 1.0181310176849365 AVG-LOSS :1.6106198122243927

Confusion Matrix : 
[[396   4   6]
 [462   4   3]
 [230   1   1]]
F-Measure : 0.20324809703657515

-=-=-=-=-=-=-=-=-=-=-=-=-=-=-=-- Test iteration 213 on DEV -- LR :0.0004324000000000001 C-LOSS : 1.0350098609924316 AVG-LOSS :1.6079300460971404

Confusion Matrix : 
[[394   3   9]
 [462   3   4]
 [229   1   2]]
F-Measure : 0.20256695544641096

-=-=-=-=-=-=-=-=-=-=-=-=-=-=-=-- Test iteration 214 on DEV -- LR :0.00043900000000000026 C-LOSS : 1.0841490030288696 AVG-LOSS :1.6054938551991484

Confusion Matrix : 
[[392   4  10]
 [459   4   6]
 [227   1   4]]
F-Measure : 0.2075022744243473

-=-=-=-=-=-=-=-=-=-=-=-=-=-=-=-- Test iteration 215 on DEV -- LR :0.0004456 C-LOSS : 1.0806554555892944 AVG-LOSS :1.6030640477935474

Confusion Matrix : 
[[390   5  11]
 [456   8   5]
 [226   1   5]]
F-Measure : 0.21587055941564223

-=-=-=-=-=-=-=-=-=-=-=-=-=-=-=-- Test iteration 216 on DEV -- LR :0.00045220000000000015 C-LOSS : 1.0742493867874146 AVG-LOSS :1.60062711387186

Confusion Matrix : 
[[386   7  13]
 [453  12   4]
 [222   2   8]]
F-Measure : 0.22680224636787738

-=-=-=-=-=-=-=-=-=-=-=-=-=-=-=-- Test iteration 217 on DEV -- LR :0.0004587999999999999 C-LOSS : 1.0611621141433716 AVG-LOSS :1.5981525037813624

Confusion Matrix : 
[[378  19   9]
 [439  25   5]
 [217   8   7]]
F-Measure : 0.2448035606079624

-=-=-=-=-=-=-=-=-=-=-=-=-=-=-=-- Test iteration 218 on DEV -- LR :0.00046540000000000004 C-LOSS : 1.0536116361618042 AVG-LOSS :1.5956660158013645

Confusion Matrix : 
[[379  19   8]
 [438  28   3]
 [221   7   4]]
F-Measure : 0.24467391773112296

-=-=-=-=-=-=-=-=-=-=-=-=-=-=-=-- Test iteration 219 on DEV -- LR :0.0004720000000000001 C-LOSS : 1.0391950607299805 AVG-LOSS :1.5931366023692217

Confusion Matrix : 
[[389  12   5]
 [451  16   2]
 [227   4   1]]
F-Measure : 0.22251850218431588

-=-=-=-=-=-=-=-=-=-=-=-=-=-=-=-- Test iteration 220 on DEV -- LR :0.00047860000000000025 C-LOSS : 1.0620843172073364 AVG-LOSS :1.5907336508526522

Confusion Matrix : 
[[398   4   4]
 [460   9   0]
 [230   1   1]]
F-Measure : 0.2129647670866827

-=-=-=-=-=-=-=-=-=-=-=-=-=-=-=-- Test iteration 221 on DEV -- LR :0.0004852 C-LOSS : 1.0464885234832764 AVG-LOSS :1.5882820962248623

Confusion Matrix : 
[[398   1   7]
 [466   1   2]
 [231   0   1]]
F-Measure : 0.19802709248766467

-=-=-=-=-=-=-=-=-=-=-=-=-=-=-=-- Test iteration 222 on DEV -- LR :0.0004917999999999997 C-LOSS : 1.0111420154571533 AVG-LOSS :1.5856940241137962

Confusion Matrix : 
[[394   1  11]
 [465   1   3]
 [229   0   3]]
F-Measure : 0.20029247498993918

-=-=-=-=-=-=-=-=-=-=-=-=-=-=-=-- Test iteration 223 on DEV -- LR :0.0004983999999999999 C-LOSS : 1.0448747873306274 AVG-LOSS :1.5832796525210142

Confusion Matrix : 
[[390   1  15]
 [457   0  12]
 [223   0   9]]
F-Measure : 0.20789063692926296

-=-=-=-=-=-=-=-=-=-=-=-=-=-=-=-- Test iteration 224 on DEV -- LR :0.000505 C-LOSS : 1.0245189666748047 AVG-LOSS :1.580796271695031

Confusion Matrix : 
[[351   1  54]
 [436   0  33]
 [198   0  34]]
F-Measure : 0.22546378897199087

-=-=-=-=-=-=-=-=-=-=-=-=-=-=-=-- Train epoch 3 --=-=-=-=-=-=-=-=-=-=-=-=-=-


-=-=-=-=-=-=-=-=-=-=-=-=-=-=-=-- Test iteration 225 on DEV -- LR :0.0005116000000000002 C-LOSS : 1.2263034582138062 AVG-LOSS :1.5792277194229902

Confusion Matrix : 
[[388   0  18]
 [457   0  12]
 [220   1  11]]
F-Measure : 0.21036502332893814

-=-=-=-=-=-=-=-=-=-=-=-=-=-=-=-- Test iteration 226 on DEV -- LR :0.0005182000000000003 C-LOSS : 1.0624687671661377 AVG-LOSS :1.5769512482676737

Confusion Matrix : 
[[367   2  37]
 [449   0  20]
 [213   2  17]]
F-Measure : 0.21088172580009448

-=-=-=-=-=-=-=-=-=-=-=-=-=-=-=-- Test iteration 227 on DEV -- LR :0.0005248 C-LOSS : 0.9615703821182251 AVG-LOSS :1.5742522093810534

Confusion Matrix : 
[[380   2  24]
 [456   0  13]
 [219   2  11]]
F-Measure : 0.20725057014267548

-=-=-=-=-=-=-=-=-=-=-=-=-=-=-=-- Test iteration 228 on DEV -- LR :0.0005313999999999998 C-LOSS : 1.0325078964233398 AVG-LOSS :1.5718865136912816

Confusion Matrix : 
[[386   2  18]
 [461   1   7]
 [224   2   6]]
F-Measure : 0.20304696033430186

-=-=-=-=-=-=-=-=-=-=-=-=-=-=-=-- Test iteration 229 on DEV -- LR :0.0005379999999999998 C-LOSS : 1.0008150339126587 AVG-LOSS :1.5694035942139832

Confusion Matrix : 
[[396   3   7]
 [463   4   2]
 [229   0   3]]
F-Measure : 0.2066993555886305

-=-=-=-=-=-=-=-=-=-=-=-=-=-=-=-- Test iteration 230 on DEV -- LR :0.0005446000000000001 C-LOSS : 1.0735938549041748 AVG-LOSS :1.5672572317061486

Confusion Matrix : 
[[398   3   5]
 [457  10   2]
 [229   1   2]]
F-Measure : 0.21695352895845843

-=-=-=-=-=-=-=-=-=-=-=-=-=-=-=-- Test iteration 231 on DEV -- LR :0.0005512000000000002 C-LOSS : 1.009489893913269 AVG-LOSS :1.5648530621466965

Confusion Matrix : 
[[396   5   5]
 [446  23   0]
 [226   4   2]]
F-Measure : 0.23947061894049934

-=-=-=-=-=-=-=-=-=-=-=-=-=-=-=-- Test iteration 232 on DEV -- LR :0.0005577999999999999 C-LOSS : 1.0853649377822876 AVG-LOSS :1.5627951732009266

Confusion Matrix : 
[[385  13   8]
 [437  30   2]
 [221   7   4]]
F-Measure : 0.250689395570801

-=-=-=-=-=-=-=-=-=-=-=-=-=-=-=-- Test iteration 233 on DEV -- LR :0.0005644000000000001 C-LOSS : 1.0065631866455078 AVG-LOSS :1.5604181134293222

Confusion Matrix : 
[[390   5  11]
 [452  15   2]
 [223   3   6]]
F-Measure : 0.2303263915518189

-=-=-=-=-=-=-=-=-=-=-=-=-=-=-=-- Test iteration 234 on DEV -- LR :0.0005709999999999998 C-LOSS : 1.0894651412963867 AVG-LOSS :1.5584140582287564

Confusion Matrix : 
[[386   3  17]
 [461   4   3]
 [217   1  15]]
F-Measure : 0.22327613675679658

-=-=-=-=-=-=-=-=-=-=-=-=-=-=-=-- Test iteration 235 on DEV -- LR :0.0005775999999999999 C-LOSS : 0.9841572046279907 AVG-LOSS :1.5559807664762109

Confusion Matrix : 
[[383   3  20]
 [461   4   3]
 [218   0  15]]
F-Measure : 0.22179367609441666

-=-=-=-=-=-=-=-=-=-=-=-=-=-=-=-- Test iteration 236 on DEV -- LR :0.0005842000000000001 C-LOSS : 1.1210089921951294 AVG-LOSS :1.5541454425340966

Confusion Matrix : 
[[391   1  14]
 [461   4   3]
 [222   0  11]]
F-Measure : 0.21867832138095944

-=-=-=-=-=-=-=-=-=-=-=-=-=-=-=-- Test iteration 237 on DEV -- LR :0.0005908000000000003 C-LOSS : 1.0443528890609741 AVG-LOSS :1.552003457015302

Confusion Matrix : 
[[394   1  11]
 [460   4   4]
 [228   0   5]]
F-Measure : 0.20969313090686492

-=-=-=-=-=-=-=-=-=-=-=-=-=-=-=-- Test iteration 238 on DEV -- LR :0.0005973999999999999 C-LOSS : 1.0671825408935547 AVG-LOSS :1.549974917617303

Confusion Matrix : 
[[395   4   7]
 [456   5   7]
 [229   1   3]]
F-Measure : 0.20887441677208426

-=-=-=-=-=-=-=-=-=-=-=-=-=-=-=-- Test iteration 239 on DEV -- LR :0.0006040000000000002 C-LOSS : 1.0761715173721313 AVG-LOSS :1.5480007367829483

Confusion Matrix : 
[[394   5   7]
 [448   9  11]
 [226   3   4]]
F-Measure : 0.21836166748882233

-=-=-=-=-=-=-=-=-=-=-=-=-=-=-=-- Test iteration 240 on DEV -- LR :0.0006105999999999998 C-LOSS : 1.0246655941009521 AVG-LOSS :1.5458292216680851

Confusion Matrix : 
[[397   3   6]
 [456   3   9]
 [227   2   4]]
F-Measure : 0.20797654580370528

-=-=-=-=-=-=-=-=-=-=-=-=-=-=-=-- Test iteration 241 on DEV -- LR :0.0006172 C-LOSS : 1.032895803451538 AVG-LOSS :1.5437096620886779

Confusion Matrix : 
[[398   2   6]
 [461   3   4]
 [228   1   4]]
F-Measure : 0.2077067989919145

-=-=-=-=-=-=-=-=-=-=-=-=-=-=-=-- Test iteration 242 on DEV -- LR :0.0006238000000000001 C-LOSS : 1.0183515548706055 AVG-LOSS :1.5415476945692619

Confusion Matrix : 
[[399   0   7]
 [462   2   4]
 [226   1   6]]
F-Measure : 0.20972286435369844

-=-=-=-=-=-=-=-=-=-=-=-=-=-=-=-- Test iteration 243 on DEV -- LR :0.0006304000000000004 C-LOSS : 1.0115723609924316 AVG-LOSS :1.5393756645136192

Confusion Matrix : 
[[400   0   6]
 [466   1   1]
 [229   0   4]]
F-Measure : 0.20417719405661294

-=-=-=-=-=-=-=-=-=-=-=-=-=-=-=-- Test iteration 244 on DEV -- LR :0.000637 C-LOSS : 1.0492660999298096 AVG-LOSS :1.5373752173112363

Confusion Matrix : 
[[400   0   6]
 [466   1   1]
 [230   0   3]]
F-Measure : 0.20234311534346758

-=-=-=-=-=-=-=-=-=-=-=-=-=-=-=-- Test iteration 245 on DEV -- LR :0.0006435999999999997 C-LOSS : 1.057219386100769 AVG-LOSS :1.535423364338836

Confusion Matrix : 
[[399   0   7]
 [466   1   1]
 [227   0   6]]
F-Measure : 0.20740374660897182

-=-=-=-=-=-=-=-=-=-=-=-=-=-=-=-- Test iteration 246 on DEV -- LR :0.0006501999999999999 C-LOSS : 1.018808364868164 AVG-LOSS :1.5333318056365257

Confusion Matrix : 
[[381   0  25]
 [455   4   9]
 [211   1  21]]
F-Measure : 0.23018435141348279

-=-=-=-=-=-=-=-=-=-=-=-=-=-=-=-- Test iteration 247 on DEV -- LR :0.0006568 C-LOSS : 1.0189363956451416 AVG-LOSS :1.5312576305962378

Confusion Matrix : 
[[356   4  46]
 [447   7  14]
 [204   3  26]]
F-Measure : 0.23139555353830132

-=-=-=-=-=-=-=-=-=-=-=-=-=-=-=-- Test iteration 248 on DEV -- LR :0.0006634000000000002 C-LOSS : 1.0308358669281006 AVG-LOSS :1.5292479046377312

Confusion Matrix : 
[[357   4  45]
 [446  10  12]
 [204   4  25]]
F-Measure : 0.23613222730593944

-=-=-=-=-=-=-=-=-=-=-=-=-=-=-=-- Test iteration 249 on DEV -- LR :0.0006700000000000002 C-LOSS : 1.0329251289367676 AVG-LOSS :1.5272626135349274

Confusion Matrix : 
[[377   0  29]
 [458   1   9]
 [210   1  22]]
F-Measure : 0.22398893477727394

-=-=-=-=-=-=-=-=-=-=-=-=-=-=-=-- Test iteration 250 on DEV -- LR :0.0006766000000000001 C-LOSS : 1.1004753112792969 AVG-LOSS :1.525562265717176

Confusion Matrix : 
[[382   0  24]
 [460   0   8]
 [215   1  17]]
F-Measure : 0.21690274375568308

-=-=-=-=-=-=-=-=-=-=-=-=-=-=-=-- Test iteration 251 on DEV -- LR :0.0006831999999999997 C-LOSS : 1.021649718284607 AVG-LOSS :1.5235626127511737

Confusion Matrix : 
[[394   0  12]
 [460   2   6]
 [217   3  13]]
F-Measure : 0.2199740934688008

-=-=-=-=-=-=-=-=-=-=-=-=-=-=-=-- Test iteration 252 on DEV -- LR :0.0006898 C-LOSS : 1.0445020198822021 AVG-LOSS :1.5216690926212566

Confusion Matrix : 
[[395   3   8]
 [457   9   2]
 [225   3   5]]
F-Measure : 0.219615149339225

-=-=-=-=-=-=-=-=-=-=-=-=-=-=-=-- Test iteration 253 on DEV -- LR :0.0006964 C-LOSS : 1.0238040685653687 AVG-LOSS :1.5197089941013517

Confusion Matrix : 
[[391   8   7]
 [447  19   2]
 [224   7   2]]
F-Measure : 0.2308230996490855

-=-=-=-=-=-=-=-=-=-=-=-=-=-=-=-- Test iteration 254 on DEV -- LR :0.0007030000000000002 C-LOSS : 1.0148448944091797 AVG-LOSS :1.5177291348868724

Confusion Matrix : 
[[391  10   5]
 [440  24   4]
 [223   8   2]]
F-Measure : 0.2396811245955552

-=-=-=-=-=-=-=-=-=-=-=-=-=-=-=-- Test iteration 255 on DEV -- LR :0.0007096000000000003 C-LOSS : 1.0552375316619873 AVG-LOSS :1.5159225270617753

Confusion Matrix : 
[[391   8   7]
 [444  18   6]
 [223   8   2]]
F-Measure : 0.2296169265788221

-=-=-=-=-=-=-=-=-=-=-=-=-=-=-=-- Test iteration 256 on DEV -- LR :0.0007162000000000001 C-LOSS : 1.0114666223526 AVG-LOSS :1.513959663619327

Confusion Matrix : 
[[385  13   8]
 [434  25   9]
 [219  10   4]]
F-Measure : 0.2431646474813134

-=-=-=-=-=-=-=-=-=-=-=-=-=-=-=-- Test iteration 257 on DEV -- LR :0.0007227999999999998 C-LOSS : 1.0158571004867554 AVG-LOSS :1.512029033529666

Confusion Matrix : 
[[383  12  11]
 [432  24  12]
 [219  10   4]]
F-Measure : 0.24105054685575178

-=-=-=-=-=-=-=-=-=-=-=-=-=-=-=-- Test iteration 258 on DEV -- LR :0.0007294 C-LOSS : 0.9979861378669739 AVG-LOSS :1.5100443119247908

Confusion Matrix : 
[[386  10  10]
 [431  25  12]
 [220  10   3]]
F-Measure : 0.24231367023258837

-=-=-=-=-=-=-=-=-=-=-=-=-=-=-=-- Test iteration 259 on DEV -- LR :0.0007360000000000001 C-LOSS : 1.0049569606781006 AVG-LOSS :1.5081016682661497

Confusion Matrix : 
[[377  16  13]
 [418  37  13]
 [210  18   5]]
F-Measure : 0.2619994828367157

-=-=-=-=-=-=-=-=-=-=-=-=-=-=-=-- Test iteration 260 on DEV -- LR :0.0007426000000000002 C-LOSS : 1.0242056846618652 AVG-LOSS :1.5062476606661332

Confusion Matrix : 
[[347  32  27]
 [376  65  27]
 [183  36  14]]
F-Measure : 0.30502696128646606

-=-=-=-=-=-=-=-=-=-=-=-=-=-=-=-- Test iteration 261 on DEV -- LR :0.0007492 C-LOSS : 1.0356090068817139 AVG-LOSS :1.504451329926498

Confusion Matrix : 
[[312  63  31]
 [338 107  23]
 [157  59  17]]
F-Measure : 0.3420114628341386

-=-=-=-=-=-=-=-=-=-=-=-=-=-=-=-- Test iteration 262 on DEV -- LR :0.0007558 C-LOSS : 1.0794793367385864 AVG-LOSS :1.5028354668345287

Confusion Matrix : 
[[330  49  27]
 [360  87  21]
 [171  47  15]]
F-Measure : 0.3253786225616385

-=-=-=-=-=-=-=-=-=-=-=-=-=-=-=-- Test iteration 263 on DEV -- LR :0.0007623999999999998 C-LOSS : 1.0222922563552856 AVG-LOSS :1.5010152274008952

Confusion Matrix : 
[[374  16  16]
 [414  34  20]
 [206  17  10]]
F-Measure : 0.2647756288257509

-=-=-=-=-=-=-=-=-=-=-=-=-=-=-=-- Test iteration 264 on DEV -- LR :0.0007689999999999999 C-LOSS : 1.0312594175338745 AVG-LOSS :1.499242563967435

Confusion Matrix : 
[[393   4   9]
 [441  12  15]
 [222   3   8]]
F-Measure : 0.23071831740769666

-=-=-=-=-=-=-=-=-=-=-=-=-=-=-=-- Test iteration 265 on DEV -- LR :0.0007756000000000001 C-LOSS : 1.0668832063674927 AVG-LOSS :1.4976171528486382

Confusion Matrix : 
[[395   2   9]
 [448   7  13]
 [223   2   8]]
F-Measure : 0.22199405921460905

-=-=-=-=-=-=-=-=-=-=-=-=-=-=-=-- Test iteration 266 on DEV -- LR :0.0007822000000000003 C-LOSS : 1.0183753967285156 AVG-LOSS :1.495822239904368

Confusion Matrix : 
[[384   3  19]
 [447   7  14]
 [214   3  16]]
F-Measure : 0.2303099699125154

-=-=-=-=-=-=-=-=-=-=-=-=-=-=-=-- Test iteration 267 on DEV -- LR :0.0007888 C-LOSS : 1.02725350856781 AVG-LOSS :1.4940738491157988

Confusion Matrix : 
[[362   5  39]
 [442   7  19]
 [208   3  22]]
F-Measure : 0.22910026412263457

-=-=-=-=-=-=-=-=-=-=-=-=-=-=-=-- Test iteration 268 on DEV -- LR :0.0007953999999999997 C-LOSS : 1.0468783378601074 AVG-LOSS :1.492411412270982

Confusion Matrix : 
[[334  12  60]
 [412  20  36]
 [193   7  33]]
F-Measure : 0.25388019475540624

-=-=-=-=-=-=-=-=-=-=-=-=-=-=-=-- Test iteration 269 on DEV -- LR :0.0008019999999999999 C-LOSS : 0.9852856397628784 AVG-LOSS :1.4905331686691001

Confusion Matrix : 
[[335  12  59]
 [420  14  34]
 [193   8  32]]
F-Measure : 0.24269038023098358

-=-=-=-=-=-=-=-=-=-=-=-=-=-=-=-- Test iteration 270 on DEV -- LR :0.0008086 C-LOSS : 1.012193202972412 AVG-LOSS :1.4887680765447582

Confusion Matrix : 
[[347   8  51]
 [436   9  23]
 [202   5  26]]
F-Measure : 0.2313806744328379

-=-=-=-=-=-=-=-=-=-=-=-=-=-=-=-- Test iteration 271 on DEV -- LR :0.0008152000000000002 C-LOSS : 0.9484665989875793 AVG-LOSS :1.4867816740537392

Confusion Matrix : 
[[358   5  43]
 [440   6  22]
 [207   4  22]]
F-Measure : 0.22555202412755326

-=-=-=-=-=-=-=-=-=-=-=-=-=-=-=-- Test iteration 272 on DEV -- LR :0.0008218000000000004 C-LOSS : 1.048464298248291 AVG-LOSS :1.4851761159006056

Confusion Matrix : 
[[358   4  44]
 [439   5  24]
 [205   4  24]]
F-Measure : 0.22637964290403315

-=-=-=-=-=-=-=-=-=-=-=-=-=-=-=-- Test iteration 273 on DEV -- LR :0.0008284 C-LOSS : 1.0726336240768433 AVG-LOSS :1.483670486368402

Confusion Matrix : 
[[345   1  60]
 [429   3  36]
 [193   4  36]]
F-Measure : 0.23116148459007718

-=-=-=-=-=-=-=-=-=-=-=-=-=-=-=-- Test iteration 274 on DEV -- LR :0.0008349999999999997 C-LOSS : 1.0195988416671753 AVG-LOSS :1.481982953114943

Confusion Matrix : 
[[348   1  57]
 [424   7  37]
 [195   2  36]]
F-Measure : 0.24004622040512572

-=-=-=-=-=-=-=-=-=-=-=-=-=-=-=-- Test iteration 275 on DEV -- LR :0.0008415999999999999 C-LOSS : 1.0789220333099365 AVG-LOSS :1.4805225874634758

Confusion Matrix : 
[[352   9  45]
 [419  17  32]
 [194   6  33]]
F-Measure : 0.2575757019884457

-=-=-=-=-=-=-=-=-=-=-=-=-=-=-=-- Test iteration 276 on DEV -- LR :0.0008482 C-LOSS : 1.0191057920455933 AVG-LOSS :1.478856822859079

Confusion Matrix : 
[[346  28  32]
 [389  55  24]
 [191  20  22]]
F-Measure : 0.3017589641948198

-=-=-=-=-=-=-=-=-=-=-=-=-=-=-=-- Test iteration 277 on DEV -- LR :0.0008548000000000002 C-LOSS : 1.0723357200622559 AVG-LOSS :1.4773945167339106

Confusion Matrix : 
[[317  70  19]
 [319 131  18]
 [172  45  16]]
F-Measure : 0.3702174133181108

-=-=-=-=-=-=-=-=-=-=-=-=-=-=-=-- Test iteration 278 on DEV -- LR :0.0008614000000000003 C-LOSS : 0.9934560656547546 AVG-LOSS :1.475659970314272

Confusion Matrix : 
[[346  45  15]
 [372  78  18]
 [186  32  15]]
F-Measure : 0.3220690346661776

-=-=-=-=-=-=-=-=-=-=-=-=-=-=-=-- Test iteration 279 on DEV -- LR :0.0008680000000000001 C-LOSS : 1.0628618001937866 AVG-LOSS :1.4741856911352702

Confusion Matrix : 
[[370  19  17]
 [412  38  18]
 [200  20  13]]
F-Measure : 0.27396245311148565

-=-=-=-=-=-=-=-=-=-=-=-=-=-=-=-- Test iteration 280 on DEV -- LR :0.0008745999999999998 C-LOSS : 0.9861087203025818 AVG-LOSS :1.4724487624134457

Confusion Matrix : 
[[381   8  17]
 [424  27  17]
 [209  11  13]]
F-Measure : 0.26076841471961554

-=-=-=-=-=-=-=-=-=-=-=-=-=-=-=-- Test iteration 281 on DEV -- LR :0.0008812 C-LOSS : 1.0105466842651367 AVG-LOSS :1.4708108117817142

Confusion Matrix : 
[[373   7  26]
 [425  23  20]
 [207   9  17]]
F-Measure : 0.2564394663537289

-=-=-=-=-=-=-=-=-=-=-=-=-=-=-=-- Test iteration 282 on DEV -- LR :0.0008878000000000001 C-LOSS : 0.9585592150688171 AVG-LOSS :1.469000735468241

Confusion Matrix : 
[[351   6  49]
 [417  21  30]
 [194  10  29]]
F-Measure : 0.2591647480344263

-=-=-=-=-=-=-=-=-=-=-=-=-=-=-=-- Test iteration 283 on DEV -- LR :0.0008944000000000003 C-LOSS : 1.0747071504592896 AVG-LOSS :1.4676123777745476

Confusion Matrix : 
[[365   1  40]
 [441  10  17]
 [206   5  22]]
F-Measure : 0.2359625214718165

-=-=-=-=-=-=-=-=-=-=-=-=-=-=-=-- Test iteration 284 on DEV -- LR :0.0009009999999999999 C-LOSS : 0.9699123501777649 AVG-LOSS :1.465866061888243

Confusion Matrix : 
[[386   1  19]
 [462   2   4]
 [218   3  12]]
F-Measure : 0.21476457683512698

-=-=-=-=-=-=-=-=-=-=-=-=-=-=-=-- Test iteration 285 on DEV -- LR :0.0009076 C-LOSS : 0.9467905163764954 AVG-LOSS :1.4640511124284117

Confusion Matrix : 
[[388   1  17]
 [464   2   2]
 [223   2   8]]
F-Measure : 0.2086974852034103

-=-=-=-=-=-=-=-=-=-=-=-=-=-=-=-- Test iteration 286 on DEV -- LR :0.0009141999999999998 C-LOSS : 1.0905189514160156 AVG-LOSS :1.462749606640912

Confusion Matrix : 
[[377   3  26]
 [457   7   4]
 [214   4  15]]
F-Measure : 0.22518197659328118

-=-=-=-=-=-=-=-=-=-=-=-=-=-=-=-- Test iteration 287 on DEV -- LR :0.0009207999999999999 C-LOSS : 1.0503175258636475 AVG-LOSS :1.46131755080488

Confusion Matrix : 
[[328   9  69]
 [437  14  17]
 [195   9  29]]
F-Measure : 0.2348838691445317

-=-=-=-=-=-=-=-=-=-=-=-=-=-=-=-- Test iteration 288 on DEV -- LR :0.0009274000000000001 C-LOSS : 1.037639856338501 AVG-LOSS :1.4598515380212593

Confusion Matrix : 
[[261   3 142]
 [401  13  54]
 [154   2  77]]
F-Measure : 0.24334283867554193

-=-=-=-=-=-=-=-=-=-=-=-=-=-=-=-- Test iteration 289 on DEV -- LR :0.0009340000000000003 C-LOSS : 1.0168081521987915 AVG-LOSS :1.4583238022080782

Confusion Matrix : 
[[256   0 150]
 [402   7  59]
 [153   2  78]]
F-Measure : 0.2298489171410786

-=-=-=-=-=-=-=-=-=-=-=-=-=-=-=-- Test iteration 290 on DEV -- LR :0.0009406 C-LOSS : 0.9967649579048157 AVG-LOSS :1.4567376893410569

Confusion Matrix : 
[[353   0  53]
 [454   2  12]
 [203   1  29]]
F-Measure : 0.223783462593218

-=-=-=-=-=-=-=-=-=-=-=-=-=-=-=-- Test iteration 291 on DEV -- LR :0.0009472000000000001 C-LOSS : 0.9482042789459229 AVG-LOSS :1.454996136565731

Confusion Matrix : 
[[390   0  16]
 [460   2   6]
 [220   0  13]]
F-Measure : 0.2178322510061426

-=-=-=-=-=-=-=-=-=-=-=-=-=-=-=-- Test iteration 292 on DEV -- LR :0.0009537999999999999 C-LOSS : 1.0385570526123047 AVG-LOSS :1.4535748427638422

Confusion Matrix : 
[[397   0   9]
 [460   3   5]
 [226   0   7]]
F-Measure : 0.21255761604517126

-=-=-=-=-=-=-=-=-=-=-=-=-=-=-=-- Test iteration 293 on DEV -- LR :0.0009604 C-LOSS : 1.0397307872772217 AVG-LOSS :1.4521672099220508

Confusion Matrix : 
[[398   0   8]
 [461   3   4]
 [227   0   6]]
F-Measure : 0.21111754633594446

-=-=-=-=-=-=-=-=-=-=-=-=-=-=-=-- Test iteration 294 on DEV -- LR :0.0009670000000000002 C-LOSS : 1.0147477388381958 AVG-LOSS :1.45068443205397

Confusion Matrix : 
[[395   1  10]
 [455   7   6]
 [224   1   8]]
F-Measure : 0.22128085081182972

-=-=-=-=-=-=-=-=-=-=-=-=-=-=-=-- Test iteration 295 on DEV -- LR :0.0009736000000000002 C-LOSS : 1.0542466640472412 AVG-LOSS :1.4493451152701635

Confusion Matrix : 
[[386   3  17]
 [448  11   9]
 [214   4  15]]
F-Measure : 0.2369118980051221

-=-=-=-=-=-=-=-=-=-=-=-=-=-=-=-- Test iteration 296 on DEV -- LR :0.0009802 C-LOSS : 1.0077921152114868 AVG-LOSS :1.4478584048322556

Confusion Matrix : 
[[358   8  40]
 [403  19  46]
 [189   7  37]]
F-Measure : 0.2694096298205276

-=-=-=-=-=-=-=-=-=-=-=-=-=-=-=-- Test iteration 297 on DEV -- LR :0.0009867999999999997 C-LOSS : 1.0396074056625366 AVG-LOSS :1.446488435036384

Confusion Matrix : 
[[315  19  72]
 [351  30  87]
 [153  16  64]]
F-Measure : 0.2952903663967462

-=-=-=-=-=-=-=-=-=-=-=-=-=-=-=-- Test iteration 298 on DEV -- LR :0.0009934 C-LOSS : 1.0059175491333008 AVG-LOSS :1.4450149538126278

Confusion Matrix : 
[[299  19  88]
 [327  29 112]
 [142  14  77]]
F-Measure : 0.2966359942825216

-=-=-=-=-=-=-=-=-=-=-=-=-=-=-=-- Test iteration 299 on DEV -- LR :0.001 C-LOSS : 1.028962254524231 AVG-LOSS :1.4436281114816665

Confusion Matrix : 
[[366  21  19]
 [405  39  24]
 [200  15  18]]
F-Measure : 0.2814659798038995

-=-=-=-=-=-=-=-=-=-=-=-=-=-=-=-- Train epoch 4 --=-=-=-=-=-=-=-=-=-=-=-=-=-


-=-=-=-=-=-=-=-=-=-=-=-=-=-=-=-- Test iteration 300 on DEV -- LR :0.0009934 C-LOSS : 1.559302806854248 AVG-LOSS :1.4440124127951968

Confusion Matrix : 
[[388  14   4]
 [446  22   0]
 [220  10   3]]
F-Measure : 0.2363857611845134

-=-=-=-=-=-=-=-=-=-=-=-=-=-=-=-- Test iteration 301 on DEV -- LR :0.0009867999999999997 C-LOSS : 1.2458637952804565 AVG-LOSS :1.4433562915451479

Confusion Matrix : 
[[399   7   0]
 [460   8   0]
 [228   5   0]]
F-Measure : 0.20989065116678637

-=-=-=-=-=-=-=-=-=-=-=-=-=-=-=-- Test iteration 302 on DEV -- LR :0.0009802000000000005 C-LOSS : 1.139709711074829 AVG-LOSS :1.442354157616203

Confusion Matrix : 
[[390  15   1]
 [441  27   0]
 [224   8   1]]
F-Measure : 0.24166781420803746

-=-=-=-=-=-=-=-=-=-=-=-=-=-=-=-- Test iteration 303 on DEV -- LR :0.0009735999999999994 C-LOSS : 0.9922149777412415 AVG-LOSS :1.4408734366297722

Confusion Matrix : 
[[362  44   0]
 [375  93   0]
 [195  37   1]]
F-Measure : 0.3227365187258467

-=-=-=-=-=-=-=-=-=-=-=-=-=-=-=-- Test iteration 304 on DEV -- LR :0.0009670000000000002 C-LOSS : 1.0793869495391846 AVG-LOSS :1.4396882350327538

Confusion Matrix : 
[[327  70   9]
 [338 125   5]
 [165  60   8]]
F-Measure : 0.35345128880095994

-=-=-=-=-=-=-=-=-=-=-=-=-=-=-=-- Test iteration 305 on DEV -- LR :0.0009604 C-LOSS : 1.146388292312622 AVG-LOSS :1.4387297384879167

Confusion Matrix : 
[[306  28  72]
 [359  60  49]
 [159  22  52]]
F-Measure : 0.32417083551886705

-=-=-=-=-=-=-=-=-=-=-=-=-=-=-=-- Test iteration 306 on DEV -- LR :0.0009537999999999999 C-LOSS : 0.9753319621086121 AVG-LOSS :1.4372202994769094

Confusion Matrix : 
[[360  15  31]
 [409  25  34]
 [199   8  26]]
F-Measure : 0.2669331442102566

-=-=-=-=-=-=-=-=-=-=-=-=-=-=-=-- Test iteration 307 on DEV -- LR :0.0009472000000000006 C-LOSS : 1.0000394582748413 AVG-LOSS :1.435800881161318

Confusion Matrix : 
[[391  12   3]
 [444  21   3]
 [223   4   6]]
F-Measure : 0.2413741078534473

-=-=-=-=-=-=-=-=-=-=-=-=-=-=-=-- Test iteration 308 on DEV -- LR :0.0009405999999999996 C-LOSS : 1.0203537940979004 AVG-LOSS :1.4344563922064204

Confusion Matrix : 
[[391  14   1]
 [436  30   2]
 [220  13   0]]
F-Measure : 0.24570336851403782

-=-=-=-=-=-=-=-=-=-=-=-=-=-=-=-- Test iteration 309 on DEV -- LR :0.0009340000000000003 C-LOSS : 1.2007544040679932 AVG-LOSS :1.4337025148253286

Confusion Matrix : 
[[371  33   2]
 [396  72   0]
 [209  24   0]]
F-Measure : 0.29888622942594223

-=-=-=-=-=-=-=-=-=-=-=-=-=-=-=-- Test iteration 310 on DEV -- LR :0.0009274000000000001 C-LOSS : 1.0421054363250732 AVG-LOSS :1.4324433602320803

Confusion Matrix : 
[[392  12   2]
 [436  31   1]
 [218  13   2]]
F-Measure : 0.25158775342554274

-=-=-=-=-=-=-=-=-=-=-=-=-=-=-=-- Test iteration 311 on DEV -- LR :0.0009207999999999999 C-LOSS : 1.0170265436172485 AVG-LOSS :1.4311118960762634

Confusion Matrix : 
[[386   6  14]
 [444  15   9]
 [213   8  12]]
F-Measure : 0.23976905814601965

-=-=-=-=-=-=-=-=-=-=-=-=-=-=-=-- Test iteration 312 on DEV -- LR :0.0009142000000000006 C-LOSS : 1.0399513244628906 AVG-LOSS :1.4298621817899588

Confusion Matrix : 
[[371   8  27]
 [427  21  20]
 [199   9  25]]
F-Measure : 0.2635613885027163

-=-=-=-=-=-=-=-=-=-=-=-=-=-=-=-- Test iteration 313 on DEV -- LR :0.0009075999999999996 C-LOSS : 1.0908962488174438 AVG-LOSS :1.428782672449282

Confusion Matrix : 
[[353  17  36]
 [407  35  26]
 [191  11  31]]
F-Measure : 0.28657227359496706

-=-=-=-=-=-=-=-=-=-=-=-=-=-=-=-- Test iteration 314 on DEV -- LR :0.0009010000000000003 C-LOSS : 1.052510380744934 AVG-LOSS :1.4275881572375222

Confusion Matrix : 
[[381  12  13]
 [432  27   9]
 [208   9  16]]
F-Measure : 0.2649399621335511

-=-=-=-=-=-=-=-=-=-=-=-=-=-=-=-- Test iteration 315 on DEV -- LR :0.0008944000000000003 C-LOSS : 1.0546917915344238 AVG-LOSS :1.4264081054473225

Confusion Matrix : 
[[390  15   1]
 [437  30   1]
 [216  10   7]]
F-Measure : 0.2581032629147443

-=-=-=-=-=-=-=-=-=-=-=-=-=-=-=-- Test iteration 316 on DEV -- LR :0.0008878000000000001 C-LOSS : 1.1101977825164795 AVG-LOSS :1.425410596542178

Confusion Matrix : 
[[392  14   0]
 [440  27   1]
 [215  16   2]]
F-Measure : 0.24494404140049547

-=-=-=-=-=-=-=-=-=-=-=-=-=-=-=-- Test iteration 317 on DEV -- LR :0.0008812 C-LOSS : 1.0913686752319336 AVG-LOSS :1.4243601502487495

Confusion Matrix : 
[[399   7   0]
 [449  18   1]
 [222   6   5]]
F-Measure : 0.237593989222813

-=-=-=-=-=-=-=-=-=-=-=-=-=-=-=-- Test iteration 318 on DEV -- LR :0.0008745999999999998 C-LOSS : 1.024181604385376 AVG-LOSS :1.4231056720485509

Confusion Matrix : 
[[390  12   4]
 [433  29   6]
 [211  15   7]]
F-Measure : 0.2572413671040866

-=-=-=-=-=-=-=-=-=-=-=-=-=-=-=-- Test iteration 319 on DEV -- LR :0.0008680000000000005 C-LOSS : 1.058523178100586 AVG-LOSS :1.4219663517549634

Confusion Matrix : 
[[368  23  15]
 [400  49  19]
 [190  27  16]]
F-Measure : 0.2947682858396841

-=-=-=-=-=-=-=-=-=-=-=-=-=-=-=-- Test iteration 320 on DEV -- LR :0.0008613999999999995 C-LOSS : 1.0484884977340698 AVG-LOSS :1.4208028693436834

Confusion Matrix : 
[[339  30  37]
 [366  64  38]
 [174  31  28]]
F-Measure : 0.31984482881014775

-=-=-=-=-=-=-=-=-=-=-=-=-=-=-=-- Test iteration 321 on DEV -- LR :0.0008548000000000002 C-LOSS : 1.056295394897461 AVG-LOSS :1.4196708585534776

Confusion Matrix : 
[[350  21  35]
 [374  56  38]
 [179  25  29]]
F-Measure : 0.3156373014539706

-=-=-=-=-=-=-=-=-=-=-=-=-=-=-=-- Test iteration 322 on DEV -- LR :0.0008482 C-LOSS : 1.0694169998168945 AVG-LOSS :1.4185864812818474

Confusion Matrix : 
[[375  10  21]
 [412  29  27]
 [197  13  23]]
F-Measure : 0.2768937011281005

-=-=-=-=-=-=-=-=-=-=-=-=-=-=-=-- Test iteration 323 on DEV -- LR :0.0008415999999999999 C-LOSS : 1.0084052085876465 AVG-LOSS :1.417320489699458

Confusion Matrix : 
[[389  12   5]
 [428  33   7]
 [208  11  14]]
F-Measure : 0.27540027919710147

-=-=-=-=-=-=-=-=-=-=-=-=-=-=-=-- Test iteration 324 on DEV -- LR :0.0008350000000000007 C-LOSS : 0.953453004360199 AVG-LOSS :1.4158932051291833

Confusion Matrix : 
[[389  12   5]
 [434  30   4]
 [210  12  11]]
F-Measure : 0.26518444893065785

-=-=-=-=-=-=-=-=-=-=-=-=-=-=-=-- Test iteration 325 on DEV -- LR :0.0008283999999999995 C-LOSS : 0.9878904223442078 AVG-LOSS :1.4145803131574501

Confusion Matrix : 
[[395   6   5]
 [446  16   6]
 [217   7   9]]
F-Measure : 0.24010349713916013

-=-=-=-=-=-=-=-=-=-=-=-=-=-=-=-- Test iteration 326 on DEV -- LR :0.0008218000000000004 C-LOSS : 1.0001996755599976 AVG-LOSS :1.4133130940822287

Confusion Matrix : 
[[384   9  13]
 [437  24   7]
 [209  11  13]]
F-Measure : 0.25635585035313635

-=-=-=-=-=-=-=-=-=-=-=-=-=-=-=-- Test iteration 327 on DEV -- LR :0.0008152000000000002 C-LOSS : 1.0341246128082275 AVG-LOSS :1.4121570316393202

Confusion Matrix : 
[[372  10  24]
 [426  28  14]
 [197  15  21]]
F-Measure : 0.27048144291177584

-=-=-=-=-=-=-=-=-=-=-=-=-=-=-=-- Test iteration 328 on DEV -- LR :0.0008086 C-LOSS : 1.0481313467025757 AVG-LOSS :1.4110505705908802

Confusion Matrix : 
[[351  12  43]
 [401  36  31]
 [187  18  28]]
F-Measure : 0.28360904249377017

-=-=-=-=-=-=-=-=-=-=-=-=-=-=-=-- Test iteration 329 on DEV -- LR :0.0008019999999999999 C-LOSS : 1.0084275007247925 AVG-LOSS :1.409830500682195

Confusion Matrix : 
[[332   9  65]
 [396  28  44]
 [179  12  42]]
F-Measure : 0.2773083315327261

-=-=-=-=-=-=-=-=-=-=-=-=-=-=-=-- Test iteration 330 on DEV -- LR :0.0007953999999999997 C-LOSS : 1.065983533859253 AVG-LOSS :1.408791688093606

Confusion Matrix : 
[[337   6  63]
 [409  16  43]
 [177   9  47]]
F-Measure : 0.26436778571127517

-=-=-=-=-=-=-=-=-=-=-=-=-=-=-=-- Test iteration 331 on DEV -- LR :0.0007888000000000004 C-LOSS : 1.01712167263031 AVG-LOSS :1.4076119591313672

Confusion Matrix : 
[[339  11  56]
 [405  24  39]
 [183  12  38]]
F-Measure : 0.2696518128214494

-=-=-=-=-=-=-=-=-=-=-=-=-=-=-=-- Test iteration 332 on DEV -- LR :0.0007821999999999994 C-LOSS : 1.0467824935913086 AVG-LOSS :1.4065283871627785

Confusion Matrix : 
[[334  30  42]
 [373  70  25]
 [171  27  35]]
F-Measure : 0.33425961881086336

-=-=-=-=-=-=-=-=-=-=-=-=-=-=-=-- Test iteration 333 on DEV -- LR :0.0007756000000000001 C-LOSS : 1.0367752313613892 AVG-LOSS :1.4054213417861277

Confusion Matrix : 
[[333  44  29]
 [347 103  18]
 [168  38  27]]
F-Measure : 0.3651753376073526

-=-=-=-=-=-=-=-=-=-=-=-=-=-=-=-- Test iteration 334 on DEV -- LR :0.0007689999999999999 C-LOSS : 1.0693700313568115 AVG-LOSS :1.4044182035460402

Confusion Matrix : 
[[362  29  15]
 [381  76  11]
 [187  29  17]]
F-Measure : 0.3314245488522055

-=-=-=-=-=-=-=-=-=-=-=-=-=-=-=-- Test iteration 335 on DEV -- LR :0.0007623999999999998 C-LOSS : 1.0276199579238892 AVG-LOSS :1.4032967801959741

Confusion Matrix : 
[[390   8   8]
 [437  23   8]
 [216   9   8]]
F-Measure : 0.24881166573573818

-=-=-=-=-=-=-=-=-=-=-=-=-=-=-=-- Test iteration 336 on DEV -- LR :0.0007558000000000005 C-LOSS : 0.923356831073761 AVG-LOSS :1.4018726260442762

Confusion Matrix : 
[[391   4  11]
 [443  16   9]
 [216   8   9]]
F-Measure : 0.23871623693096236

-=-=-=-=-=-=-=-=-=-=-=-=-=-=-=-- Test iteration 337 on DEV -- LR :0.0007491999999999996 C-LOSS : 0.9862666130065918 AVG-LOSS :1.4006430224554074

Confusion Matrix : 
[[389   4  13]
 [442  15  11]
 [216   6  11]]
F-Measure : 0.23938192828682084

-=-=-=-=-=-=-=-=-=-=-=-=-=-=-=-- Test iteration 338 on DEV -- LR :0.0007426000000000002 C-LOSS : 1.0090196132659912 AVG-LOSS :1.3994877911598633

Confusion Matrix : 
[[372   3  31]
 [427  14  27]
 [206   7  20]]
F-Measure : 0.2445166674751838

-=-=-=-=-=-=-=-=-=-=-=-=-=-=-=-- Test iteration 339 on DEV -- LR :0.0007360000000000001 C-LOSS : 1.0315964221954346 AVG-LOSS :1.3984057577217326

Confusion Matrix : 
[[354   3  49]
 [408  16  44]
 [190   8  35]]
F-Measure : 0.25935384277234963

-=-=-=-=-=-=-=-=-=-=-=-=-=-=-=-- Test iteration 340 on DEV -- LR :0.0007294 C-LOSS : 0.9629753828048706 AVG-LOSS :1.3971288358011553

Confusion Matrix : 
[[352   3  51]
 [411  16  41]
 [192   9  32]]
F-Measure : 0.25471918976002755

-=-=-=-=-=-=-=-=-=-=-=-=-=-=-=-- Test iteration 341 on DEV -- LR :0.0007228000000000007 C-LOSS : 1.0460245609283447 AVG-LOSS :1.3961022151143927

Confusion Matrix : 
[[357   7  42]
 [414  17  37]
 [193   9  31]]
F-Measure : 0.2578782815733148

-=-=-=-=-=-=-=-=-=-=-=-=-=-=-=-- Test iteration 342 on DEV -- LR :0.0007161999999999996 C-LOSS : 0.9931715130805969 AVG-LOSS :1.394927490035577

Confusion Matrix : 
[[373   8  25]
 [423  29  16]
 [201  11  21]]
F-Measure : 0.27249768570753224

-=-=-=-=-=-=-=-=-=-=-=-=-=-=-=-- Test iteration 343 on DEV -- LR :0.0007096000000000003 C-LOSS : 0.9760289788246155 AVG-LOSS :1.3937097618053125

Confusion Matrix : 
[[371  17  18]
 [416  37  15]
 [199  16  18]]
F-Measure : 0.2803284780001519

-=-=-=-=-=-=-=-=-=-=-=-=-=-=-=-- Test iteration 344 on DEV -- LR :0.0007030000000000002 C-LOSS : 1.0486267805099487 AVG-LOSS :1.3927095212798188

Confusion Matrix : 
[[376  16  14]
 [431  30   7]
 [208  12  13]]
F-Measure : 0.26280967646989417

-=-=-=-=-=-=-=-=-=-=-=-=-=-=-=-- Test iteration 345 on DEV -- LR :0.0006964 C-LOSS : 1.0458511114120483 AVG-LOSS :1.3917070403264438

Confusion Matrix : 
[[384   5  17]
 [433  20  15]
 [209  10  14]]
F-Measure : 0.25143923135119445

-=-=-=-=-=-=-=-=-=-=-=-=-=-=-=-- Test iteration 346 on DEV -- LR :0.0006898 C-LOSS : 1.04634428024292 AVG-LOSS :1.3907117585970963

Confusion Matrix : 
[[373   1  32]
 [426  14  28]
 [197   8  28]]
F-Measure : 0.2559780938158049

-=-=-=-=-=-=-=-=-=-=-=-=-=-=-=-- Test iteration 347 on DEV -- LR :0.0006831999999999997 C-LOSS : 1.032203197479248 AVG-LOSS :1.3896815615823899

Confusion Matrix : 
[[354   2  50]
 [414  13  41]
 [185   9  39]]
F-Measure : 0.25863791491004917

-=-=-=-=-=-=-=-=-=-=-=-=-=-=-=-- Test iteration 348 on DEV -- LR :0.0006766000000000005 C-LOSS : 0.9954535365104675 AVG-LOSS :1.3885519683873415

Confusion Matrix : 
[[312   6  88]
 [377  20  71]
 [163   9  61]]
F-Measure : 0.27222545544855203

-=-=-=-=-=-=-=-=-=-=-=-=-=-=-=-- Test iteration 349 on DEV -- LR :0.0006699999999999994 C-LOSS : 1.0161992311477661 AVG-LOSS :1.3874881034237998

Confusion Matrix : 
[[307   6  93]
 [358  27  83]
 [151  11  71]]
F-Measure : 0.2911339370770049

-=-=-=-=-=-=-=-=-=-=-=-=-=-=-=-- Test iteration 350 on DEV -- LR :0.0006634000000000002 C-LOSS : 1.0118612051010132 AVG-LOSS :1.3864179413203161

Confusion Matrix : 
[[329   6  71]
 [386  24  58]
 [172  12  49]]
F-Measure : 0.27661718035321725

-=-=-=-=-=-=-=-=-=-=-=-=-=-=-=-- Test iteration 351 on DEV -- LR :0.0006568 C-LOSS : 0.9050478935241699 AVG-LOSS :1.3850504127754406

Confusion Matrix : 
[[373   5  28]
 [435  14  19]
 [197  10  26]]
F-Measure : 0.25349088139426784

-=-=-=-=-=-=-=-=-=-=-=-=-=-=-=-- Test iteration 352 on DEV -- LR :0.0006501999999999999 C-LOSS : 1.0340313911437988 AVG-LOSS :1.3840560246121782

Confusion Matrix : 
[[394   4   8]
 [453  10   5]
 [217   9   7]]
F-Measure : 0.22546929749477695

-=-=-=-=-=-=-=-=-=-=-=-=-=-=-=-- Test iteration 353 on DEV -- LR :0.0006436000000000006 C-LOSS : 1.074627161026001 AVG-LOSS :1.383181931777189

Confusion Matrix : 
[[398   4   4]
 [456   9   3]
 [221   8   4]]
F-Measure : 0.21958541816734917

-=-=-=-=-=-=-=-=-=-=-=-=-=-=-=-- Test iteration 354 on DEV -- LR :0.0006369999999999995 C-LOSS : 1.0158923864364624 AVG-LOSS :1.3821473133396094

Confusion Matrix : 
[[393   6   7]
 [447  15   6]
 [214  12   7]]
F-Measure : 0.23440816212099866

-=-=-=-=-=-=-=-=-=-=-=-=-=-=-=-- Test iteration 355 on DEV -- LR :0.0006304000000000004 C-LOSS : 1.1017322540283203 AVG-LOSS :1.381359630588735

Confusion Matrix : 
[[385  13   8]
 [424  36   8]
 [206  16  11]]
F-Measure : 0.27365392665809085

-=-=-=-=-=-=-=-=-=-=-=-=-=-=-=-- Test iteration 356 on DEV -- LR :0.0006238000000000001 C-LOSS : 1.0203834772109985 AVG-LOSS :1.3803484929042036

Confusion Matrix : 
[[375  17  14]
 [410  45  13]
 [200  20  13]]
F-Measure : 0.28697340138719973

-=-=-=-=-=-=-=-=-=-=-=-=-=-=-=-- Test iteration 357 on DEV -- LR :0.0006172 C-LOSS : 0.9834128618240356 AVG-LOSS :1.3792397341581697

Confusion Matrix : 
[[364  15  27]
 [403  46  19]
 [191  21  21]]
F-Measure : 0.2959310916667329

-=-=-=-=-=-=-=-=-=-=-=-=-=-=-=-- Test iteration 358 on DEV -- LR :0.0006105999999999998 C-LOSS : 1.0044291019439697 AVG-LOSS :1.3781956933999129

Confusion Matrix : 
[[362  13  31]
 [402  37  29]
 [185  19  29]]
F-Measure : 0.2921349643536802

-=-=-=-=-=-=-=-=-=-=-=-=-=-=-=-- Test iteration 359 on DEV -- LR :0.0006039999999999997 C-LOSS : 1.0074788331985474 AVG-LOSS :1.377165924343798

Confusion Matrix : 
[[370  10  26]
 [414  29  25]
 [195  14  24]]
F-Measure : 0.27582265952912416

-=-=-=-=-=-=-=-=-=-=-=-=-=-=-=-- Test iteration 360 on DEV -- LR :0.0005974000000000003 C-LOSS : 0.9820762276649475 AVG-LOSS :1.3760714930510587

Confusion Matrix : 
[[363  11  32]
 [400  34  34]
 [182  15  36]]
F-Measure : 0.29677191058368074

-=-=-=-=-=-=-=-=-=-=-=-=-=-=-=-- Test iteration 361 on DEV -- LR :0.0005907999999999994 C-LOSS : 0.9742350578308105 AVG-LOSS :1.3749614476498977

Confusion Matrix : 
[[363  14  29]
 [401  39  28]
 [186  19  28]]
F-Measure : 0.2944924371786899

-=-=-=-=-=-=-=-=-=-=-=-=-=-=-=-- Test iteration 362 on DEV -- LR :0.0005842000000000001 C-LOSS : 1.012782096862793 AVG-LOSS :1.373963708391531

Confusion Matrix : 
[[367  20  19]
 [408  44  16]
 [186  22  25]]
F-Measure : 0.29999907793395236

-=-=-=-=-=-=-=-=-=-=-=-=-=-=-=-- Test iteration 363 on DEV -- LR :0.0005775999999999999 C-LOSS : 0.9567506313323975 AVG-LOSS :1.3728175186193907

Confusion Matrix : 
[[371  20  15]
 [399  54  15]
 [190  24  19]]
F-Measure : 0.30825057600191474

-=-=-=-=-=-=-=-=-=-=-=-=-=-=-=-- Test iteration 364 on DEV -- LR :0.0005709999999999998 C-LOSS : 0.9518534541130066 AVG-LOSS :1.3716641924152635

Confusion Matrix : 
[[369  22  15]
 [394  61  13]
 [190  25  18]]
F-Measure : 0.31586841673088095

-=-=-=-=-=-=-=-=-=-=-=-=-=-=-=-- Test iteration 365 on DEV -- LR :0.0005644000000000005 C-LOSS : 1.0244337320327759 AVG-LOSS :1.3707154753103934

Confusion Matrix : 
[[371  17  18]
 [402  51  15]
 [191  22  20]]
F-Measure : 0.3053548062214151

-=-=-=-=-=-=-=-=-=-=-=-=-=-=-=-- Test iteration 366 on DEV -- LR :0.0005577999999999995 C-LOSS : 0.9351202845573425 AVG-LOSS :1.3695285674336821

Confusion Matrix : 
[[370  13  23]
 [415  40  13]
 [192  18  23]]
F-Measure : 0.2921457404740248

-=-=-=-=-=-=-=-=-=-=-=-=-=-=-=-- Test iteration 367 on DEV -- LR :0.0005512000000000002 C-LOSS : 0.9523669481277466 AVG-LOSS :1.3683949760768725

Confusion Matrix : 
[[369  15  22]
 [417  40  11]
 [191  18  24]]
F-Measure : 0.2930636423317142

-=-=-=-=-=-=-=-=-=-=-=-=-=-=-=-- Test iteration 368 on DEV -- LR :0.0005446000000000001 C-LOSS : 0.9220219254493713 AVG-LOSS :1.3671852930128412

Confusion Matrix : 
[[376  13  17]
 [427  32   9]
 [196  17  20]]
F-Measure : 0.2775267751211058

-=-=-=-=-=-=-=-=-=-=-=-=-=-=-=-- Test iteration 369 on DEV -- LR :0.0005379999999999998 C-LOSS : 1.044751524925232 AVG-LOSS :1.3663138503963883

Confusion Matrix : 
[[389   8   9]
 [438  24   6]
 [212  13   8]]
F-Measure : 0.25017682503207594

-=-=-=-=-=-=-=-=-=-=-=-=-=-=-=-- Test iteration 370 on DEV -- LR :0.0005314000000000007 C-LOSS : 0.9526755809783936 AVG-LOSS :1.3651989224464744

Confusion Matrix : 
[[395   5   6]
 [447  16   5]
 [214  12   7]]
F-Measure : 0.2369219841281643

-=-=-=-=-=-=-=-=-=-=-=-=-=-=-=-- Test iteration 371 on DEV -- LR :0.0005247999999999995 C-LOSS : 0.973854124546051 AVG-LOSS :1.364146920301581

Confusion Matrix : 
[[392   6   8]
 [444  19   5]
 [212  12   9]]
F-Measure : 0.2444254687829842

-=-=-=-=-=-=-=-=-=-=-=-=-=-=-=-- Test iteration 372 on DEV -- LR :0.0005182000000000003 C-LOSS : 0.95698481798172 AVG-LOSS :1.3630553328958976

Confusion Matrix : 
[[376  13  17]
 [426  33   9]
 [195  17  21]]
F-Measure : 0.28069844307698466

-=-=-=-=-=-=-=-=-=-=-=-=-=-=-=-- Test iteration 373 on DEV -- LR :0.0005116000000000002 C-LOSS : 1.0370196104049683 AVG-LOSS :1.3621835796272053

Confusion Matrix : 
[[351  13  42]
 [396  41  31]
 [175  20  38]]
F-Measure : 0.3043348167207272

-=-=-=-=-=-=-=-=-=-=-=-=-=-=-=-- Test iteration 374 on DEV -- LR :0.000505 C-LOSS : 0.9916559457778931 AVG-LOSS :1.3611955059369405

Confusion Matrix : 
[[318  22  66]
 [366  58  44]
 [159  25  49]]
F-Measure : 0.3249608365400399

-=-=-=-=-=-=-=-=-=-=-=-=-=-=-=-- Test Best Model pid-35093 on TEST --=-=-=-=-=-=-=-=-=-=-=-=-=-

> Best Model on DEV pid-35093 loaded
Confusion Matrix : 
[[406 426   0]
 [443 813   0]
 [203 318   0]]
F-Measure : 0.41571354250980147
