train_test.py
Namespace(acoustic_model='/data/coros1/qraymondaud/acoustic_models/finalf8.raw', architecture='tdnn', batch_size=128, data='/data/coros1/qraymondaud/MELD/meld-mfcc-hires', feature_size=1536, kaldi_pybind_path='/users/qraymondaud/kaldi/src/pybind', load_egs='exp/pytorch_egs/', load_model='', lr=0.001, max_seq_len=600, mode='train-test', model_dir='exp/pytorch_resnet_block256_ecapatdnn_good/tdnn_sentiment/finalf8', multi_gpu=True, num_epochs=5, num_iterations=75, output_size=3, rollback_threshold=7, task='sentiment', use_cuda=True, weight_decay=0.001)
SGD

-=-=-=-=-=-=-=-=-=-=-=-=-=-=-=-- Train epoch 0 --=-=-=-=-=-=-=-=-=-=-=-=-=-


-=-=-=-=-=-=-=-=-=-=-=-=-=-=-=-- Test iteration 0 on DEV -- LR :0.0009869333333333335 C-LOSS : 1.1945884227752686 AVG-LOSS :1.1945884227752686

Confusion Matrix : 
[[  0   0 405]
 [  0   0 469]
 [  0   0 233]]
F-Measure : 0.07319634887891167
> Save best model exp/pytorch_resnet_block256_ecapatdnn_good/tdnn_sentiment/finalf8/finalf8_tdnn_sentiment_pid-33887.mat

-=-=-=-=-=-=-=-=-=-=-=-=-=-=-=-- Test iteration 1 on DEV -- LR :0.0009738666666666665 C-LOSS : 44.3073616027832 AVG-LOSS :22.750975012779236

Confusion Matrix : 
[[406   0   0]
 [469   0   0]
 [232   0   0]]
F-Measure : 0.19683191324092134
> Save best model exp/pytorch_resnet_block256_ecapatdnn_good/tdnn_sentiment/finalf8/finalf8_tdnn_sentiment_pid-33887.mat

-=-=-=-=-=-=-=-=-=-=-=-=-=-=-=-- Test iteration 2 on DEV -- LR :0.0009607999999999999 C-LOSS : 33.76471710205078 AVG-LOSS :26.42222237586975

Confusion Matrix : 
[[  0 406   0]
 [  0 469   0]
 [  0 232   0]]
F-Measure : 0.25215747504344754
> Save best model exp/pytorch_resnet_block256_ecapatdnn_good/tdnn_sentiment/finalf8/finalf8_tdnn_sentiment_pid-33887.mat

-=-=-=-=-=-=-=-=-=-=-=-=-=-=-=-- Test iteration 3 on DEV -- LR :0.0009477333333333335 C-LOSS : 10.353935241699219 AVG-LOSS :22.405150592327118

Confusion Matrix : 
[[  0   0 406]
 [  0   0 469]
 [  0   0 232]]
F-Measure : 0.07262359902663006

-=-=-=-=-=-=-=-=-=-=-=-=-=-=-=-- Test iteration 4 on DEV -- LR :0.0009346666666666665 C-LOSS : 3.2785067558288574 AVG-LOSS :18.579821825027466

Confusion Matrix : 
[[  0   8 398]
 [  0  28 441]
 [  0   5 227]]
F-Measure : 0.11982332272842855

-=-=-=-=-=-=-=-=-=-=-=-=-=-=-=-- Test iteration 5 on DEV -- LR :0.0009216 C-LOSS : 3.934602737426758 AVG-LOSS :16.138951977094013

Confusion Matrix : 
[[381  25   0]
 [420  49   0]
 [227   5   0]]
F-Measure : 0.27065297971795954
> Save best model exp/pytorch_resnet_block256_ecapatdnn_good/tdnn_sentiment/finalf8/finalf8_tdnn_sentiment_pid-33887.mat

-=-=-=-=-=-=-=-=-=-=-=-=-=-=-=-- Test iteration 6 on DEV -- LR :0.0009085333333333334 C-LOSS : 5.719849586486816 AVG-LOSS :14.650508778435844

Confusion Matrix : 
[[406   0   0]
 [469   0   0]
 [232   0   0]]
F-Measure : 0.19683191324092134

-=-=-=-=-=-=-=-=-=-=-=-=-=-=-=-- Test iteration 7 on DEV -- LR :0.0008954666666666669 C-LOSS : 3.539203405380249 AVG-LOSS :13.261595606803894

Confusion Matrix : 
[[406   0   0]
 [469   0   0]
 [232   0   0]]
F-Measure : 0.19683191324092134

-=-=-=-=-=-=-=-=-=-=-=-=-=-=-=-- Test iteration 8 on DEV -- LR :0.0008823999999999999 C-LOSS : 1.6438201665878296 AVG-LOSS :11.97073166900211

Confusion Matrix : 
[[406   0   0]
 [469   0   0]
 [232   0   0]]
F-Measure : 0.19683191324092134

-=-=-=-=-=-=-=-=-=-=-=-=-=-=-=-- Test iteration 9 on DEV -- LR :0.0008693333333333334 C-LOSS : 2.118173599243164 AVG-LOSS :10.985475862026215

Confusion Matrix : 
[[  0 116 290]
 [  0 193 276]
 [  1  62 169]]
F-Measure : 0.2679392085774242

-=-=-=-=-=-=-=-=-=-=-=-=-=-=-=-- Test iteration 10 on DEV -- LR :0.0008562666666666668 C-LOSS : 2.091628313064575 AVG-LOSS :10.176944266666066

Confusion Matrix : 
[[  0 402   4]
 [  0 468   1]
 [  0 231   1]]
F-Measure : 0.2543425683324614

-=-=-=-=-=-=-=-=-=-=-=-=-=-=-=-- Test iteration 11 on DEV -- LR :0.0008431999999999999 C-LOSS : 1.4325474500656128 AVG-LOSS :9.448244531949362

Confusion Matrix : 
[[  1 266 139]
 [  0 309 160]
 [  1 128 103]]
F-Measure : 0.29329481508519983
> Save best model exp/pytorch_resnet_block256_ecapatdnn_good/tdnn_sentiment/finalf8/finalf8_tdnn_sentiment_pid-33887.mat

-=-=-=-=-=-=-=-=-=-=-=-=-=-=-=-- Test iteration 12 on DEV -- LR :0.0008301333333333334 C-LOSS : 1.2247451543807983 AVG-LOSS :8.81566765675178

Confusion Matrix : 
[[  3  13 390]
 [  2  14 453]
 [  2   3 227]]
F-Measure : 0.10217887964271839

-=-=-=-=-=-=-=-=-=-=-=-=-=-=-=-- Test iteration 13 on DEV -- LR :0.0008170666666666668 C-LOSS : 1.1599093675613403 AVG-LOSS :8.268827778952462

Confusion Matrix : 
[[289   0 117]
 [379   0  90]
 [169   0  63]]
F-Measure : 0.2231460784488045

-=-=-=-=-=-=-=-=-=-=-=-=-=-=-=-- Test iteration 14 on DEV -- LR :0.0008039999999999998 C-LOSS : 1.2476611137390137 AVG-LOSS :7.800750001271566

Confusion Matrix : 
[[406   0   0]
 [469   0   0]
 [232   0   0]]
F-Measure : 0.19683191324092134

-=-=-=-=-=-=-=-=-=-=-=-=-=-=-=-- Test iteration 15 on DEV -- LR :0.0007909333333333333 C-LOSS : 1.3242151737213135 AVG-LOSS :7.395966574549675

Confusion Matrix : 
[[406   0   0]
 [469   0   0]
 [232   0   0]]
F-Measure : 0.19683191324092134

-=-=-=-=-=-=-=-=-=-=-=-=-=-=-=-- Test iteration 16 on DEV -- LR :0.0007778666666666669 C-LOSS : 1.2051746845245361 AVG-LOSS :7.031802345724667

Confusion Matrix : 
[[406   0   0]
 [469   0   0]
 [232   0   0]]
F-Measure : 0.19683191324092134

-=-=-=-=-=-=-=-=-=-=-=-=-=-=-=-- Test iteration 17 on DEV -- LR :0.0007647999999999998 C-LOSS : 1.1135650873184204 AVG-LOSS :6.70301138692432

Confusion Matrix : 
[[403   3   0]
 [461   8   0]
 [232   0   0]]
F-Measure : 0.21093060301811775

-=-=-=-=-=-=-=-=-=-=-=-=-=-=-=-- Test iteration 18 on DEV -- LR :0.0007517333333333332 C-LOSS : 1.127983570098877 AVG-LOSS :6.409588870249297

Confusion Matrix : 
[[205 200   1]
 [162 304   3]
 [125 107   0]]
F-Measure : 0.40595945160419467
> Save best model exp/pytorch_resnet_block256_ecapatdnn_good/tdnn_sentiment/finalf8/finalf8_tdnn_sentiment_pid-33887.mat

-=-=-=-=-=-=-=-=-=-=-=-=-=-=-=-- Test iteration 19 on DEV -- LR :0.0007386666666666668 C-LOSS : 1.1399643421173096 AVG-LOSS :6.146107643842697

Confusion Matrix : 
[[ 36 344  26]
 [ 28 422  19]
 [ 23 189  20]]
F-Measure : 0.3328948762366519

-=-=-=-=-=-=-=-=-=-=-=-=-=-=-=-- Test iteration 20 on DEV -- LR :0.0007255999999999999 C-LOSS : 1.1040858030319214 AVG-LOSS :5.906011365708851

Confusion Matrix : 
[[ 25 308  73]
 [ 31 377  61]
 [ 14 163  55]]
F-Measure : 0.3358386341348417

-=-=-=-=-=-=-=-=-=-=-=-=-=-=-=-- Test iteration 21 on DEV -- LR :0.0007125333333333333 C-LOSS : 1.190956711769104 AVG-LOSS :5.69169069962068

Confusion Matrix : 
[[ 21 204 181]
 [ 20 256 193]
 [  8  89 135]]
F-Measure : 0.32330032325190083

-=-=-=-=-=-=-=-=-=-=-=-=-=-=-=-- Test iteration 22 on DEV -- LR :0.0006994666666666667 C-LOSS : 1.1408137083053589 AVG-LOSS :5.493826482606971

Confusion Matrix : 
[[ 32  98 276]
 [ 29 146 294]
 [ 12  42 178]]
F-Measure : 0.2889900424985821

-=-=-=-=-=-=-=-=-=-=-=-=-=-=-=-- Test iteration 23 on DEV -- LR :0.0006864000000000002 C-LOSS : 1.0895899534225464 AVG-LOSS :5.310316627224286

Confusion Matrix : 
[[ 79  69 258]
 [ 96 105 268]
 [ 53  26 153]]
F-Measure : 0.29478508925723673

-=-=-=-=-=-=-=-=-=-=-=-=-=-=-=-- Test iteration 24 on DEV -- LR :0.0006733333333333333 C-LOSS : 1.089980125427246 AVG-LOSS :5.141503167152405

Confusion Matrix : 
[[217  84 105]
 [246 137  86]
 [123  38  71]]
F-Measure : 0.3801558174151243

-=-=-=-=-=-=-=-=-=-=-=-=-=-=-=-- Test iteration 25 on DEV -- LR :0.0006602666666666667 C-LOSS : 1.0666792392730713 AVG-LOSS :4.984779169926276

Confusion Matrix : 
[[349  56   1]
 [350 109  10]
 [197  32   3]]
F-Measure : 0.34040737766971724

-=-=-=-=-=-=-=-=-=-=-=-=-=-=-=-- Test iteration 26 on DEV -- LR :0.0006472000000000001 C-LOSS : 1.1036574840545654 AVG-LOSS :4.841033922301398

Confusion Matrix : 
[[373  33   0]
 [410  59   0]
 [213  19   0]]
F-Measure : 0.2813447381362495

-=-=-=-=-=-=-=-=-=-=-=-=-=-=-=-- Test iteration 27 on DEV -- LR :0.0006341333333333332 C-LOSS : 1.109633445739746 AVG-LOSS :4.7077696195670535

Confusion Matrix : 
[[400   6   0]
 [461   8   0]
 [232   0   0]]
F-Measure : 0.20976875977794465

-=-=-=-=-=-=-=-=-=-=-=-=-=-=-=-- Test iteration 28 on DEV -- LR :0.0006210666666666667 C-LOSS : 1.1402182579040527 AVG-LOSS :4.584750607095915

Confusion Matrix : 
[[406   0   0]
 [468   1   0]
 [232   0   0]]
F-Measure : 0.1987649338011636

-=-=-=-=-=-=-=-=-=-=-=-=-=-=-=-- Test iteration 29 on DEV -- LR :0.0006080000000000001 C-LOSS : 1.1279046535491943 AVG-LOSS :4.469522408644358

Confusion Matrix : 
[[406   0   0]
 [469   0   0]
 [232   0   0]]
F-Measure : 0.19683191324092134

-=-=-=-=-=-=-=-=-=-=-=-=-=-=-=-- Test iteration 30 on DEV -- LR :0.0005949333333333336 C-LOSS : 1.0869040489196777 AVG-LOSS :4.360405687362917

Confusion Matrix : 
[[406   0   0]
 [469   0   0]
 [232   0   0]]
F-Measure : 0.19683191324092134

-=-=-=-=-=-=-=-=-=-=-=-=-=-=-=-- Test iteration 31 on DEV -- LR :0.0005818666666666666 C-LOSS : 1.1163978576660156 AVG-LOSS :4.259030442684889

Confusion Matrix : 
[[406   0   0]
 [469   0   0]
 [232   0   0]]
F-Measure : 0.19683191324092134

-=-=-=-=-=-=-=-=-=-=-=-=-=-=-=-- Test iteration 32 on DEV -- LR :0.0005688000000000002 C-LOSS : 1.070892095565796 AVG-LOSS :4.162420189741886

Confusion Matrix : 
[[406   0   0]
 [469   0   0]
 [232   0   0]]
F-Measure : 0.19683191324092134

-=-=-=-=-=-=-=-=-=-=-=-=-=-=-=-- Test iteration 33 on DEV -- LR :0.0005557333333333336 C-LOSS : 1.1040449142456055 AVG-LOSS :4.072467975756702

Confusion Matrix : 
[[406   0   0]
 [467   0   2]
 [230   0   2]]
F-Measure : 0.20090579373218936

-=-=-=-=-=-=-=-=-=-=-=-=-=-=-=-- Test iteration 34 on DEV -- LR :0.0005426666666666666 C-LOSS : 1.1229526996612549 AVG-LOSS :3.988196110725403

Confusion Matrix : 
[[385   1  20]
 [439   0  30]
 [216   0  16]]
F-Measure : 0.2178041152218652

-=-=-=-=-=-=-=-=-=-=-=-=-=-=-=-- Test iteration 35 on DEV -- LR :0.0005296000000000001 C-LOSS : 1.1110544204711914 AVG-LOSS :3.9082755082183414

Confusion Matrix : 
[[330   1  75]
 [384   1  84]
 [177   0  55]]
F-Measure : 0.2401184138850021

-=-=-=-=-=-=-=-=-=-=-=-=-=-=-=-- Test iteration 36 on DEV -- LR :0.0005165333333333336 C-LOSS : 1.0748553276062012 AVG-LOSS :3.831696584418013

Confusion Matrix : 
[[268   4 134]
 [349   8 112]
 [145   1  86]]
F-Measure : 0.2462830228302498

-=-=-=-=-=-=-=-=-=-=-=-=-=-=-=-- Test iteration 37 on DEV -- LR :0.0005034666666666666 C-LOSS : 1.1128097772598267 AVG-LOSS :3.760146931598061

Confusion Matrix : 
[[240  15 151]
 [322  30 117]
 [136   5  91]]
F-Measure : 0.2729777784732272

-=-=-=-=-=-=-=-=-=-=-=-=-=-=-=-- Test iteration 38 on DEV -- LR :0.0004904 C-LOSS : 1.099138617515564 AVG-LOSS :3.6919159491856894

Confusion Matrix : 
[[221  46 139]
 [296  79  94]
 [130  17  85]]
F-Measure : 0.3282824869580973

-=-=-=-=-=-=-=-=-=-=-=-=-=-=-=-- Test iteration 39 on DEV -- LR :0.0004773333333333335 C-LOSS : 1.083512306213379 AVG-LOSS :3.6267058581113814

Confusion Matrix : 
[[203  88 115]
 [255 148  66]
 [121  42  69]]
F-Measure : 0.3790528132012774

-=-=-=-=-=-=-=-=-=-=-=-=-=-=-=-- Test iteration 40 on DEV -- LR :0.0004642666666666665 C-LOSS : 1.114398717880249 AVG-LOSS :3.565430074203305

Confusion Matrix : 
[[168 148  90]
 [218 210  41]
 [114  67  51]]
F-Measure : 0.3866888231106548

-=-=-=-=-=-=-=-=-=-=-=-=-=-=-=-- Test iteration 41 on DEV -- LR :0.0004512 C-LOSS : 1.1147557497024536 AVG-LOSS :3.5070806855247136

Confusion Matrix : 
[[174 151  81]
 [214 215  40]
 [116  72  44]]
F-Measure : 0.38756606366738533

-=-=-=-=-=-=-=-=-=-=-=-=-=-=-=-- Test iteration 42 on DEV -- LR :0.00043813333333333343 C-LOSS : 1.1044683456420898 AVG-LOSS :3.4512059799460477

Confusion Matrix : 
[[198 139  69]
 [232 204  33]
 [126  64  42]]
F-Measure : 0.3951174006551448

-=-=-=-=-=-=-=-=-=-=-=-=-=-=-=-- Test iteration 43 on DEV -- LR :0.0004250666666666665 C-LOSS : 1.099980115890503 AVG-LOSS :3.3977690284902398

Confusion Matrix : 
[[242 100  64]
 [273 164  32]
 [147  44  41]]
F-Measure : 0.39162605862767247

-=-=-=-=-=-=-=-=-=-=-=-=-=-=-=-- Test iteration 44 on DEV -- LR :0.00041199999999999993 C-LOSS : 1.0937552452087402 AVG-LOSS :3.3465687221950953

Confusion Matrix : 
[[284  59  63]
 [332 105  32]
 [172  23  37]]
F-Measure : 0.3527019501016245

-=-=-=-=-=-=-=-=-=-=-=-=-=-=-=-- Test iteration 45 on DEV -- LR :0.00039893333333333345 C-LOSS : 1.0868284702301025 AVG-LOSS :3.2974439341089

Confusion Matrix : 
[[319  26  61]
 [398  43  28]
 [185  11  36]]
F-Measure : 0.2875263586013405

-=-=-=-=-=-=-=-=-=-=-=-=-=-=-=-- Test iteration 46 on DEV -- LR :0.00038586666666666643 C-LOSS : 1.0945359468460083 AVG-LOSS :3.250573551401179

Confusion Matrix : 
[[341   9  56]
 [424  17  28]
 [197   4  31]]
F-Measure : 0.24915518892494007

-=-=-=-=-=-=-=-=-=-=-=-=-=-=-=-- Test iteration 47 on DEV -- LR :0.00037279999999999995 C-LOSS : 1.078506350517273 AVG-LOSS :3.2053221513827643

Confusion Matrix : 
[[359   3  44]
 [438   6  25]
 [203   0  29]]
F-Measure : 0.23476174602802274

-=-=-=-=-=-=-=-=-=-=-=-=-=-=-=-- Test iteration 48 on DEV -- LR :0.00035973333333333337 C-LOSS : 1.0823357105255127 AVG-LOSS :3.161995897487718

Confusion Matrix : 
[[368   1  37]
 [445   3  21]
 [206   0  26]]
F-Measure : 0.22928808837276238

-=-=-=-=-=-=-=-=-=-=-=-=-=-=-=-- Test iteration 49 on DEV -- LR :0.0003466666666666669 C-LOSS : 1.0991392135620117 AVG-LOSS :3.120738763809204

Confusion Matrix : 
[[380   1  25]
 [451   3  15]
 [211   0  21]]
F-Measure : 0.22791251616121297

-=-=-=-=-=-=-=-=-=-=-=-=-=-=-=-- Test iteration 50 on DEV -- LR :0.00033359999999999987 C-LOSS : 1.0760767459869385 AVG-LOSS :3.080647351695042

Confusion Matrix : 
[[385   1  20]
 [453   1  15]
 [217   0  15]]
F-Measure : 0.2173885155945231

-=-=-=-=-=-=-=-=-=-=-=-=-=-=-=-- Test iteration 51 on DEV -- LR :0.0003205333333333334 C-LOSS : 1.0722193717956543 AVG-LOSS :3.0420237366969767

Confusion Matrix : 
[[387   1  18]
 [455   1  13]
 [219   0  13]]
F-Measure : 0.21504531964934168

-=-=-=-=-=-=-=-=-=-=-=-=-=-=-=-- Test iteration 52 on DEV -- LR :0.0003074666666666668 C-LOSS : 1.1067363023757935 AVG-LOSS :3.005508879445634

Confusion Matrix : 
[[391   1  14]
 [457   2  10]
 [220   0  12]]
F-Measure : 0.21693364014108368

-=-=-=-=-=-=-=-=-=-=-=-=-=-=-=-- Test iteration 53 on DEV -- LR :0.0002944000000000003 C-LOSS : 1.0604020357131958 AVG-LOSS :2.9694883823394775

Confusion Matrix : 
[[391   2  13]
 [455   4  10]
 [219   0  13]]
F-Measure : 0.22243950903304766

-=-=-=-=-=-=-=-=-=-=-=-=-=-=-=-- Test iteration 54 on DEV -- LR :0.0002813333333333333 C-LOSS : 1.0737693309783936 AVG-LOSS :2.9350207632238217

Confusion Matrix : 
[[391   2  13]
 [455   4  10]
 [222   0  10]]
F-Measure : 0.2175277554586209

-=-=-=-=-=-=-=-=-=-=-=-=-=-=-=-- Test iteration 55 on DEV -- LR :0.0002682666666666668 C-LOSS : 1.0805829763412476 AVG-LOSS :2.9019058027437756

Confusion Matrix : 
[[393   3  10]
 [454   5  10]
 [221   1  10]]
F-Measure : 0.22043202079045698

-=-=-=-=-=-=-=-=-=-=-=-=-=-=-=-- Test iteration 56 on DEV -- LR :0.00025520000000000024 C-LOSS : 1.0814106464385986 AVG-LOSS :2.8699672912296497

Confusion Matrix : 
[[386   3  17]
 [453   6  10]
 [217   1  14]]
F-Measure : 0.2257724686431982

-=-=-=-=-=-=-=-=-=-=-=-=-=-=-=-- Test iteration 57 on DEV -- LR :0.00024213333333333333 C-LOSS : 1.065929651260376 AVG-LOSS :2.8388631939888

Confusion Matrix : 
[[379   4  23]
 [450   6  13]
 [216   1  15]]
F-Measure : 0.22440141647615228

-=-=-=-=-=-=-=-=-=-=-=-=-=-=-=-- Test iteration 58 on DEV -- LR :0.00022906666666666674 C-LOSS : 1.0731974840164185 AVG-LOSS :2.808936656531641

Confusion Matrix : 
[[373   3  30]
 [445   7  17]
 [214   1  17]]
F-Measure : 0.22669458259892694

-=-=-=-=-=-=-=-=-=-=-=-=-=-=-=-- Test iteration 59 on DEV -- LR :0.00021600000000000026 C-LOSS : 1.0783673524856567 AVG-LOSS :2.7800938347975412

Confusion Matrix : 
[[368   3  35]
 [442   7  20]
 [207   1  24]]
F-Measure : 0.2343960273279214

-=-=-=-=-=-=-=-=-=-=-=-=-=-=-=-- Test iteration 60 on DEV -- LR :0.00020293333333333324 C-LOSS : 1.074365496635437 AVG-LOSS :2.7521310751555395

Confusion Matrix : 
[[366   3  37]
 [440   7  22]
 [204   1  27]]
F-Measure : 0.2375399720090013

-=-=-=-=-=-=-=-=-=-=-=-=-=-=-=-- Test iteration 61 on DEV -- LR :0.00018986666666666676 C-LOSS : 1.070319652557373 AVG-LOSS :2.7250050844684726

Confusion Matrix : 
[[364   3  39]
 [439   7  23]
 [203   1  28]]
F-Measure : 0.2378977161612018

-=-=-=-=-=-=-=-=-=-=-=-=-=-=-=-- Test iteration 62 on DEV -- LR :0.00017680000000000018 C-LOSS : 1.0765935182571411 AVG-LOSS :2.698839821512737

Confusion Matrix : 
[[364   3  39]
 [438   7  24]
 [199   1  32]]
F-Measure : 0.2431396081632397

-=-=-=-=-=-=-=-=-=-=-=-=-=-=-=-- Test iteration 63 on DEV -- LR :0.00016373333333333327 C-LOSS : 1.0561151504516602 AVG-LOSS :2.6731722485274076

Confusion Matrix : 
[[367   3  36]
 [438   7  24]
 [199   1  32]]
F-Measure : 0.24467631596244158

-=-=-=-=-=-=-=-=-=-=-=-=-=-=-=-- Test iteration 64 on DEV -- LR :0.00015066666666666668 C-LOSS : 1.0653345584869385 AVG-LOSS :2.6484362840652467

Confusion Matrix : 
[[367   3  36]
 [438   7  24]
 [199   1  32]]
F-Measure : 0.24467631596244158

-=-=-=-=-=-=-=-=-=-=-=-=-=-=-=-- Test iteration 65 on DEV -- LR :0.0001376000000000002 C-LOSS : 1.044604778289795 AVG-LOSS :2.6241358067050125

Confusion Matrix : 
[[363   7  36]
 [436   9  24]
 [200   1  31]]
F-Measure : 0.24543236263890633

-=-=-=-=-=-=-=-=-=-=-=-=-=-=-=-- Test iteration 66 on DEV -- LR :0.00012453333333333318 C-LOSS : 1.0525277853012085 AVG-LOSS :2.6006789705646574

Confusion Matrix : 
[[364   8  34]
 [437   9  23]
 [203   2  27]]
F-Measure : 0.2408016666518365

-=-=-=-=-=-=-=-=-=-=-=-=-=-=-=-- Test iteration 67 on DEV -- LR :0.0001114666666666667 C-LOSS : 1.0828908681869507 AVG-LOSS :2.578358557294397

Confusion Matrix : 
[[364   9  33]
 [433  13  23]
 [204   2  26]]
F-Measure : 0.24681509830692203

-=-=-=-=-=-=-=-=-=-=-=-=-=-=-=-- Test iteration 68 on DEV -- LR :9.840000000000011e-05 C-LOSS : 1.0726912021636963 AVG-LOSS :2.5565372912780098

Confusion Matrix : 
[[363  10  33]
 [432  15  22]
 [204   3  25]]
F-Measure : 0.24867217133277109

-=-=-=-=-=-=-=-=-=-=-=-=-=-=-=-- Test iteration 69 on DEV -- LR :8.53333333333332e-05 C-LOSS : 1.0714919567108154 AVG-LOSS :2.53532235792705

Confusion Matrix : 
[[365  10  31]
 [431  18  20]
 [204   4  24]]
F-Measure : 0.2536321594375052

-=-=-=-=-=-=-=-=-=-=-=-=-=-=-=-- Test iteration 70 on DEV -- LR :7.226666666666662e-05 C-LOSS : 1.0829042196273804 AVG-LOSS :2.5148657644298713

Confusion Matrix : 
[[366  10  30]
 [432  18  19]
 [205   3  24]]
F-Measure : 0.25402306687135096

-=-=-=-=-=-=-=-=-=-=-=-=-=-=-=-- Test iteration 71 on DEV -- LR :5.920000000000014e-05 C-LOSS : 1.076697587966919 AVG-LOSS :2.4948912064234414

Confusion Matrix : 
[[366  10  30]
 [432  18  19]
 [204   4  24]]
F-Measure : 0.2540975048316124

-=-=-=-=-=-=-=-=-=-=-=-=-=-=-=-- Test iteration 72 on DEV -- LR :4.613333333333312e-05 C-LOSS : 1.0894285440444946 AVG-LOSS :2.475638293240168

Confusion Matrix : 
[[367  11  28]
 [433  18  18]
 [206   4  22]]
F-Measure : 0.2517715666698656

-=-=-=-=-=-=-=-=-=-=-=-=-=-=-=-- Test iteration 73 on DEV -- LR :3.306666666666664e-05 C-LOSS : 1.064210295677185 AVG-LOSS :2.4565649419217497

Confusion Matrix : 
[[368  11  27]
 [432  18  19]
 [205   4  23]]
F-Measure : 0.2537169476016455

-=-=-=-=-=-=-=-=-=-=-=-=-=-=-=-- Test iteration 74 on DEV -- LR :2.0000000000000052e-05 C-LOSS : 1.0719949007034302 AVG-LOSS :2.4381040080388385

Confusion Matrix : 
[[369  10  27]
 [432  18  19]
 [205   4  23]]
F-Measure : 0.25416159119108606

-=-=-=-=-=-=-=-=-=-=-=-=-=-=-=-- Train epoch 1 --=-=-=-=-=-=-=-=-=-=-=-=-=-


-=-=-=-=-=-=-=-=-=-=-=-=-=-=-=-- Test iteration 75 on DEV -- LR :3.306666666666707e-05 C-LOSS : 1.6590096950531006 AVG-LOSS :2.4278527670785

Confusion Matrix : 
[[405   1   0]
 [469   0   0]
 [232   0   0]]
F-Measure : 0.19647696476964768

-=-=-=-=-=-=-=-=-=-=-=-=-=-=-=-- Test iteration 76 on DEV -- LR :4.613333333333312e-05 C-LOSS : 1.1707850694656372 AVG-LOSS :2.4115272125640472

Confusion Matrix : 
[[405   1   0]
 [469   0   0]
 [232   0   0]]
F-Measure : 0.19647696476964768

-=-=-=-=-=-=-=-=-=-=-=-=-=-=-=-- Test iteration 77 on DEV -- LR :5.920000000000014e-05 C-LOSS : 1.1263619661331177 AVG-LOSS :2.395050735045702

Confusion Matrix : 
[[405   1   0]
 [469   0   0]
 [232   0   0]]
F-Measure : 0.19647696476964768

-=-=-=-=-=-=-=-=-=-=-=-=-=-=-=-- Test iteration 78 on DEV -- LR :7.226666666666662e-05 C-LOSS : 1.1211553812026978 AVG-LOSS :2.37892547740212

Confusion Matrix : 
[[405   1   0]
 [469   0   0]
 [232   0   0]]
F-Measure : 0.19647696476964768

-=-=-=-=-=-=-=-=-=-=-=-=-=-=-=-- Test iteration 79 on DEV -- LR :8.53333333333332e-05 C-LOSS : 1.0925740003585815 AVG-LOSS :2.3628460839390755

Confusion Matrix : 
[[405   1   0]
 [469   0   0]
 [232   0   0]]
F-Measure : 0.19647696476964768

-=-=-=-=-=-=-=-=-=-=-=-=-=-=-=-- Test iteration 80 on DEV -- LR :9.840000000000011e-05 C-LOSS : 1.096874713897705 AVG-LOSS :2.3472168077657254

Confusion Matrix : 
[[405   1   0]
 [469   0   0]
 [232   0   0]]
F-Measure : 0.19647696476964768

-=-=-=-=-=-=-=-=-=-=-=-=-=-=-=-- Test iteration 81 on DEV -- LR :0.0001114666666666667 C-LOSS : 1.1027849912643433 AVG-LOSS :2.3320408100035133

Confusion Matrix : 
[[405   1   0]
 [469   0   0]
 [232   0   0]]
F-Measure : 0.19647696476964768

-=-=-=-=-=-=-=-=-=-=-=-=-=-=-=-- Test iteration 82 on DEV -- LR :0.00012453333333333318 C-LOSS : 1.1040949821472168 AVG-LOSS :2.317246281957052

Confusion Matrix : 
[[405   1   0]
 [469   0   0]
 [232   0   0]]
F-Measure : 0.19647696476964768

-=-=-=-=-=-=-=-=-=-=-=-=-=-=-=-- Test iteration 83 on DEV -- LR :0.0001376000000000002 C-LOSS : 1.0772608518600464 AVG-LOSS :2.302484550646373

Confusion Matrix : 
[[405   1   0]
 [469   0   0]
 [232   0   0]]
F-Measure : 0.19647696476964768

-=-=-=-=-=-=-=-=-=-=-=-=-=-=-=-- Test iteration 84 on DEV -- LR :0.00015066666666666668 C-LOSS : 1.086090087890625 AVG-LOSS :2.288174027555129

Confusion Matrix : 
[[405   1   0]
 [469   0   0]
 [232   0   0]]
F-Measure : 0.19647696476964768

-=-=-=-=-=-=-=-=-=-=-=-=-=-=-=-- Test iteration 85 on DEV -- LR :0.00016373333333333327 C-LOSS : 1.0918948650360107 AVG-LOSS :2.2742638047351393

Confusion Matrix : 
[[405   1   0]
 [469   0   0]
 [232   0   0]]
F-Measure : 0.19647696476964768

-=-=-=-=-=-=-=-=-=-=-=-=-=-=-=-- Test iteration 86 on DEV -- LR :0.00017680000000000018 C-LOSS : 1.0856496095657349 AVG-LOSS :2.260601572606755

Confusion Matrix : 
[[405   1   0]
 [469   0   0]
 [232   0   0]]
F-Measure : 0.19647696476964768

-=-=-=-=-=-=-=-=-=-=-=-=-=-=-=-- Test iteration 87 on DEV -- LR :0.00018986666666666676 C-LOSS : 1.0950640439987183 AVG-LOSS :2.247356827963482

Confusion Matrix : 
[[405   1   0]
 [469   0   0]
 [232   0   0]]
F-Measure : 0.19647696476964768

-=-=-=-=-=-=-=-=-=-=-=-=-=-=-=-- Test iteration 88 on DEV -- LR :0.00020293333333333324 C-LOSS : 1.061949610710144 AVG-LOSS :2.2340376457471525

Confusion Matrix : 
[[405   1   0]
 [469   0   0]
 [232   0   0]]
F-Measure : 0.19647696476964768

-=-=-=-=-=-=-=-=-=-=-=-=-=-=-=-- Test iteration 89 on DEV -- LR :0.00021600000000000026 C-LOSS : 1.1045145988464355 AVG-LOSS :2.221487389670478

Confusion Matrix : 
[[405   1   0]
 [469   0   0]
 [232   0   0]]
F-Measure : 0.19647696476964768

-=-=-=-=-=-=-=-=-=-=-=-=-=-=-=-- Test iteration 90 on DEV -- LR :0.00022906666666666674 C-LOSS : 1.077163577079773 AVG-LOSS :2.2089124027189317

Confusion Matrix : 
[[405   1   0]
 [469   0   0]
 [232   0   0]]
F-Measure : 0.19647696476964768

-=-=-=-=-=-=-=-=-=-=-=-=-=-=-=-- Test iteration 91 on DEV -- LR :0.00024213333333333333 C-LOSS : 1.0844310522079468 AVG-LOSS :2.1966897793438123

Confusion Matrix : 
[[405   1   0]
 [469   0   0]
 [232   0   0]]
F-Measure : 0.19647696476964768

-=-=-=-=-=-=-=-=-=-=-=-=-=-=-=-- Test iteration 92 on DEV -- LR :0.00025520000000000024 C-LOSS : 1.079136610031128 AVG-LOSS :2.184673078598515

Confusion Matrix : 
[[404   1   1]
 [469   0   0]
 [232   0   0]]
F-Measure : 0.19612154647908714

-=-=-=-=-=-=-=-=-=-=-=-=-=-=-=-- Test iteration 93 on DEV -- LR :0.0002682666666666668 C-LOSS : 1.063247799873352 AVG-LOSS :2.172743022441864

Confusion Matrix : 
[[404   1   1]
 [469   0   0]
 [232   0   0]]
F-Measure : 0.19612154647908714

-=-=-=-=-=-=-=-=-=-=-=-=-=-=-=-- Test iteration 94 on DEV -- LR :0.0002813333333333333 C-LOSS : 1.0784764289855957 AVG-LOSS :2.161224426721272

Confusion Matrix : 
[[403   1   2]
 [469   0   0]
 [232   0   0]]
F-Measure : 0.1957656574358238

-=-=-=-=-=-=-=-=-=-=-=-=-=-=-=-- Test iteration 95 on DEV -- LR :0.0002944000000000003 C-LOSS : 1.08162260055542 AVG-LOSS :2.1499785743653774

Confusion Matrix : 
[[403   1   2]
 [469   0   0]
 [232   0   0]]
F-Measure : 0.1957656574358238

-=-=-=-=-=-=-=-=-=-=-=-=-=-=-=-- Test iteration 96 on DEV -- LR :0.00030746666666666637 C-LOSS : 1.0607693195343018 AVG-LOSS :2.1387496129753663

Confusion Matrix : 
[[403   1   2]
 [469   0   0]
 [232   0   0]]
F-Measure : 0.1957656574358238

-=-=-=-=-=-=-=-=-=-=-=-=-=-=-=-- Test iteration 97 on DEV -- LR :0.0003205333333333334 C-LOSS : 1.0805716514587402 AVG-LOSS :2.1279518786741765

Confusion Matrix : 
[[403   1   2]
 [469   0   0]
 [232   0   0]]
F-Measure : 0.1957656574358238

-=-=-=-=-=-=-=-=-=-=-=-=-=-=-=-- Test iteration 98 on DEV -- LR :0.0003336000000000003 C-LOSS : 1.0538395643234253 AVG-LOSS :2.1171022593373

Confusion Matrix : 
[[404   1   1]
 [469   0   0]
 [232   0   0]]
F-Measure : 0.19612154647908714

-=-=-=-=-=-=-=-=-=-=-=-=-=-=-=-- Test iteration 99 on DEV -- LR :0.00034666666666666646 C-LOSS : 1.0765448808670044 AVG-LOSS :2.1066966855525973

Confusion Matrix : 
[[404   1   1]
 [468   1   0]
 [232   0   0]]
F-Measure : 0.1980504413340792

-=-=-=-=-=-=-=-=-=-=-=-=-=-=-=-- Test iteration 100 on DEV -- LR :0.00035973333333333337 C-LOSS : 1.0761945247650146 AVG-LOSS :2.096493693861631

Confusion Matrix : 
[[403   1   2]
 [468   1   0]
 [232   0   0]]
F-Measure : 0.19769440251797005

-=-=-=-=-=-=-=-=-=-=-=-=-=-=-=-- Test iteration 101 on DEV -- LR :0.0003728000000000004 C-LOSS : 1.0702061653137207 AVG-LOSS :2.086432051424887

Confusion Matrix : 
[[403   1   2]
 [467   2   0]
 [232   0   0]]
F-Measure : 0.199615696721939

-=-=-=-=-=-=-=-=-=-=-=-=-=-=-=-- Test iteration 102 on DEV -- LR :0.00038586666666666643 C-LOSS : 1.0654505491256714 AVG-LOSS :2.076519609654991

Confusion Matrix : 
[[403   1   2]
 [467   2   0]
 [232   0   0]]
F-Measure : 0.199615696721939

-=-=-=-=-=-=-=-=-=-=-=-=-=-=-=-- Test iteration 103 on DEV -- LR :0.00039893333333333345 C-LOSS : 1.034524917602539 AVG-LOSS :2.066500429923718

Confusion Matrix : 
[[403   1   2]
 [468   1   0]
 [232   0   0]]
F-Measure : 0.19769440251797005

-=-=-=-=-=-=-=-=-=-=-=-=-=-=-=-- Test iteration 104 on DEV -- LR :0.00041199999999999993 C-LOSS : 1.0477213859558105 AVG-LOSS :2.0567977723621187

Confusion Matrix : 
[[403   1   2]
 [468   1   0]
 [232   0   0]]
F-Measure : 0.19769440251797005

-=-=-=-=-=-=-=-=-=-=-=-=-=-=-=-- Test iteration 105 on DEV -- LR :0.0004250666666666665 C-LOSS : 1.059585690498352 AVG-LOSS :2.0473901112124606

Confusion Matrix : 
[[404   1   1]
 [468   1   0]
 [232   0   0]]
F-Measure : 0.1980504413340792

-=-=-=-=-=-=-=-=-=-=-=-=-=-=-=-- Test iteration 106 on DEV -- LR :0.00043813333333333343 C-LOSS : 1.0890568494796753 AVG-LOSS :2.0384337255887894

Confusion Matrix : 
[[403   1   2]
 [468   1   0]
 [232   0   0]]
F-Measure : 0.19769440251797005

-=-=-=-=-=-=-=-=-=-=-=-=-=-=-=-- Test iteration 107 on DEV -- LR :0.0004512 C-LOSS : 1.069169521331787 AVG-LOSS :2.0294590570308544

Confusion Matrix : 
[[403   1   2]
 [468   1   0]
 [232   0   0]]
F-Measure : 0.19769440251797005

-=-=-=-=-=-=-=-=-=-=-=-=-=-=-=-- Test iteration 108 on DEV -- LR :0.0004642666666666665 C-LOSS : 1.024182915687561 AVG-LOSS :2.0202363401377967

Confusion Matrix : 
[[403   1   2]
 [468   1   0]
 [232   0   0]]
F-Measure : 0.19769440251797005

-=-=-=-=-=-=-=-=-=-=-=-=-=-=-=-- Test iteration 109 on DEV -- LR :0.0004773333333333335 C-LOSS : 1.076563835144043 AVG-LOSS :2.011657499183308

Confusion Matrix : 
[[403   1   2]
 [467   2   0]
 [232   0   0]]
F-Measure : 0.199615696721939

-=-=-=-=-=-=-=-=-=-=-=-=-=-=-=-- Test iteration 110 on DEV -- LR :0.0004904 C-LOSS : 1.042730689048767 AVG-LOSS :2.0029284288217357

Confusion Matrix : 
[[403   1   2]
 [466   3   0]
 [232   0   0]]
F-Measure : 0.20152958873868407

-=-=-=-=-=-=-=-=-=-=-=-=-=-=-=-- Test iteration 111 on DEV -- LR :0.0005034666666666666 C-LOSS : 1.0649782419204712 AVG-LOSS :1.9945538735815458

Confusion Matrix : 
[[404   2   0]
 [464   5   0]
 [232   0   0]]
F-Measure : 0.20567325963341138

-=-=-=-=-=-=-=-=-=-=-=-=-=-=-=-- Test iteration 112 on DEV -- LR :0.0005165333333333336 C-LOSS : 1.1090755462646484 AVG-LOSS :1.9867177821893607

Confusion Matrix : 
[[404   2   0]
 [464   5   0]
 [232   0   0]]
F-Measure : 0.20567325963341138

-=-=-=-=-=-=-=-=-=-=-=-=-=-=-=-- Test iteration 113 on DEV -- LR :0.0005296000000000001 C-LOSS : 1.0675554275512695 AVG-LOSS :1.9786549545170968

Confusion Matrix : 
[[404   2   0]
 [464   5   0]
 [232   0   0]]
F-Measure : 0.20567325963341138

-=-=-=-=-=-=-=-=-=-=-=-=-=-=-=-- Test iteration 114 on DEV -- LR :0.0005426666666666666 C-LOSS : 1.0796968936920166 AVG-LOSS :1.9708379279012265

Confusion Matrix : 
[[405   1   0]
 [467   2   0]
 [232   0   0]]
F-Measure : 0.20032760229574087

-=-=-=-=-=-=-=-=-=-=-=-=-=-=-=-- Test iteration 115 on DEV -- LR :0.0005557333333333336 C-LOSS : 1.036729097366333 AVG-LOSS :1.9627852655690292

Confusion Matrix : 
[[404   1   1]
 [467   2   0]
 [232   0   0]]
F-Measure : 0.1999718853953786

-=-=-=-=-=-=-=-=-=-=-=-=-=-=-=-- Test iteration 116 on DEV -- LR :0.0005688000000000002 C-LOSS : 1.0617276430130005 AVG-LOSS :1.9550839183676956

Confusion Matrix : 
[[404   1   1]
 [467   2   0]
 [232   0   0]]
F-Measure : 0.1999718853953786

-=-=-=-=-=-=-=-=-=-=-=-=-=-=-=-- Test iteration 117 on DEV -- LR :0.0005818666666666666 C-LOSS : 1.059088945388794 AVG-LOSS :1.9474907406305864

Confusion Matrix : 
[[404   1   1]
 [466   3   0]
 [232   0   0]]
F-Measure : 0.20188592735387972

-=-=-=-=-=-=-=-=-=-=-=-=-=-=-=-- Test iteration 118 on DEV -- LR :0.0005949333333333336 C-LOSS : 1.0859591960906982 AVG-LOSS :1.9402509797521

Confusion Matrix : 
[[401   5   0]
 [463   6   0]
 [231   1   0]]
F-Measure : 0.20653177085474253

-=-=-=-=-=-=-=-=-=-=-=-=-=-=-=-- Test iteration 119 on DEV -- LR :0.0006080000000000001 C-LOSS : 1.0724345445632935 AVG-LOSS :1.9330191761255264

Confusion Matrix : 
[[390  16   0]
 [454  15   0]
 [229   3   0]]
F-Measure : 0.218689985597864

-=-=-=-=-=-=-=-=-=-=-=-=-=-=-=-- Test iteration 120 on DEV -- LR :0.0006210666666666667 C-LOSS : 1.0942281484603882 AVG-LOSS :1.9260870188720955

Confusion Matrix : 
[[382  24   0]
 [431  38   0]
 [224   8   0]]
F-Measure : 0.25391833521914825

-=-=-=-=-=-=-=-=-=-=-=-=-=-=-=-- Test iteration 121 on DEV -- LR :0.0006341333333333336 C-LOSS : 1.1062531471252441 AVG-LOSS :1.9193670691036788

Confusion Matrix : 
[[386  20   0]
 [441  28   0]
 [228   4   0]]
F-Measure : 0.23933447203121758

-=-=-=-=-=-=-=-=-=-=-=-=-=-=-=-- Test iteration 122 on DEV -- LR :0.0006471999999999997 C-LOSS : 1.0795832872390747 AVG-LOSS :1.9125395586820153

Confusion Matrix : 
[[394  12   0]
 [458  11   0]
 [231   1   0]]
F-Measure : 0.2129990845610065

-=-=-=-=-=-=-=-=-=-=-=-=-=-=-=-- Test iteration 123 on DEV -- LR :0.0006602666666666667 C-LOSS : 1.0564202070236206 AVG-LOSS :1.9056353703621896

Confusion Matrix : 
[[400   6   0]
 [462   7   0]
 [231   1   0]]
F-Measure : 0.20801444271786584

-=-=-=-=-=-=-=-=-=-=-=-=-=-=-=-- Test iteration 124 on DEV -- LR :0.0006733333333333337 C-LOSS : 1.0259696245193481 AVG-LOSS :1.8985980443954469

Confusion Matrix : 
[[397   9   0]
 [463   6   0]
 [231   1   0]]
F-Measure : 0.20500825390369798

-=-=-=-=-=-=-=-=-=-=-=-=-=-=-=-- Test iteration 125 on DEV -- LR :0.0006863999999999998 C-LOSS : 1.03617262840271 AVG-LOSS :1.8917533982367742

Confusion Matrix : 
[[400   6   0]
 [463   6   0]
 [232   0   0]]
F-Measure : 0.2060430873092351

-=-=-=-=-=-=-=-=-=-=-=-=-=-=-=-- Test iteration 126 on DEV -- LR :0.0006994666666666667 C-LOSS : 1.0927762985229492 AVG-LOSS :1.885462239971311

Confusion Matrix : 
[[402   4   0]
 [463   6   0]
 [232   0   0]]
F-Measure : 0.20680317507306126

-=-=-=-=-=-=-=-=-=-=-=-=-=-=-=-- Test iteration 127 on DEV -- LR :0.0007125333333333337 C-LOSS : 1.0858299732208252 AVG-LOSS :1.879215112887323

Confusion Matrix : 
[[404   2   0]
 [465   4   0]
 [232   0   0]]
F-Measure : 0.2037775617933597

-=-=-=-=-=-=-=-=-=-=-=-=-=-=-=-- Test iteration 128 on DEV -- LR :0.0007255999999999999 C-LOSS : 1.0932824611663818 AVG-LOSS :1.8731226117111917

Confusion Matrix : 
[[402   2   2]
 [464   5   0]
 [231   0   1]]
F-Measure : 0.20687357361167466

-=-=-=-=-=-=-=-=-=-=-=-=-=-=-=-- Test iteration 129 on DEV -- LR :0.0007386666666666668 C-LOSS : 1.0570576190948486 AVG-LOSS :1.866845188691066

Confusion Matrix : 
[[394  10   2]
 [459   9   1]
 [225   1   6]]
F-Measure : 0.22077739526763862

-=-=-=-=-=-=-=-=-=-=-=-=-=-=-=-- Test iteration 130 on DEV -- LR :0.0007517333333333332 C-LOSS : 1.0749720335006714 AVG-LOSS :1.8608003554453376

Confusion Matrix : 
[[380  13  13]
 [452  12   5]
 [216   1  15]]
F-Measure : 0.23596939959391647

-=-=-=-=-=-=-=-=-=-=-=-=-=-=-=-- Test iteration 131 on DEV -- LR :0.0007647999999999998 C-LOSS : 1.116172194480896 AVG-LOSS :1.855159233013789

Confusion Matrix : 
[[347  10  49]
 [439   8  22]
 [194   1  37]]
F-Measure : 0.24314733163533508

-=-=-=-=-=-=-=-=-=-=-=-=-=-=-=-- Test iteration 132 on DEV -- LR :0.0007778666666666669 C-LOSS : 1.1191575527191162 AVG-LOSS :1.849625385793528

Confusion Matrix : 
[[345   2  59]
 [438   4  27]
 [189   0  43]]
F-Measure : 0.2407066624460401

-=-=-=-=-=-=-=-=-=-=-=-=-=-=-=-- Test iteration 133 on DEV -- LR :0.0007909333333333333 C-LOSS : 1.0869686603546143 AVG-LOSS :1.8439339176932377

Confusion Matrix : 
[[376   1  29]
 [457   3   9]
 [207   0  25]]
F-Measure : 0.23162940912793772

-=-=-=-=-=-=-=-=-=-=-=-=-=-=-=-- Test iteration 134 on DEV -- LR :0.0008039999999999998 C-LOSS : 1.0747978687286377 AVG-LOSS :1.8382366136268333

Confusion Matrix : 
[[400   0   6]
 [467   0   2]
 [222   0  10]]
F-Measure : 0.2130239612318085

-=-=-=-=-=-=-=-=-=-=-=-=-=-=-=-- Test iteration 135 on DEV -- LR :0.0008170666666666668 C-LOSS : 1.0531761646270752 AVG-LOSS :1.8324641103253645

Confusion Matrix : 
[[403   2   1]
 [467   2   0]
 [232   0   0]]
F-Measure : 0.19960810601763526

-=-=-=-=-=-=-=-=-=-=-=-=-=-=-=-- Test iteration 136 on DEV -- LR :0.0008301333333333334 C-LOSS : 1.0718815326690674 AVG-LOSS :1.8269124126782383

Confusion Matrix : 
[[397   9   0]
 [463   6   0]
 [231   1   0]]
F-Measure : 0.20500825390369798

-=-=-=-=-=-=-=-=-=-=-=-=-=-=-=-- Test iteration 137 on DEV -- LR :0.0008431999999999999 C-LOSS : 1.106308102607727 AVG-LOSS :1.8216906423154084

Confusion Matrix : 
[[392  14   0]
 [453  16   0]
 [230   2   0]]
F-Measure : 0.22121150719585342

-=-=-=-=-=-=-=-=-=-=-=-=-=-=-=-- Test iteration 138 on DEV -- LR :0.0008562666666666668 C-LOSS : 1.0873382091522217 AVG-LOSS :1.8164075312854575

Confusion Matrix : 
[[375  31   0]
 [424  45   0]
 [218  14   0]]
F-Measure : 0.26151253722046974

-=-=-=-=-=-=-=-=-=-=-=-=-=-=-=-- Test iteration 139 on DEV -- LR :0.0008693333333333334 C-LOSS : 1.0856587886810303 AVG-LOSS :1.8111878974097115

Confusion Matrix : 
[[384  22   0]
 [443  26   0]
 [226   6   0]]
F-Measure : 0.23518019651518227

-=-=-=-=-=-=-=-=-=-=-=-=-=-=-=-- Test iteration 140 on DEV -- LR :0.0008823999999999999 C-LOSS : 1.0610798597335815 AVG-LOSS :1.805867982248888

Confusion Matrix : 
[[396  10   0]
 [461   8   0]
 [231   1   0]]
F-Measure : 0.20831613806953794

-=-=-=-=-=-=-=-=-=-=-=-=-=-=-=-- Test iteration 141 on DEV -- LR :0.0008954666666666669 C-LOSS : 1.047441840171814 AVG-LOSS :1.800526953079331

Confusion Matrix : 
[[402   4   0]
 [466   3   0]
 [232   0   0]]
F-Measure : 0.20113890577230903

-=-=-=-=-=-=-=-=-=-=-=-=-=-=-=-- Test iteration 142 on DEV -- LR :0.0009085333333333334 C-LOSS : 1.0716140270233154 AVG-LOSS :1.7954296598901283

Confusion Matrix : 
[[401   4   1]
 [466   3   0]
 [232   0   0]]
F-Measure : 0.20078161976330203

-=-=-=-=-=-=-=-=-=-=-=-=-=-=-=-- Test iteration 143 on DEV -- LR :0.0009216 C-LOSS : 1.0624839067459106 AVG-LOSS :1.7903397588266268

Confusion Matrix : 
[[403   2   1]
 [468   1   0]
 [232   0   0]]
F-Measure : 0.19769059104967318

-=-=-=-=-=-=-=-=-=-=-=-=-=-=-=-- Test iteration 144 on DEV -- LR :0.000934666666666667 C-LOSS : 1.0034769773483276 AVG-LOSS :1.7849131189543626

Confusion Matrix : 
[[405   0   1]
 [468   1   0]
 [231   0   1]]
F-Measure : 0.2003312828671687

-=-=-=-=-=-=-=-=-=-=-=-=-=-=-=-- Test iteration 145 on DEV -- LR :0.0009477333333333335 C-LOSS : 1.0342330932617188 AVG-LOSS :1.779771474942769

Confusion Matrix : 
[[404   1   1]
 [468   1   0]
 [231   0   1]]
F-Measure : 0.1999717382794955

-=-=-=-=-=-=-=-=-=-=-=-=-=-=-=-- Test iteration 146 on DEV -- LR :0.0009607999999999999 C-LOSS : 1.0649014711380005 AVG-LOSS :1.7749084136923965

Confusion Matrix : 
[[399   6   1]
 [465   4   0]
 [230   1   1]]
F-Measure : 0.20396709363105028

-=-=-=-=-=-=-=-=-=-=-=-=-=-=-=-- Test iteration 147 on DEV -- LR :0.000973866666666667 C-LOSS : 1.0388933420181274 AVG-LOSS :1.7699353388837866

Confusion Matrix : 
[[397   8   1]
 [461   8   0]
 [230   1   1]]
F-Measure : 0.2106555178197363

-=-=-=-=-=-=-=-=-=-=-=-=-=-=-=-- Test iteration 148 on DEV -- LR :0.0009869333333333331 C-LOSS : 1.0253596305847168 AVG-LOSS :1.764938186479095

Confusion Matrix : 
[[392  13   1]
 [457  12   0]
 [230   2   0]]
F-Measure : 0.21412798223416868

-=-=-=-=-=-=-=-=-=-=-=-=-=-=-=-- Test iteration 149 on DEV -- LR :0.001 C-LOSS : 1.0781532526016235 AVG-LOSS :1.760359620253245

Confusion Matrix : 
[[390  16   0]
 [448  21   0]
 [225   7   0]]
F-Measure : 0.2294244643700556

-=-=-=-=-=-=-=-=-=-=-=-=-=-=-=-- Train epoch 2 --=-=-=-=-=-=-=-=-=-=-=-=-=-


-=-=-=-=-=-=-=-=-=-=-=-=-=-=-=-- Test iteration 150 on DEV -- LR :0.0009869333333333331 C-LOSS : 1.6962506771087646 AVG-LOSS :1.7599350577158643

Confusion Matrix : 
[[395  11   0]
 [457  12   0]
 [231   1   0]]
F-Measure : 0.215210438991642

-=-=-=-=-=-=-=-=-=-=-=-=-=-=-=-- Test iteration 151 on DEV -- LR :0.0009738666666666661 C-LOSS : 1.038839340209961 AVG-LOSS :1.7551910069427992

Confusion Matrix : 
[[395  11   0]
 [453  16   0]
 [228   4   0]]
F-Measure : 0.2226194685518605

-=-=-=-=-=-=-=-=-=-=-=-=-=-=-=-- Test iteration 152 on DEV -- LR :0.0009607999999999999 C-LOSS : 1.017527461051941 AVG-LOSS :1.7503696765774994

Confusion Matrix : 
[[388  18   0]
 [442  27   0]
 [225   7   0]]
F-Measure : 0.23871223494216276

-=-=-=-=-=-=-=-=-=-=-=-=-=-=-=-- Test iteration 153 on DEV -- LR :0.0009477333333333339 C-LOSS : 1.0560288429260254 AVG-LOSS :1.745860969865477

Confusion Matrix : 
[[382  24   0]
 [427  42   0]
 [223   9   0]]
F-Measure : 0.26027485427571834

-=-=-=-=-=-=-=-=-=-=-=-=-=-=-=-- Test iteration 154 on DEV -- LR :0.000934666666666667 C-LOSS : 1.0556901693344116 AVG-LOSS :1.741408255023341

Confusion Matrix : 
[[382  23   1]
 [430  39   0]
 [222   8   2]]
F-Measure : 0.2594621694633226

-=-=-=-=-=-=-=-=-=-=-=-=-=-=-=-- Test iteration 155 on DEV -- LR :0.0009216 C-LOSS : 1.1076771020889282 AVG-LOSS :1.737345875837864

Confusion Matrix : 
[[386  17   3]
 [442  26   1]
 [224   5   3]]
F-Measure : 0.24206897171113265

-=-=-=-=-=-=-=-=-=-=-=-=-=-=-=-- Test iteration 156 on DEV -- LR :0.0009085333333333329 C-LOSS : 1.0963119268417358 AVG-LOSS :1.7332628570544493

Confusion Matrix : 
[[396   8   2]
 [462   7   0]
 [229   0   3]]
F-Measure : 0.21211617684819403

-=-=-=-=-=-=-=-=-=-=-=-=-=-=-=-- Test iteration 157 on DEV -- LR :0.0008954666666666669 C-LOSS : 1.0701824426651 AVG-LOSS :1.7290661455709724

Confusion Matrix : 
[[391   7   8]
 [461   2   6]
 [223   0   9]]
F-Measure : 0.21199451601784147

-=-=-=-=-=-=-=-=-=-=-=-=-=-=-=-- Test iteration 158 on DEV -- LR :0.0008823999999999999 C-LOSS : 1.0948741436004639 AVG-LOSS :1.7250775166277617

Confusion Matrix : 
[[382  11  13]
 [436  18  15]
 [220   2  10]]
F-Measure : 0.24007411874535964

-=-=-=-=-=-=-=-=-=-=-=-=-=-=-=-- Test iteration 159 on DEV -- LR :0.0008693333333333338 C-LOSS : 1.1750164031982422 AVG-LOSS :1.721639634668827

Confusion Matrix : 
[[353  41  12]
 [374  86   9]
 [208  16   8]]
F-Measure : 0.32500508494140523

-=-=-=-=-=-=-=-=-=-=-=-=-=-=-=-- Test iteration 160 on DEV -- LR :0.0008562666666666668 C-LOSS : 1.1018496751785278 AVG-LOSS :1.7177900075912476

Confusion Matrix : 
[[361  24  21]
 [414  38  17]
 [211   6  15]]
F-Measure : 0.2722498191854407

-=-=-=-=-=-=-=-=-=-=-=-=-=-=-=-- Test iteration 161 on DEV -- LR :0.0008431999999999999 C-LOSS : 1.0952624082565308 AVG-LOSS :1.7139472446323913

Confusion Matrix : 
[[348   4  54]
 [408   1  60]
 [200   0  32]]
F-Measure : 0.22468897188146011

-=-=-=-=-=-=-=-=-=-=-=-=-=-=-=-- Test iteration 162 on DEV -- LR :0.000830133333333333 C-LOSS : 1.0642976760864258 AVG-LOSS :1.7099616644572626

Confusion Matrix : 
[[304   2 100]
 [347   0 122]
 [168   0  64]]
F-Measure : 0.2338182084523548

-=-=-=-=-=-=-=-=-=-=-=-=-=-=-=-- Test iteration 163 on DEV -- LR :0.0008170666666666668 C-LOSS : 1.040315866470337 AVG-LOSS :1.7058784583719766

Confusion Matrix : 
[[319   4  83]
 [377   1  91]
 [181   1  50]]
F-Measure : 0.2301213815892153

-=-=-=-=-=-=-=-=-=-=-=-=-=-=-=-- Test iteration 164 on DEV -- LR :0.0008039999999999998 C-LOSS : 1.061781644821167 AVG-LOSS :1.7019748413201534

Confusion Matrix : 
[[352  18  36]
 [399  24  46]
 [203   3  26]]
F-Measure : 0.2614676821979938

-=-=-=-=-=-=-=-=-=-=-=-=-=-=-=-- Test iteration 165 on DEV -- LR :0.0007909333333333338 C-LOSS : 1.0833078622817993 AVG-LOSS :1.6982479318078743

Confusion Matrix : 
[[365  21  20]
 [416  35  18]
 [212   7  13]]
F-Measure : 0.2663742875532267

-=-=-=-=-=-=-=-=-=-=-=-=-=-=-=-- Test iteration 166 on DEV -- LR :0.0007778666666666669 C-LOSS : 1.0116984844207764 AVG-LOSS :1.694136857272622

Confusion Matrix : 
[[387   6  13]
 [448   5  16]
 [219   1  12]]
F-Measure : 0.22166372229853687

-=-=-=-=-=-=-=-=-=-=-=-=-=-=-=-- Test iteration 167 on DEV -- LR :0.0007647999999999998 C-LOSS : 1.0566738843917847 AVG-LOSS :1.690342434814998

Confusion Matrix : 
[[392   3  11]
 [450   2  17]
 [223   1   8]]
F-Measure : 0.21155045332966577

-=-=-=-=-=-=-=-=-=-=-=-=-=-=-=-- Test iteration 168 on DEV -- LR :0.0007517333333333328 C-LOSS : 1.0812811851501465 AVG-LOSS :1.6867385220950877

Confusion Matrix : 
[[401   1   4]
 [463   0   6]
 [229   0   3]]
F-Measure : 0.20135601834341763

-=-=-=-=-=-=-=-=-=-=-=-=-=-=-=-- Test iteration 169 on DEV -- LR :0.0007386666666666668 C-LOSS : 1.060220718383789 AVG-LOSS :1.6830531232497272

Confusion Matrix : 
[[397   7   2]
 [461   6   2]
 [228   2   2]]
F-Measure : 0.2092040840431894

-=-=-=-=-=-=-=-=-=-=-=-=-=-=-=-- Test iteration 170 on DEV -- LR :0.0007256000000000007 C-LOSS : 1.0526795387268066 AVG-LOSS :1.6793667280185989

Confusion Matrix : 
[[383  21   2]
 [429  37   3]
 [224   6   2]]
F-Measure : 0.2571519373351278

-=-=-=-=-=-=-=-=-=-=-=-=-=-=-=-- Test iteration 171 on DEV -- LR :0.0007125333333333337 C-LOSS : 1.0663477182388306 AVG-LOSS :1.6758026640082515

Confusion Matrix : 
[[366  36   4]
 [403  62   4]
 [210  17   5]]
F-Measure : 0.29234926911270565

-=-=-=-=-=-=-=-=-=-=-=-=-=-=-=-- Test iteration 172 on DEV -- LR :0.0006994666666666667 C-LOSS : 1.0722721815109253 AVG-LOSS :1.6723140485024865

Confusion Matrix : 
[[370  26  10]
 [422  41   6]
 [210  11  11]]
F-Measure : 0.27406899306562654

-=-=-=-=-=-=-=-=-=-=-=-=-=-=-=-- Test iteration 173 on DEV -- LR :0.0006863999999999998 C-LOSS : 1.071303129196167 AVG-LOSS :1.6688599627593468

Confusion Matrix : 
[[378   9  19]
 [454   5  10]
 [210   4  18]]
F-Measure : 0.22722515781871064

-=-=-=-=-=-=-=-=-=-=-=-=-=-=-=-- Test iteration 174 on DEV -- LR :0.0006733333333333329 C-LOSS : 1.004057765007019 AVG-LOSS :1.6650610930579048

Confusion Matrix : 
[[376  11  19]
 [454   7   8]
 [210   4  18]]
F-Measure : 0.23005130557399514

-=-=-=-=-=-=-=-=-=-=-=-=-=-=-=-- Test iteration 175 on DEV -- LR :0.0006602666666666667 C-LOSS : 1.0223530530929565 AVG-LOSS :1.6614093428308314

Confusion Matrix : 
[[369  22  15]
 [426  37   6]
 [206  10  16]]
F-Measure : 0.27557636004701613

-=-=-=-=-=-=-=-=-=-=-=-=-=-=-=-- Test iteration 176 on DEV -- LR :0.0006472000000000006 C-LOSS : 1.01116943359375 AVG-LOSS :1.657735671027232

Confusion Matrix : 
[[364  39   3]
 [386  79   4]
 [207  19   6]]
F-Measure : 0.3166168538290108

-=-=-=-=-=-=-=-=-=-=-=-=-=-=-=-- Test iteration 177 on DEV -- LR :0.0006341333333333336 C-LOSS : 1.1102755069732666 AVG-LOSS :1.6546600521280523

Confusion Matrix : 
[[346  58   2]
 [323 143   3]
 [186  43   3]]
F-Measure : 0.3764473160204788

-=-=-=-=-=-=-=-=-=-=-=-=-=-=-=-- Test iteration 178 on DEV -- LR :0.0006210666666666667 C-LOSS : 1.0635333061218262 AVG-LOSS :1.6513576680721518

Confusion Matrix : 
[[337  65   4]
 [315 150   4]
 [180  44   8]]
F-Measure : 0.3877815080479462

-=-=-=-=-=-=-=-=-=-=-=-=-=-=-=-- Test iteration 179 on DEV -- LR :0.0006079999999999997 C-LOSS : 0.9912558794021606 AVG-LOSS :1.6476904359128741

Confusion Matrix : 
[[334  46  26]
 [367  91  11]
 [181  26  25]]
F-Measure : 0.3478600960131057

-=-=-=-=-=-=-=-=-=-=-=-=-=-=-=-- Test iteration 180 on DEV -- LR :0.0005949333333333327 C-LOSS : 1.0199958086013794 AVG-LOSS :1.6442225097951308

Confusion Matrix : 
[[314  25  67]
 [375  50  44]
 [172   8  52]]
F-Measure : 0.31371714677553114

-=-=-=-=-=-=-=-=-=-=-=-=-=-=-=-- Test iteration 181 on DEV -- LR :0.0005818666666666666 C-LOSS : 1.0491598844528198 AVG-LOSS :1.6409529349306127

Confusion Matrix : 
[[240   8 158]
 [330   8 131]
 [131   1 100]]
F-Measure : 0.24047144183291622

-=-=-=-=-=-=-=-=-=-=-=-=-=-=-=-- Test iteration 182 on DEV -- LR :0.0005688000000000006 C-LOSS : 1.043194055557251 AVG-LOSS :1.6376864929668238

Confusion Matrix : 
[[219   3 184]
 [285   2 182]
 [109   0 123]]
F-Measure : 0.23272520289422888

-=-=-=-=-=-=-=-=-=-=-=-=-=-=-=-- Test iteration 183 on DEV -- LR :0.0005557333333333336 C-LOSS : 1.0654382705688477 AVG-LOSS :1.6345764482798784

Confusion Matrix : 
[[250   3 153]
 [309   2 158]
 [126   0 106]]
F-Measure : 0.24011735962176753

-=-=-=-=-=-=-=-=-=-=-=-=-=-=-=-- Test iteration 184 on DEV -- LR :0.0005426666666666666 C-LOSS : 1.0752604007720947 AVG-LOSS :1.6315531182933498

Confusion Matrix : 
[[311   3  92]
 [371   2  96]
 [158   0  74]]
F-Measure : 0.24944718706868807

-=-=-=-=-=-=-=-=-=-=-=-=-=-=-=-- Test iteration 185 on DEV -- LR :0.0005295999999999996 C-LOSS : 1.0604122877120972 AVG-LOSS :1.6284824686665689

Confusion Matrix : 
[[381   3  22]
 [448   3  18]
 [207   1  24]]
F-Measure : 0.23313195632149264

-=-=-=-=-=-=-=-=-=-=-=-=-=-=-=-- Test iteration 186 on DEV -- LR :0.0005165333333333336 C-LOSS : 1.077351450920105 AVG-LOSS :1.6255352439727375

Confusion Matrix : 
[[380  17   9]
 [440  24   5]
 [218   3  11]]
F-Measure : 0.25061171963954526

-=-=-=-=-=-=-=-=-=-=-=-=-=-=-=-- Test iteration 187 on DEV -- LR :0.0005034666666666666 C-LOSS : 1.0157077312469482 AVG-LOSS :1.6222914806071749

Confusion Matrix : 
[[371  28   7]
 [411  53   5]
 [214   9   9]]
F-Measure : 0.2893521027514281

-=-=-=-=-=-=-=-=-=-=-=-=-=-=-=-- Test iteration 188 on DEV -- LR :0.0004904000000000004 C-LOSS : 1.0736956596374512 AVG-LOSS :1.6193888572158006

Confusion Matrix : 
[[364  36   6]
 [380  84   5]
 [208  18   6]]
F-Measure : 0.3239709202760668

-=-=-=-=-=-=-=-=-=-=-=-=-=-=-=-- Test iteration 189 on DEV -- LR :0.0004773333333333335 C-LOSS : 1.0227349996566772 AVG-LOSS :1.6162485737549632

Confusion Matrix : 
[[369  31   6]
 [406  58   5]
 [214  11   7]]
F-Measure : 0.2921341043725837

-=-=-=-=-=-=-=-=-=-=-=-=-=-=-=-- Test iteration 190 on DEV -- LR :0.0004642666666666665 C-LOSS : 0.9822145104408264 AVG-LOSS :1.6129290236852556

Confusion Matrix : 
[[384  16   6]
 [440  24   5]
 [221   3   8]]
F-Measure : 0.2471990906784012

-=-=-=-=-=-=-=-=-=-=-=-=-=-=-=-- Test iteration 191 on DEV -- LR :0.0004511999999999996 C-LOSS : 1.0720610618591309 AVG-LOSS :1.6101120030507445

Confusion Matrix : 
[[387  14   5]
 [451  13   5]
 [223   2   7]]
F-Measure : 0.2274062415889638

-=-=-=-=-=-=-=-=-=-=-=-=-=-=-=-- Test iteration 192 on DEV -- LR :0.00043813333333333343 C-LOSS : 1.0208461284637451 AVG-LOSS :1.6070588119907083

Confusion Matrix : 
[[387  14   5]
 [448  15   6]
 [223   2   7]]
F-Measure : 0.23105649592015046

-=-=-=-=-=-=-=-=-=-=-=-=-=-=-=-- Test iteration 193 on DEV -- LR :0.0004250666666666674 C-LOSS : 1.0326117277145386 AVG-LOSS :1.6040977445459856

Confusion Matrix : 
[[382  18   6]
 [441  22   6]
 [220   4   8]]
F-Measure : 0.24302069777606153

-=-=-=-=-=-=-=-=-=-=-=-=-=-=-=-- Test iteration 194 on DEV -- LR :0.00041200000000000037 C-LOSS : 0.988278329372406 AVG-LOSS :1.6009396962630442

Confusion Matrix : 
[[379  19   8]
 [432  30   7]
 [213   6  13]]
F-Measure : 0.26387595454808266

-=-=-=-=-=-=-=-=-=-=-=-=-=-=-=-- Test iteration 195 on DEV -- LR :0.00039893333333333345 C-LOSS : 0.9986666440963745 AVG-LOSS :1.5978668745683164

Confusion Matrix : 
[[373  20  13]
 [431  30   8]
 [211   5  16]]
F-Measure : 0.26598343290907445

-=-=-=-=-=-=-=-=-=-=-=-=-=-=-=-- Test iteration 196 on DEV -- LR :0.00038586666666666643 C-LOSS : 1.0057765245437622 AVG-LOSS :1.5948613397966183

Confusion Matrix : 
[[376  17  13]
 [439  22   8]
 [214   4  14]]
F-Measure : 0.25058288267817286

-=-=-=-=-=-=-=-=-=-=-=-=-=-=-=-- Test iteration 197 on DEV -- LR :0.0003727999999999995 C-LOSS : 1.052648901939392 AVG-LOSS :1.5921228931407736

Confusion Matrix : 
[[384   9  13]
 [453   7   9]
 [216   2  14]]
F-Measure : 0.22713175661272325

-=-=-=-=-=-=-=-=-=-=-=-=-=-=-=-- Test iteration 198 on DEV -- LR :0.00035973333333333337 C-LOSS : 1.0023126602172852 AVG-LOSS :1.5891590226235701

Confusion Matrix : 
[[385   5  16]
 [455   4  10]
 [219   0  13]]
F-Measure : 0.2199640166536042

-=-=-=-=-=-=-=-=-=-=-=-=-=-=-=-- Test iteration 199 on DEV -- LR :0.0003466666666666673 C-LOSS : 1.0569918155670166 AVG-LOSS :1.5864981865882875

Confusion Matrix : 
[[387   3  16]
 [456   3  10]
 [216   0  16]]
F-Measure : 0.22359541547249293

-=-=-=-=-=-=-=-=-=-=-=-=-=-=-=-- Test iteration 200 on DEV -- LR :0.0003336000000000003 C-LOSS : 1.0020029544830322 AVG-LOSS :1.5835902501101518

Confusion Matrix : 
[[387   2  17]
 [456   3  10]
 [217   0  15]]
F-Measure : 0.22194478355883546

-=-=-=-=-=-=-=-=-=-=-=-=-=-=-=-- Test iteration 201 on DEV -- LR :0.0003205333333333334 C-LOSS : 1.049881100654602 AVG-LOSS :1.5809481256078965

Confusion Matrix : 
[[380   7  19]
 [453   5  11]
 [214   0  18]]
F-Measure : 0.22758782687609505

-=-=-=-=-=-=-=-=-=-=-=-=-=-=-=-- Test iteration 202 on DEV -- LR :0.00030746666666666637 C-LOSS : 1.081486701965332 AVG-LOSS :1.578487724506209

Confusion Matrix : 
[[371  14  21]
 [438  19  12]
 [210   2  20]]
F-Measure : 0.2523282989165174

-=-=-=-=-=-=-=-=-=-=-=-=-=-=-=-- Test iteration 203 on DEV -- LR :0.00029439999999999946 C-LOSS : 1.0401854515075684 AVG-LOSS :1.5758489878738628

Confusion Matrix : 
[[359  19  28]
 [429  26  14]
 [204   6  22]]
F-Measure : 0.26188289898468203

-=-=-=-=-=-=-=-=-=-=-=-=-=-=-=-- Test iteration 204 on DEV -- LR :0.0002813333333333333 C-LOSS : 1.0455098152160645 AVG-LOSS :1.5732619675194346

Confusion Matrix : 
[[352  15  39]
 [431  19  19]
 [200   3  29]]
F-Measure : 0.25580847327001593

-=-=-=-=-=-=-=-=-=-=-=-=-=-=-=-- Test iteration 205 on DEV -- LR :0.00026826666666666726 C-LOSS : 1.0611960887908936 AVG-LOSS :1.5707762108265775

Confusion Matrix : 
[[346  12  48]
 [431  12  26]
 [198   1  33]]
F-Measure : 0.24516219646591036

-=-=-=-=-=-=-=-=-=-=-=-=-=-=-=-- Test iteration 206 on DEV -- LR :0.00025520000000000024 C-LOSS : 1.0292751789093018 AVG-LOSS :1.5681602638124843

Confusion Matrix : 
[[355   8  43]
 [438   8  23]
 [202   1  29]]
F-Measure : 0.2369857360978991

-=-=-=-=-=-=-=-=-=-=-=-=-=-=-=-- Test iteration 207 on DEV -- LR :0.00024213333333333333 C-LOSS : 1.0089430809020996 AVG-LOSS :1.5654717196638768

Confusion Matrix : 
[[362   9  35]
 [442  11  16]
 [204   1  27]]
F-Measure : 0.2433163813927382

-=-=-=-=-=-=-=-=-=-=-=-=-=-=-=-- Test iteration 208 on DEV -- LR :0.0002290666666666663 C-LOSS : 1.0076632499694824 AVG-LOSS :1.5628027796174921

Confusion Matrix : 
[[364  11  31]
 [441  14  14]
 [207   1  24]]
F-Measure : 0.24567843458685287

-=-=-=-=-=-=-=-=-=-=-=-=-=-=-=-- Test iteration 209 on DEV -- LR :0.00021600000000000026 C-LOSS : 1.0082788467407227 AVG-LOSS :1.560162189460936

Confusion Matrix : 
[[362  15  29]
 [439  17  13]
 [206   3  23]]
F-Measure : 0.24896102744795773

-=-=-=-=-=-=-=-=-=-=-=-=-=-=-=-- Test iteration 210 on DEV -- LR :0.00020293333333333324 C-LOSS : 1.0327012538909912 AVG-LOSS :1.557662374600415

Confusion Matrix : 
[[364  14  28]
 [440  17  12]
 [206   3  23]]
F-Measure : 0.24987581185879887

-=-=-=-=-=-=-=-=-=-=-=-=-=-=-=-- Test iteration 211 on DEV -- LR :0.0001898666666666672 C-LOSS : 1.048134684562683 AVG-LOSS :1.555258942100237

Confusion Matrix : 
[[368  14  24]
 [440  18  11]
 [209   4  19]]
F-Measure : 0.24774074057982823

-=-=-=-=-=-=-=-=-=-=-=-=-=-=-=-- Test iteration 212 on DEV -- LR :0.00017680000000000018 C-LOSS : 1.0206760168075562 AVG-LOSS :1.5527491631082526

Confusion Matrix : 
[[366  17  23]
 [430  27  12]
 [205   7  20]]
F-Measure : 0.26401284690549254

-=-=-=-=-=-=-=-=-=-=-=-=-=-=-=-- Test iteration 213 on DEV -- LR :0.00016373333333333327 C-LOSS : 1.0135356187820435 AVG-LOSS :1.5502294736487843

Confusion Matrix : 
[[357  23  26]
 [418  39  12]
 [202   8  22]]
F-Measure : 0.282235085865828

-=-=-=-=-=-=-=-=-=-=-=-=-=-=-=-- Test iteration 214 on DEV -- LR :0.00015066666666666625 C-LOSS : 1.0431745052337646 AVG-LOSS :1.547871078446854

Confusion Matrix : 
[[340  32  34]
 [399  54  16]
 [194   9  29]]
F-Measure : 0.3064671281487486

-=-=-=-=-=-=-=-=-=-=-=-=-=-=-=-- Test iteration 215 on DEV -- LR :0.0001376000000000002 C-LOSS : 0.9957356452941895 AVG-LOSS :1.545314895885962

Confusion Matrix : 
[[337  30  39]
 [404  47  18]
 [189  10  33]]
F-Measure : 0.2996093181851345

-=-=-=-=-=-=-=-=-=-=-=-=-=-=-=-- Test iteration 216 on DEV -- LR :0.00012453333333333318 C-LOSS : 1.0482732057571411 AVG-LOSS :1.5430243811849076

Confusion Matrix : 
[[332  29  45]
 [404  44  21]
 [188  10  34]]
F-Measure : 0.2935690380065862

-=-=-=-=-=-=-=-=-=-=-=-=-=-=-=-- Test iteration 217 on DEV -- LR :0.00011146666666666714 C-LOSS : 1.0112513303756714 AVG-LOSS :1.5405850552637643

Confusion Matrix : 
[[334  23  49]
 [408  35  26]
 [188  10  34]]
F-Measure : 0.2803973532325671

-=-=-=-=-=-=-=-=-=-=-=-=-=-=-=-- Test iteration 218 on DEV -- LR :9.840000000000011e-05 C-LOSS : 0.9797682762145996 AVG-LOSS :1.538024248053494

Confusion Matrix : 
[[333  21  52]
 [416  26  27]
 [191   7  34]]
F-Measure : 0.2649025023195208

-=-=-=-=-=-=-=-=-=-=-=-=-=-=-=-- Test iteration 219 on DEV -- LR :8.53333333333332e-05 C-LOSS : 1.0557881593704224 AVG-LOSS :1.5358322658322074

Confusion Matrix : 
[[334  19  53]
 [423  16  30]
 [195   4  33]]
F-Measure : 0.24684249981282727

-=-=-=-=-=-=-=-=-=-=-=-=-=-=-=-- Test iteration 220 on DEV -- LR :7.226666666666618e-05 C-LOSS : 1.027809739112854 AVG-LOSS :1.533533521367414

Confusion Matrix : 
[[334  17  55]
 [420  15  34]
 [191   4  37]]
F-Measure : 0.2498309009853848

-=-=-=-=-=-=-=-=-=-=-=-=-=-=-=-- Test iteration 221 on DEV -- LR :5.920000000000014e-05 C-LOSS : 0.9999499917030334 AVG-LOSS :1.5311299919545114

Confusion Matrix : 
[[338  13  55]
 [417  13  39]
 [191   3  38]]
F-Measure : 0.24925519802589052

-=-=-=-=-=-=-=-=-=-=-=-=-=-=-=-- Test iteration 222 on DEV -- LR :4.6133333333333985e-05 C-LOSS : 0.9890897870063782 AVG-LOSS :1.5286993183897215

Confusion Matrix : 
[[337  13  56]
 [422  10  37]
 [191   3  38]]
F-Measure : 0.24329255427852015

-=-=-=-=-=-=-=-=-=-=-=-=-=-=-=-- Test iteration 223 on DEV -- LR :3.306666666666707e-05 C-LOSS : 1.0363801717758179 AVG-LOSS :1.5265014650566238

Confusion Matrix : 
[[340  12  54]
 [423  10  36]
 [193   2  37]]
F-Measure : 0.24349593960729105

-=-=-=-=-=-=-=-=-=-=-=-=-=-=-=-- Test iteration 224 on DEV -- LR :2.0000000000000052e-05 C-LOSS : 1.033063292503357 AVG-LOSS :1.5243084065119425

Confusion Matrix : 
[[345   9  52]
 [424  10  35]
 [194   2  36]]
F-Measure : 0.2446499511054275

-=-=-=-=-=-=-=-=-=-=-=-=-=-=-=-- Train epoch 3 --=-=-=-=-=-=-=-=-=-=-=-=-=-


-=-=-=-=-=-=-=-=-=-=-=-=-=-=-=-- Test iteration 225 on DEV -- LR :3.306666666666707e-05 C-LOSS : 3.6172900199890137 AVG-LOSS :1.533569387102549

Confusion Matrix : 
[[389   6  11]
 [457   7   5]
 [219   0  13]]
F-Measure : 0.2271577536745766

-=-=-=-=-=-=-=-=-=-=-=-=-=-=-=-- Test iteration 226 on DEV -- LR :4.6133333333333985e-05 C-LOSS : 0.9446505904197693 AVG-LOSS :1.5309750311700259

Confusion Matrix : 
[[390   5  11]
 [458   6   5]
 [219   0  13]]
F-Measure : 0.2256783449067047

-=-=-=-=-=-=-=-=-=-=-=-=-=-=-=-- Test iteration 227 on DEV -- LR :5.920000000000014e-05 C-LOSS : 1.04643976688385 AVG-LOSS :1.528849876502104

Confusion Matrix : 
[[389   4  13]
 [459   5   5]
 [218   0  14]]
F-Measure : 0.22493406975399002

-=-=-=-=-=-=-=-=-=-=-=-=-=-=-=-- Test iteration 228 on DEV -- LR :7.226666666666618e-05 C-LOSS : 1.0214669704437256 AVG-LOSS :1.5266342306241198

Confusion Matrix : 
[[388   4  14]
 [459   5   5]
 [218   0  14]]
F-Measure : 0.22448331811879418

-=-=-=-=-=-=-=-=-=-=-=-=-=-=-=-- Test iteration 229 on DEV -- LR :8.53333333333332e-05 C-LOSS : 1.030928373336792 AVG-LOSS :1.5244789877663487

Confusion Matrix : 
[[390   2  14]
 [459   5   5]
 [216   0  16]]
F-Measure : 0.2284916943344912

-=-=-=-=-=-=-=-=-=-=-=-=-=-=-=-- Test iteration 230 on DEV -- LR :9.840000000000011e-05 C-LOSS : 0.9807085990905762 AVG-LOSS :1.522125003399787

Confusion Matrix : 
[[389   2  15]
 [457   5   7]
 [216   0  16]]
F-Measure : 0.22811036567521875

-=-=-=-=-=-=-=-=-=-=-=-=-=-=-=-- Test iteration 231 on DEV -- LR :0.00011146666666666714 C-LOSS : 1.0213942527770996 AVG-LOSS :1.519966681198827

Confusion Matrix : 
[[387   3  16]
 [457   5   7]
 [214   0  18]]
F-Measure : 0.23041845771663697

-=-=-=-=-=-=-=-=-=-=-=-=-=-=-=-- Test iteration 232 on DEV -- LR :0.00012453333333333318 C-LOSS : 0.967505693435669 AVG-LOSS :1.5175956039981269

Confusion Matrix : 
[[383   3  20]
 [454   5  10]
 [212   0  20]]
F-Measure : 0.2316919980670318

-=-=-=-=-=-=-=-=-=-=-=-=-=-=-=-- Test iteration 233 on DEV -- LR :0.0001376000000000002 C-LOSS : 1.0272432565689087 AVG-LOSS :1.5155000811458652

Confusion Matrix : 
[[381   3  22]
 [454   5  10]
 [212   0  20]]
F-Measure : 0.23073877000685225

-=-=-=-=-=-=-=-=-=-=-=-=-=-=-=-- Test iteration 234 on DEV -- LR :0.00015066666666666625 C-LOSS : 1.029031753540039 AVG-LOSS :1.5134300031560532

Confusion Matrix : 
[[384   3  19]
 [456   5   7]
 [214   0  19]]
F-Measure : 0.23057631158454367

-=-=-=-=-=-=-=-=-=-=-=-=-=-=-=-- Test iteration 235 on DEV -- LR :0.00016373333333333327 C-LOSS : 0.9853658676147461 AVG-LOSS :1.5111924432596917

Confusion Matrix : 
[[380   5  21]
 [456   5   7]
 [212   1  20]]
F-Measure : 0.23048978785926516

-=-=-=-=-=-=-=-=-=-=-=-=-=-=-=-- Test iteration 236 on DEV -- LR :0.00017680000000000018 C-LOSS : 1.0613155364990234 AVG-LOSS :1.5092942284632334

Confusion Matrix : 
[[376   7  23]
 [452   7   9]
 [211   1  21]]
F-Measure : 0.234029432631406

-=-=-=-=-=-=-=-=-=-=-=-=-=-=-=-- Test iteration 237 on DEV -- LR :0.0001898666666666672 C-LOSS : 1.0536988973617554 AVG-LOSS :1.5073799623661683

Confusion Matrix : 
[[367   8  31]
 [450   7  11]
 [209   1  23]]
F-Measure : 0.23270730351487987

-=-=-=-=-=-=-=-=-=-=-=-=-=-=-=-- Test iteration 238 on DEV -- LR :0.00020293333333333324 C-LOSS : 1.0580825805664062 AVG-LOSS :1.5055000570029893

Confusion Matrix : 
[[360   7  39]
 [446   7  15]
 [202   1  30]]
F-Measure : 0.23884267121126543

-=-=-=-=-=-=-=-=-=-=-=-=-=-=-=-- Test iteration 239 on DEV -- LR :0.00021600000000000026 C-LOSS : 1.0160917043685913 AVG-LOSS :1.5034608555336793

Confusion Matrix : 
[[355   4  47]
 [443   6  19]
 [200   1  32]]
F-Measure : 0.23675625629383182

-=-=-=-=-=-=-=-=-=-=-=-=-=-=-=-- Test iteration 240 on DEV -- LR :0.0002290666666666663 C-LOSS : 1.0295079946517944 AVG-LOSS :1.5014942461524268

Confusion Matrix : 
[[349   3  54]
 [437   6  25]
 [198   1  34]]
F-Measure : 0.23614916032714728

-=-=-=-=-=-=-=-=-=-=-=-=-=-=-=-- Test iteration 241 on DEV -- LR :0.00024213333333333333 C-LOSS : 1.0611186027526855 AVG-LOSS :1.4996745120887913

Confusion Matrix : 
[[346   3  57]
 [437   6  25]
 [198   1  34]]
F-Measure : 0.23460538178163556

-=-=-=-=-=-=-=-=-=-=-=-=-=-=-=-- Test iteration 242 on DEV -- LR :0.00025520000000000024 C-LOSS : 0.9967144727706909 AVG-LOSS :1.4976047176883054

Confusion Matrix : 
[[349   6  51]
 [439   6  23]
 [197   1  35]]
F-Measure : 0.2376652439250999

-=-=-=-=-=-=-=-=-=-=-=-=-=-=-=-- Test iteration 243 on DEV -- LR :0.00026826666666666726 C-LOSS : 1.0330400466918945 AVG-LOSS :1.495700764118648

Confusion Matrix : 
[[351   9  46]
 [441   9  18]
 [200   2  31]]
F-Measure : 0.23954491657090304

-=-=-=-=-=-=-=-=-=-=-=-=-=-=-=-- Test iteration 244 on DEV -- LR :0.0002813333333333333 C-LOSS : 1.0329371690750122 AVG-LOSS :1.4938119331184698

Confusion Matrix : 
[[359  15  32]
 [439  16  13]
 [199   5  29]]
F-Measure : 0.2542986432174844

-=-=-=-=-=-=-=-=-=-=-=-=-=-=-=-- Test iteration 245 on DEV -- LR :0.00029439999999999946 C-LOSS : 1.0320202112197876 AVG-LOSS :1.4919347309969304

Confusion Matrix : 
[[356  27  23]
 [430  31   7]
 [198  10  25]]
F-Measure : 0.27330730340830817

-=-=-=-=-=-=-=-=-=-=-=-=-=-=-=-- Test iteration 246 on DEV -- LR :0.00030746666666666637 C-LOSS : 1.046813726425171 AVG-LOSS :1.4901326216666804

Confusion Matrix : 
[[358  28  20]
 [418  42   8]
 [201   9  23]]
F-Measure : 0.28888901993276994

-=-=-=-=-=-=-=-=-=-=-=-=-=-=-=-- Test iteration 247 on DEV -- LR :0.0003205333333333334 C-LOSS : 1.0234214067459106 AVG-LOSS :1.4882507216065162

Confusion Matrix : 
[[367  19  20]
 [436  23   9]
 [205   6  22]]
F-Measure : 0.2606793107763131

-=-=-=-=-=-=-=-=-=-=-=-=-=-=-=-- Test iteration 248 on DEV -- LR :0.0003336000000000003 C-LOSS : 1.117619514465332 AVG-LOSS :1.4867622428629772

Confusion Matrix : 
[[367  10  29]
 [444  14  10]
 [205   2  26]]
F-Measure : 0.2500007599132085

-=-=-=-=-=-=-=-=-=-=-=-=-=-=-=-- Test iteration 249 on DEV -- LR :0.0003466666666666673 C-LOSS : 1.0068212747573853 AVG-LOSS :1.4848424789905548

Confusion Matrix : 
[[364   8  34]
 [443  13  12]
 [203   2  28]]
F-Measure : 0.24933890635447756

-=-=-=-=-=-=-=-=-=-=-=-=-=-=-=-- Test iteration 250 on DEV -- LR :0.00035973333333333337 C-LOSS : 1.0354347229003906 AVG-LOSS :1.4830520098427853

Confusion Matrix : 
[[356   3  47]
 [444   7  17]
 [201   2  30]]
F-Measure : 0.23654474245382984

-=-=-=-=-=-=-=-=-=-=-=-=-=-=-=-- Test iteration 251 on DEV -- LR :0.0003727999999999995 C-LOSS : 1.0159952640533447 AVG-LOSS :1.4811986100579064

Confusion Matrix : 
[[355   3  48]
 [445   6  17]
 [202   1  30]]
F-Measure : 0.23405692757973914

-=-=-=-=-=-=-=-=-=-=-=-=-=-=-=-- Test iteration 252 on DEV -- LR :0.00038586666666666643 C-LOSS : 0.9965011477470398 AVG-LOSS :1.4792828098116184

Confusion Matrix : 
[[355   2  49]
 [445   6  17]
 [202   0  31]]
F-Measure : 0.2351438035590355

-=-=-=-=-=-=-=-=-=-=-=-=-=-=-=-- Test iteration 253 on DEV -- LR :0.00039893333333333345 C-LOSS : 0.9972034096717834 AVG-LOSS :1.477384859417367

Confusion Matrix : 
[[358   2  46]
 [446   6  16]
 [204   0  29]]
F-Measure : 0.23404910053006553

-=-=-=-=-=-=-=-=-=-=-=-=-=-=-=-- Test iteration 254 on DEV -- LR :0.00041200000000000037 C-LOSS : 1.0269633531570435 AVG-LOSS :1.4756185005692875

Confusion Matrix : 
[[366   2  38]
 [449   6  13]
 [205   0  28]]
F-Measure : 0.23670132729462

-=-=-=-=-=-=-=-=-=-=-=-=-=-=-=-- Test iteration 255 on DEV -- LR :0.0004250666666666674 C-LOSS : 0.9810404777526855 AVG-LOSS :1.4736865551676601

Confusion Matrix : 
[[364   2  40]
 [452   1  15]
 [204   0  29]]
F-Measure : 0.22754188185187163

-=-=-=-=-=-=-=-=-=-=-=-=-=-=-=-- Test iteration 256 on DEV -- LR :0.00043813333333333343 C-LOSS : 1.0118451118469238 AVG-LOSS :1.4718895067500697

Confusion Matrix : 
[[378   1  27]
 [455   0  13]
 [212   0  21]]
F-Measure : 0.221156123477483

-=-=-=-=-=-=-=-=-=-=-=-=-=-=-=-- Test iteration 257 on DEV -- LR :0.0004511999999999996 C-LOSS : 1.0490002632141113 AVG-LOSS :1.470250401154969

Confusion Matrix : 
[[379   0  27]
 [455   0  13]
 [211   0  22]]
F-Measure : 0.2229866945221411

-=-=-=-=-=-=-=-=-=-=-=-=-=-=-=-- Test iteration 258 on DEV -- LR :0.0004642666666666665 C-LOSS : 1.0926122665405273 AVG-LOSS :1.4687923388591604

Confusion Matrix : 
[[379   0  27]
 [454   0  14]
 [212   0  21]]
F-Measure : 0.22155971980041647

-=-=-=-=-=-=-=-=-=-=-=-=-=-=-=-- Test iteration 259 on DEV -- LR :0.0004773333333333335 C-LOSS : 1.0564879179000854 AVG-LOSS :1.4672065526247025

Confusion Matrix : 
[[367   1  38]
 [449   0  19]
 [203   0  30]]
F-Measure : 0.22837679677966372

-=-=-=-=-=-=-=-=-=-=-=-=-=-=-=-- Test iteration 260 on DEV -- LR :0.0004904000000000004 C-LOSS : 1.017338514328003 AVG-LOSS :1.4654829202940638

Confusion Matrix : 
[[337  10  59]
 [430  10  28]
 [187   6  40]]
F-Measure : 0.24564947581593688

-=-=-=-=-=-=-=-=-=-=-=-=-=-=-=-- Test iteration 261 on DEV -- LR :0.0005034666666666666 C-LOSS : 1.0622189044952393 AVG-LOSS :1.4639437446612438

Confusion Matrix : 
[[312  35  59]
 [375  64  29]
 [171  25  37]]
F-Measure : 0.3159725204238563

-=-=-=-=-=-=-=-=-=-=-=-=-=-=-=-- Test iteration 262 on DEV -- LR :0.0005165333333333336 C-LOSS : 1.0241354703903198 AVG-LOSS :1.4622714698541301

Confusion Matrix : 
[[293  33  80]
 [371  55  42]
 [165  23  45]]
F-Measure : 0.3016995948612476

-=-=-=-=-=-=-=-=-=-=-=-=-=-=-=-- Test iteration 263 on DEV -- LR :0.0005295999999999996 C-LOSS : 1.0173940658569336 AVG-LOSS :1.4605863281723224

Confusion Matrix : 
[[321  23  62]
 [399  39  30]
 [177  15  41]]
F-Measure : 0.28836667589064696

-=-=-=-=-=-=-=-=-=-=-=-=-=-=-=-- Test iteration 264 on DEV -- LR :0.0005426666666666666 C-LOSS : 1.0762052536010742 AVG-LOSS :1.459135833551299

Confusion Matrix : 
[[336  21  49]
 [429  20  19]
 [189  10  34]]
F-Measure : 0.25652814024913434

-=-=-=-=-=-=-=-=-=-=-=-=-=-=-=-- Test iteration 265 on DEV -- LR :0.0005557333333333336 C-LOSS : 1.0602455139160156 AVG-LOSS :1.457636245883497

Confusion Matrix : 
[[356  19  31]
 [432  25  11]
 [198  10  25]]
F-Measure : 0.2631685512257422

-=-=-=-=-=-=-=-=-=-=-=-=-=-=-=-- Test iteration 266 on DEV -- LR :0.0005688000000000006 C-LOSS : 0.9936090111732483 AVG-LOSS :1.4558983161654813

Confusion Matrix : 
[[373  20  13]
 [426  33   9]
 [205   7  21]]
F-Measure : 0.2789179724462473

-=-=-=-=-=-=-=-=-=-=-=-=-=-=-=-- Test iteration 267 on DEV -- LR :0.0005818666666666666 C-LOSS : 1.0291082859039307 AVG-LOSS :1.454305816052565

Confusion Matrix : 
[[362  32  12]
 [396  65   7]
 [201  14  18]]
F-Measure : 0.31751398068429115

-=-=-=-=-=-=-=-=-=-=-=-=-=-=-=-- Test iteration 268 on DEV -- LR :0.0005949333333333327 C-LOSS : 1.0215840339660645 AVG-LOSS :1.452697184892392

Confusion Matrix : 
[[341  54  11]
 [352 108   8]
 [183  33  17]]
F-Measure : 0.35944426534567586

-=-=-=-=-=-=-=-=-=-=-=-=-=-=-=-- Test iteration 269 on DEV -- LR :0.0006079999999999997 C-LOSS : 0.9827441573143005 AVG-LOSS :1.4509566181235842

Confusion Matrix : 
[[324  57  25]
 [340 114  14]
 [171  33  29]]
F-Measure : 0.3755009042867215

-=-=-=-=-=-=-=-=-=-=-=-=-=-=-=-- Test iteration 270 on DEV -- LR :0.0006210666666666667 C-LOSS : 1.0343518257141113 AVG-LOSS :1.4494193310667227

Confusion Matrix : 
[[306  33  67]
 [376  66  26]
 [175  20  38]]
F-Measure : 0.31673003389935345

-=-=-=-=-=-=-=-=-=-=-=-=-=-=-=-- Test iteration 271 on DEV -- LR :0.0006341333333333336 C-LOSS : 1.0035550594329834 AVG-LOSS :1.4477801241857164

Confusion Matrix : 
[[339  17  50]
 [420  24  24]
 [186  13  34]]
F-Measure : 0.2649043551977531

-=-=-=-=-=-=-=-=-=-=-=-=-=-=-=-- Test iteration 272 on DEV -- LR :0.0006472000000000006 C-LOSS : 0.9796051979064941 AVG-LOSS :1.4460651977158292

Confusion Matrix : 
[[384   2  20]
 [456   1  11]
 [207   5  21]]
F-Measure : 0.22664791049562782

-=-=-=-=-=-=-=-=-=-=-=-=-=-=-=-- Test iteration 273 on DEV -- LR :0.0006602666666666667 C-LOSS : 1.0706634521484375 AVG-LOSS :1.4446951183524446

Confusion Matrix : 
[[393   2  11]
 [457   1  10]
 [218   1  14]]
F-Measure : 0.21935225139953876

-=-=-=-=-=-=-=-=-=-=-=-=-=-=-=-- Test iteration 274 on DEV -- LR :0.0006733333333333329 C-LOSS : 0.9700452089309692 AVG-LOSS :1.442969118681821

Confusion Matrix : 
[[391   2  13]
 [454   3  11]
 [210   4  19]]
F-Measure : 0.23060337228978675

-=-=-=-=-=-=-=-=-=-=-=-=-=-=-=-- Test iteration 275 on DEV -- LR :0.0006863999999999998 C-LOSS : 1.0212407112121582 AVG-LOSS :1.4414411172054815

Confusion Matrix : 
[[371  11  24]
 [428  28  12]
 [201   9  23]]
F-Measure : 0.27259070690704934

-=-=-=-=-=-=-=-=-=-=-=-=-=-=-=-- Test iteration 276 on DEV -- LR :0.0006994666666666667 C-LOSS : 1.0055779218673706 AVG-LOSS :1.4398676038649108

Confusion Matrix : 
[[325  30  51]
 [378  62  28]
 [181  17  35]]
F-Measure : 0.3181137445377056

-=-=-=-=-=-=-=-=-=-=-=-=-=-=-=-- Test iteration 277 on DEV -- LR :0.0007125333333333337 C-LOSS : 1.0612472295761108 AVG-LOSS :1.438505660072505

Confusion Matrix : 
[[276  19 111]
 [344  42  82]
 [144  13  76]]
F-Measure : 0.30228535145364394

-=-=-=-=-=-=-=-=-=-=-=-=-=-=-=-- Test iteration 278 on DEV -- LR :0.0007256000000000007 C-LOSS : 1.0185537338256836 AVG-LOSS :1.437000456035778

Confusion Matrix : 
[[349  15  42]
 [399  35  34]
 [188   8  37]]
F-Measure : 0.2920344572074218

-=-=-=-=-=-=-=-=-=-=-=-=-=-=-=-- Test iteration 279 on DEV -- LR :0.0007386666666666668 C-LOSS : 0.9723088145256042 AVG-LOSS :1.4353408430303847

Confusion Matrix : 
[[371  18  17]
 [420  33  15]
 [210   8  15]]
F-Measure : 0.26891124132177396

-=-=-=-=-=-=-=-=-=-=-=-=-=-=-=-- Test iteration 280 on DEV -- LR :0.0007517333333333328 C-LOSS : 0.9756266474723816 AVG-LOSS :1.4337048494518865

Confusion Matrix : 
[[369  30   7]
 [401  57  10]
 [213  12   8]]
F-Measure : 0.2929175729955865

-=-=-=-=-=-=-=-=-=-=-=-=-=-=-=-- Test iteration 281 on DEV -- LR :0.0007647999999999998 C-LOSS : 1.0581759214401245 AVG-LOSS :1.4323731865865965

Confusion Matrix : 
[[370  34   2]
 [394  70   4]
 [213  15   5]]
F-Measure : 0.30569599603692305

-=-=-=-=-=-=-=-=-=-=-=-=-=-=-=-- Test iteration 282 on DEV -- LR :0.0007778666666666669 C-LOSS : 1.031237244606018 AVG-LOSS :1.430955745095499

Confusion Matrix : 
[[373  29   4]
 [412  51   5]
 [213  14   6]]
F-Measure : 0.28178621684859373

-=-=-=-=-=-=-=-=-=-=-=-=-=-=-=-- Test iteration 283 on DEV -- LR :0.0007909333333333338 C-LOSS : 1.1029657125473022 AVG-LOSS :1.4298008506146955

Confusion Matrix : 
[[370  27   9]
 [406  50  12]
 [209  15   9]]
F-Measure : 0.2850105637905056

-=-=-=-=-=-=-=-=-=-=-=-=-=-=-=-- Test iteration 284 on DEV -- LR :0.0008039999999999998 C-LOSS : 1.0399465560913086 AVG-LOSS :1.4284329408093503

Confusion Matrix : 
[[374  23   9]
 [415  40  13]
 [214  12   7]]
F-Measure : 0.2682340374869637

-=-=-=-=-=-=-=-=-=-=-=-=-=-=-=-- Test iteration 285 on DEV -- LR :0.0008170666666666668 C-LOSS : 1.0500988960266113 AVG-LOSS :1.427110094498921

Confusion Matrix : 
[[386   7  13]
 [438   9  21]
 [215   1  17]]
F-Measure : 0.23683053011710947

-=-=-=-=-=-=-=-=-=-=-=-=-=-=-=-- Test iteration 286 on DEV -- LR :0.000830133333333333 C-LOSS : 0.9905267953872681 AVG-LOSS :1.425588898334769

Confusion Matrix : 
[[390   0  16]
 [444   1  23]
 [216   0  17]]
F-Measure : 0.22304200570330465

-=-=-=-=-=-=-=-=-=-=-=-=-=-=-=-- Test iteration 287 on DEV -- LR :0.0008431999999999999 C-LOSS : 1.030295729637146 AVG-LOSS :1.4242163526101246

Confusion Matrix : 
[[398   0   8]
 [456   0  12]
 [219   0  14]]
F-Measure : 0.2194618435866374

-=-=-=-=-=-=-=-=-=-=-=-=-=-=-=-- Test iteration 288 on DEV -- LR :0.0008562666666666668 C-LOSS : 0.9819642901420593 AVG-LOSS :1.4226860686569478

Confusion Matrix : 
[[388   3  15]
 [452   5  11]
 [217   1  15]]
F-Measure : 0.2264422330230146

-=-=-=-=-=-=-=-=-=-=-=-=-=-=-=-- Test iteration 289 on DEV -- LR :0.0008693333333333338 C-LOSS : 0.9715473651885986 AVG-LOSS :1.4211304179553328

Confusion Matrix : 
[[368  21  17]
 [407  48  13]
 [202  14  17]]
F-Measure : 0.29439521851569145

-=-=-=-=-=-=-=-=-=-=-=-=-=-=-=-- Test iteration 290 on DEV -- LR :0.0008823999999999999 C-LOSS : 1.0561975240707397 AVG-LOSS :1.4198763530278944

Confusion Matrix : 
[[345  37  24]
 [371  83  14]
 [190  20  23]]
F-Measure : 0.34124068614797964

-=-=-=-=-=-=-=-=-=-=-=-=-=-=-=-- Test iteration 291 on DEV -- LR :0.0008954666666666669 C-LOSS : 1.05351722240448 AVG-LOSS :1.4186216984709648

Confusion Matrix : 
[[357  17  32]
 [430  25  13]
 [202   6  25]]
F-Measure : 0.263414482955217

-=-=-=-=-=-=-=-=-=-=-=-=-=-=-=-- Test iteration 292 on DEV -- LR :0.0009085333333333329 C-LOSS : 1.064720630645752 AVG-LOSS :1.4174138449971587

Confusion Matrix : 
[[391   7   8]
 [449  13   6]
 [217   3  13]]
F-Measure : 0.23947283781396653

-=-=-=-=-=-=-=-=-=-=-=-=-=-=-=-- Test iteration 293 on DEV -- LR :0.0009216 C-LOSS : 1.0718066692352295 AVG-LOSS :1.4162383103857235

Confusion Matrix : 
[[389   9   8]
 [447  15   6]
 [217   3  13]]
F-Measure : 0.2422401686164036

-=-=-=-=-=-=-=-=-=-=-=-=-=-=-=-- Test iteration 294 on DEV -- LR :0.000934666666666667 C-LOSS : 1.0247687101364136 AVG-LOSS :1.414911294791658

Confusion Matrix : 
[[367  18  21]
 [426  31  11]
 [210   6  17]]
F-Measure : 0.26655146970309734

-=-=-=-=-=-=-=-=-=-=-=-=-=-=-=-- Test iteration 295 on DEV -- LR :0.0009477333333333339 C-LOSS : 1.0341683626174927 AVG-LOSS :1.4136250011018805

Confusion Matrix : 
[[341  12  53]
 [423  21  24]
 [192   7  34]]
F-Measure : 0.26020699545013093

-=-=-=-=-=-=-=-=-=-=-=-=-=-=-=-- Test iteration 296 on DEV -- LR :0.0009607999999999999 C-LOSS : 0.9809495210647583 AVG-LOSS :1.4121681813037756

Confusion Matrix : 
[[329   5  72]
 [421   6  41]
 [192   2  39]]
F-Measure : 0.23221488652479458

-=-=-=-=-=-=-=-=-=-=-=-=-=-=-=-- Test iteration 297 on DEV -- LR :0.0009738666666666661 C-LOSS : 1.061825156211853 AVG-LOSS :1.4109925335685678

Confusion Matrix : 
[[368   5  33]
 [441   7  20]
 [208   2  23]]
F-Measure : 0.23330587783975054

-=-=-=-=-=-=-=-=-=-=-=-=-=-=-=-- Test iteration 298 on DEV -- LR :0.0009869333333333331 C-LOSS : 1.0253242254257202 AVG-LOSS :1.4097026730062172

Confusion Matrix : 
[[388  14   4]
 [439  27   2]
 [224   6   3]]
F-Measure : 0.24488239001166448

-=-=-=-=-=-=-=-=-=-=-=-=-=-=-=-- Test iteration 299 on DEV -- LR :0.001 C-LOSS : 1.0806022882461548 AVG-LOSS :1.4086056717236837

Confusion Matrix : 
[[362  42   2]
 [374  92   2]
 [212  19   2]]
F-Measure : 0.3248954885851083

-=-=-=-=-=-=-=-=-=-=-=-=-=-=-=-- Train epoch 4 --=-=-=-=-=-=-=-=-=-=-=-=-=-


-=-=-=-=-=-=-=-=-=-=-=-=-=-=-=-- Test iteration 300 on DEV -- LR :0.0009869333333333331 C-LOSS : 1.6737194061279297 AVG-LOSS :1.4094864482499436

Confusion Matrix : 
[[394   4   8]
 [450   8  10]
 [217   4  12]]
F-Measure : 0.23018662575621746

-=-=-=-=-=-=-=-=-=-=-=-=-=-=-=-- Test iteration 301 on DEV -- LR :0.000973866666666667 C-LOSS : 1.0061378479003906 AVG-LOSS :1.4081508568580576

Confusion Matrix : 
[[367  35   4]
 [390  74   4]
 [213  17   3]]
F-Measure : 0.30615017454506466

-=-=-=-=-=-=-=-=-=-=-=-=-=-=-=-- Test iteration 302 on DEV -- LR :0.0009607999999999999 C-LOSS : 1.085602879524231 AVG-LOSS :1.4070863420813784

Confusion Matrix : 
[[379  26   1]
 [414  54   0]
 [224   9   0]]
F-Measure : 0.27733541912031523

-=-=-=-=-=-=-=-=-=-=-=-=-=-=-=-- Test iteration 303 on DEV -- LR :0.000947733333333333 C-LOSS : 1.0181145668029785 AVG-LOSS :1.4058068296626995

Confusion Matrix : 
[[399   5   2]
 [465   1   2]
 [231   1   1]]
F-Measure : 0.1985335237352209

-=-=-=-=-=-=-=-=-=-=-=-=-=-=-=-- Test iteration 304 on DEV -- LR :0.000934666666666667 C-LOSS : 0.9598722457885742 AVG-LOSS :1.4043447490598335

Confusion Matrix : 
[[405   1   0]
 [468   0   0]
 [232   0   1]]
F-Measure : 0.19840595971014457

-=-=-=-=-=-=-=-=-=-=-=-=-=-=-=-- Test iteration 305 on DEV -- LR :0.0009216 C-LOSS : 1.0236001014709473 AVG-LOSS :1.4031004855056215

Confusion Matrix : 
[[404   2   0]
 [468   0   0]
 [232   1   0]]
F-Measure : 0.19625142829794745

-=-=-=-=-=-=-=-=-=-=-=-=-=-=-=-- Test iteration 306 on DEV -- LR :0.0009085333333333329 C-LOSS : 1.0255721807479858 AVG-LOSS :1.4018707516139028

Confusion Matrix : 
[[396   9   1]
 [453  14   1]
 [229   3   1]]
F-Measure : 0.22148160554984553

-=-=-=-=-=-=-=-=-=-=-=-=-=-=-=-- Test iteration 307 on DEV -- LR :0.0008954666666666669 C-LOSS : 1.0095552206039429 AVG-LOSS :1.4005969998898444

Confusion Matrix : 
[[391  10   5]
 [438  26   4]
 [217  11   5]]
F-Measure : 0.24873167978000216

-=-=-=-=-=-=-=-=-=-=-=-=-=-=-=-- Test iteration 308 on DEV -- LR :0.0008823999999999999 C-LOSS : 1.016366958618164 AVG-LOSS :1.3993535369731076

Confusion Matrix : 
[[386  16   4]
 [426  38   4]
 [217  11   5]]
F-Measure : 0.26614522513788824

-=-=-=-=-=-=-=-=-=-=-=-=-=-=-=-- Test iteration 309 on DEV -- LR :0.000869333333333333 C-LOSS : 1.0149308443069458 AVG-LOSS :1.3981134637709587

Confusion Matrix : 
[[378  20   8]
 [409  52   7]
 [211  13   9]]
F-Measure : 0.2917334393038452

-=-=-=-=-=-=-=-=-=-=-=-=-=-=-=-- Test iteration 310 on DEV -- LR :0.0008562666666666668 C-LOSS : 1.016443133354187 AVG-LOSS :1.3968862279818373

Confusion Matrix : 
[[381  15  10]
 [416  43   9]
 [208  13  12]]
F-Measure : 0.284652842487378

-=-=-=-=-=-=-=-=-=-=-=-=-=-=-=-- Test iteration 311 on DEV -- LR :0.0008431999999999999 C-LOSS : 1.0236473083496094 AVG-LOSS :1.3956899493932724

Confusion Matrix : 
[[389  10   7]
 [442  15  11]
 [219   3  11]]
F-Measure : 0.23921738464443912

-=-=-=-=-=-=-=-=-=-=-=-=-=-=-=-- Test iteration 312 on DEV -- LR :0.0008301333333333339 C-LOSS : 1.0564402341842651 AVG-LOSS :1.3946060844884514

Confusion Matrix : 
[[390   7   9]
 [452   2  14]
 [220   1  12]]
F-Measure : 0.2172575072069643

-=-=-=-=-=-=-=-=-=-=-=-=-=-=-=-- Test iteration 313 on DEV -- LR :0.0008170666666666668 C-LOSS : 1.0274007320404053 AVG-LOSS :1.393436640690846

Confusion Matrix : 
[[376  12  18]
 [420  23  25]
 [204   7  22]]
F-Measure : 0.26536929463039094

-=-=-=-=-=-=-=-=-=-=-=-=-=-=-=-- Test iteration 314 on DEV -- LR :0.0008039999999999998 C-LOSS : 1.030875563621521 AVG-LOSS :1.3922856531445942

Confusion Matrix : 
[[316  35  55]
 [354  62  52]
 [168  22  43]]
F-Measure : 0.32289450196506614

-=-=-=-=-=-=-=-=-=-=-=-=-=-=-=-- Test iteration 315 on DEV -- LR :0.0007909333333333338 C-LOSS : 1.0225083827972412 AVG-LOSS :1.3911154719093177

Confusion Matrix : 
[[330  24  52]
 [376  33  59]
 [179  14  40]]
F-Measure : 0.28311456196872614

-=-=-=-=-=-=-=-=-=-=-=-=-=-=-=-- Test iteration 316 on DEV -- LR :0.0007778666666666669 C-LOSS : 1.0989444255828857 AVG-LOSS :1.3901937966843132

Confusion Matrix : 
[[391   6   9]
 [445   5  18]
 [215   3  15]]
F-Measure : 0.22857791832491928

-=-=-=-=-=-=-=-=-=-=-=-=-=-=-=-- Test iteration 317 on DEV -- LR :0.0007647999999999998 C-LOSS : 1.0528074502944946 AVG-LOSS :1.389132833330886

Confusion Matrix : 
[[387  11   8]
 [447   8  13]
 [216   5  12]]
F-Measure : 0.22770459951492544

-=-=-=-=-=-=-=-=-=-=-=-=-=-=-=-- Test iteration 318 on DEV -- LR :0.0007517333333333337 C-LOSS : 1.0417035818099976 AVG-LOSS :1.3880437134201624

Confusion Matrix : 
[[358  29  19]
 [393  53  22]
 [196  18  19]]
F-Measure : 0.3002794739308303

-=-=-=-=-=-=-=-=-=-=-=-=-=-=-=-- Test iteration 319 on DEV -- LR :0.0007386666666666668 C-LOSS : 1.0620225667953491 AVG-LOSS :1.3870248973369599

Confusion Matrix : 
[[317  33  56]
 [350  55  63]
 [170  21  42]]
F-Measure : 0.3125366711186131

-=-=-=-=-=-=-=-=-=-=-=-=-=-=-=-- Test iteration 320 on DEV -- LR :0.0007255999999999999 C-LOSS : 1.0631846189498901 AVG-LOSS :1.3860160491176854

Confusion Matrix : 
[[339  25  42]
 [379  41  48]
 [178  19  36]]
F-Measure : 0.29588543952344754

-=-=-=-=-=-=-=-=-=-=-=-=-=-=-=-- Test iteration 321 on DEV -- LR :0.0007125333333333337 C-LOSS : 1.0727287530899048 AVG-LOSS :1.3850431072045557

Confusion Matrix : 
[[371  27   8]
 [391  66  11]
 [205  17  11]]
F-Measure : 0.3123585317774428

-=-=-=-=-=-=-=-=-=-=-=-=-=-=-=-- Test iteration 322 on DEV -- LR :0.0006994666666666667 C-LOSS : 1.0858443975448608 AVG-LOSS :1.3841167954099436

Confusion Matrix : 
[[386  20   0]
 [423  43   2]
 [220  11   2]]
F-Measure : 0.2679406542273031

-=-=-=-=-=-=-=-=-=-=-=-=-=-=-=-- Test iteration 323 on DEV -- LR :0.0006863999999999998 C-LOSS : 1.0796582698822021 AVG-LOSS :1.3831771086027593

Confusion Matrix : 
[[399   7   0]
 [447  20   1]
 [230   2   1]]
F-Measure : 0.23330113759227103

-=-=-=-=-=-=-=-=-=-=-=-=-=-=-=-- Test iteration 324 on DEV -- LR :0.0006733333333333337 C-LOSS : 1.0039002895355225 AVG-LOSS :1.3820101030056293

Confusion Matrix : 
[[392  10   4]
 [448  14   6]
 [215  11   7]]
F-Measure : 0.2321290913257986

-=-=-=-=-=-=-=-=-=-=-=-=-=-=-=-- Test iteration 325 on DEV -- LR :0.0006602666666666667 C-LOSS : 1.0078215599060059 AVG-LOSS :1.3808622853887593

Confusion Matrix : 
[[381   8  17]
 [439  18  11]
 [211   8  14]]
F-Measure : 0.24622906706696

-=-=-=-=-=-=-=-=-=-=-=-=-=-=-=-- Test iteration 326 on DEV -- LR :0.0006471999999999997 C-LOSS : 1.0535045862197876 AVG-LOSS :1.3798611915075085

Confusion Matrix : 
[[363   6  37]
 [416  21  31]
 [195   7  31]]
F-Measure : 0.2676230632580424

-=-=-=-=-=-=-=-=-=-=-=-=-=-=-=-- Test iteration 327 on DEV -- LR :0.0006341333333333336 C-LOSS : 1.060032606124878 AVG-LOSS :1.3788861043569518

Confusion Matrix : 
[[373  16  17]
 [428  28  12]
 [209  11  13]]
F-Measure : 0.2583879582625542

-=-=-=-=-=-=-=-=-=-=-=-=-=-=-=-- Test iteration 328 on DEV -- LR :0.0006210666666666667 C-LOSS : 1.0680484771728516 AVG-LOSS :1.3779413091375472

Confusion Matrix : 
[[386  15   5]
 [435  24   9]
 [214  11   8]]
F-Measure : 0.24886762932841913

-=-=-=-=-=-=-=-=-=-=-=-=-=-=-=-- Test iteration 329 on DEV -- LR :0.0006079999999999997 C-LOSS : 1.0367990732192993 AVG-LOSS :1.3769075447862797

Confusion Matrix : 
[[378  16  12]
 [433  23  12]
 [212   9  12]]
F-Measure : 0.2504966550071781

-=-=-=-=-=-=-=-=-=-=-=-=-=-=-=-- Test iteration 330 on DEV -- LR :0.0005949333333333336 C-LOSS : 1.0540660619735718 AVG-LOSS :1.375932192874459

Confusion Matrix : 
[[353  14  39]
 [411  20  37]
 [189  10  34]]
F-Measure : 0.265286152168503

-=-=-=-=-=-=-=-=-=-=-=-=-=-=-=-- Test iteration 331 on DEV -- LR :0.0005818666666666666 C-LOSS : 0.9815431833267212 AVG-LOSS :1.3747442741710019

Confusion Matrix : 
[[328  19  59]
 [377  30  61]
 [172  10  51]]
F-Measure : 0.2887966844239641

-=-=-=-=-=-=-=-=-=-=-=-=-=-=-=-- Test iteration 332 on DEV -- LR :0.0005687999999999997 C-LOSS : 1.0398377180099487 AVG-LOSS :1.373738548777125

Confusion Matrix : 
[[308  16  82]
 [355  24  89]
 [160   5  68]]
F-Measure : 0.28402944148281284

-=-=-=-=-=-=-=-=-=-=-=-=-=-=-=-- Test iteration 333 on DEV -- LR :0.0005557333333333336 C-LOSS : 1.038283109664917 AVG-LOSS :1.3727341911749926

Confusion Matrix : 
[[365  17  24]
 [426  19  23]
 [200   7  26]]
F-Measure : 0.25885432395206126

-=-=-=-=-=-=-=-=-=-=-=-=-=-=-=-- Test iteration 334 on DEV -- LR :0.0005426666666666666 C-LOSS : 1.0367109775543213 AVG-LOSS :1.3717311368059757

Confusion Matrix : 
[[373  32   1]
 [403  62   3]
 [210  16   7]]
F-Measure : 0.2993257180446203

-=-=-=-=-=-=-=-=-=-=-=-=-=-=-=-- Test iteration 335 on DEV -- LR :0.0005295999999999996 C-LOSS : 1.188522219657898 AVG-LOSS :1.3711858721716064

Confusion Matrix : 
[[360  46   0]
 [369  99   0]
 [205  25   3]]
F-Measure : 0.3336173097156707

-=-=-=-=-=-=-=-=-=-=-=-=-=-=-=-- Test iteration 336 on DEV -- LR :0.0005165333333333336 C-LOSS : 1.0114141702651978 AVG-LOSS :1.3701183003558604

Confusion Matrix : 
[[381  23   2]
 [417  48   3]
 [214  12   7]]
F-Measure : 0.28277163495500934

-=-=-=-=-=-=-=-=-=-=-=-=-=-=-=-- Test iteration 337 on DEV -- LR :0.0005034666666666666 C-LOSS : 1.04291570186615 AVG-LOSS :1.369150245330743

Confusion Matrix : 
[[381  17   8]
 [424  28  16]
 [214   6  13]]
F-Measure : 0.2620029853282416

-=-=-=-=-=-=-=-=-=-=-=-=-=-=-=-- Test iteration 338 on DEV -- LR :0.0004904000000000004 C-LOSS : 1.049561619758606 AVG-LOSS :1.3682075060222705

Confusion Matrix : 
[[323  14  69]
 [373  19  76]
 [169   6  58]]
F-Measure : 0.27409376756333553

-=-=-=-=-=-=-=-=-=-=-=-=-=-=-=-- Test iteration 339 on DEV -- LR :0.0004773333333333335 C-LOSS : 1.0682941675186157 AVG-LOSS :1.3673254079678479

Confusion Matrix : 
[[282  17 107]
 [330  28 110]
 [138   8  87]]
F-Measure : 0.29257770067069894

-=-=-=-=-=-=-=-=-=-=-=-=-=-=-=-- Test iteration 340 on DEV -- LR :0.0004642666666666665 C-LOSS : 1.0249996185302734 AVG-LOSS :1.3663215200222831

Confusion Matrix : 
[[335  12  59]
 [374  20  74]
 [180   4  49]]
F-Measure : 0.27300686354462433

-=-=-=-=-=-=-=-=-=-=-=-=-=-=-=-- Test iteration 341 on DEV -- LR :0.00045120000000000045 C-LOSS : 1.017689824104309 AVG-LOSS :1.3653021290985465

Confusion Matrix : 
[[388   3  15]
 [419  10  39]
 [204   3  26]]
F-Measure : 0.2532865974783305

-=-=-=-=-=-=-=-=-=-=-=-=-=-=-=-- Test iteration 342 on DEV -- LR :0.00043813333333333343 C-LOSS : 1.0229830741882324 AVG-LOSS :1.3643041143611985

Confusion Matrix : 
[[398   1   7]
 [446   4  18]
 [217   2  14]]
F-Measure : 0.22779097069687962

-=-=-=-=-=-=-=-=-=-=-=-=-=-=-=-- Test iteration 343 on DEV -- LR :0.0004250666666666665 C-LOSS : 1.0213267803192139 AVG-LOSS :1.3633070872273556

Confusion Matrix : 
[[399   1   6]
 [451   3  14]
 [220   2  11]]
F-Measure : 0.2211786651673247

-=-=-=-=-=-=-=-=-=-=-=-=-=-=-=-- Test iteration 344 on DEV -- LR :0.00041200000000000037 C-LOSS : 1.00965416431427 AVG-LOSS :1.3622820062913756

Confusion Matrix : 
[[394   3   9]
 [443   7  18]
 [217   2  14]]
F-Measure : 0.23178770198860874

-=-=-=-=-=-=-=-=-=-=-=-=-=-=-=-- Test iteration 345 on DEV -- LR :0.00039893333333333345 C-LOSS : 0.9639617204666138 AVG-LOSS :1.3611307915924602

Confusion Matrix : 
[[379   6  21]
 [411  22  35]
 [204   4  25]]
F-Measure : 0.26929169903163996

-=-=-=-=-=-=-=-=-=-=-=-=-=-=-=-- Test iteration 346 on DEV -- LR :0.00038586666666666643 C-LOSS : 1.073398232460022 AVG-LOSS :1.3603015911338652

Confusion Matrix : 
[[322  28  56]
 [370  40  58]
 [179   9  45]]
F-Measure : 0.2953394537183669

-=-=-=-=-=-=-=-=-=-=-=-=-=-=-=-- Test iteration 347 on DEV -- LR :0.0003728000000000004 C-LOSS : 1.0504740476608276 AVG-LOSS :1.3594112821008968

Confusion Matrix : 
[[295  34  77]
 [343  56  69]
 [158  23  52]]
F-Measure : 0.31230725481414134

-=-=-=-=-=-=-=-=-=-=-=-=-=-=-=-- Test iteration 348 on DEV -- LR :0.00035973333333333337 C-LOSS : 1.0304957628250122 AVG-LOSS :1.3584688307562667

Confusion Matrix : 
[[321  34  51]
 [363  57  48]
 [172  18  43]]
F-Measure : 0.3183721457351396

-=-=-=-=-=-=-=-=-=-=-=-=-=-=-=-- Test iteration 349 on DEV -- LR :0.00034666666666666646 C-LOSS : 0.9814682006835938 AVG-LOSS :1.3573916860989161

Confusion Matrix : 
[[343  28  35]
 [391  44  33]
 [192  11  30]]
F-Measure : 0.2945581276208833

-=-=-=-=-=-=-=-=-=-=-=-=-=-=-=-- Test iteration 350 on DEV -- LR :0.0003336000000000003 C-LOSS : 0.9859392642974854 AVG-LOSS :1.356333417090935

Confusion Matrix : 
[[372  13  21]
 [419  28  21]
 [208   6  19]]
F-Measure : 0.26738675471125406

-=-=-=-=-=-=-=-=-=-=-=-=-=-=-=-- Test iteration 351 on DEV -- LR :0.0003205333333333334 C-LOSS : 1.0152077674865723 AVG-LOSS :1.3553643101318316

Confusion Matrix : 
[[389   3  14]
 [443  13  12]
 [213   3  17]]
F-Measure : 0.24514760062323018

-=-=-=-=-=-=-=-=-=-=-=-=-=-=-=-- Test iteration 352 on DEV -- LR :0.00030746666666666637 C-LOSS : 1.0647871494293213 AVG-LOSS :1.3545411453706346

Confusion Matrix : 
[[392   2  12]
 [449   7  12]
 [215   3  15]]
F-Measure : 0.2322192625711027

-=-=-=-=-=-=-=-=-=-=-=-=-=-=-=-- Test iteration 353 on DEV -- LR :0.0002944000000000003 C-LOSS : 0.9828107953071594 AVG-LOSS :1.3534910596359921

Confusion Matrix : 
[[385   2  19]
 [446  10  12]
 [212   4  17]]
F-Measure : 0.2378318031293978

-=-=-=-=-=-=-=-=-=-=-=-=-=-=-=-- Test iteration 354 on DEV -- LR :0.0002813333333333333 C-LOSS : 1.012095332145691 AVG-LOSS :1.3525293815303856

Confusion Matrix : 
[[364   7  35]
 [420  24  24]
 [197   7  29]]
F-Measure : 0.2706356998406589

-=-=-=-=-=-=-=-=-=-=-=-=-=-=-=-- Test iteration 355 on DEV -- LR :0.0002682666666666664 C-LOSS : 0.9877689480781555 AVG-LOSS :1.3515047735712502

Confusion Matrix : 
[[342  13  51]
 [399  36  33]
 [193   9  31]]
F-Measure : 0.282578249141419

-=-=-=-=-=-=-=-=-=-=-=-=-=-=-=-- Test iteration 356 on DEV -- LR :0.00025520000000000024 C-LOSS : 1.052695870399475 AVG-LOSS :1.3506677738424777

Confusion Matrix : 
[[339  21  46]
 [390  49  29]
 [190  16  27]]
F-Measure : 0.2963817945145405

-=-=-=-=-=-=-=-=-=-=-=-=-=-=-=-- Test iteration 357 on DEV -- LR :0.00024213333333333333 C-LOSS : 0.9363912343978882 AVG-LOSS :1.349510576804923

Confusion Matrix : 
[[348  27  31]
 [393  55  20]
 [187  21  25]]
F-Measure : 0.3068527285838755

-=-=-=-=-=-=-=-=-=-=-=-=-=-=-=-- Test iteration 358 on DEV -- LR :0.0002290666666666663 C-LOSS : 0.9885618090629578 AVG-LOSS :1.348505148482522

Confusion Matrix : 
[[359  22  25]
 [393  57  18]
 [192  21  20]]
F-Measure : 0.30835403414916623

-=-=-=-=-=-=-=-=-=-=-=-=-=-=-=-- Test iteration 359 on DEV -- LR :0.00021600000000000026 C-LOSS : 1.0367952585220337 AVG-LOSS :1.3476392876770762

Confusion Matrix : 
[[369  23  14]
 [405  53  10]
 [199  20  14]]
F-Measure : 0.29748006807929256

-=-=-=-=-=-=-=-=-=-=-=-=-=-=-=-- Test iteration 360 on DEV -- LR :0.00020293333333333324 C-LOSS : 0.9714474081993103 AVG-LOSS :1.3465972049084396

Confusion Matrix : 
[[379  17  10]
 [412  47   9]
 [208  16   9]]
F-Measure : 0.2848997833784498

-=-=-=-=-=-=-=-=-=-=-=-=-=-=-=-- Test iteration 361 on DEV -- LR :0.00018986666666666633 C-LOSS : 0.9832607507705688 AVG-LOSS :1.3455935130461802

Confusion Matrix : 
[[378  12  16]
 [420  36  12]
 [208  12  13]]
F-Measure : 0.27398775194897956

-=-=-=-=-=-=-=-=-=-=-=-=-=-=-=-- Test iteration 362 on DEV -- LR :0.00017680000000000018 C-LOSS : 0.9444226026535034 AVG-LOSS :1.34448835902306

Confusion Matrix : 
[[377   7  22]
 [429  23  16]
 [209  10  14]]
F-Measure : 0.253566171865088

-=-=-=-=-=-=-=-=-=-=-=-=-=-=-=-- Test iteration 363 on DEV -- LR :0.00016373333333333327 C-LOSS : 1.0100667476654053 AVG-LOSS :1.343569618332517

Confusion Matrix : 
[[379   4  23]
 [435  18  15]
 [211   6  16]]
F-Measure : 0.2484235206953595

-=-=-=-=-=-=-=-=-=-=-=-=-=-=-=-- Test iteration 364 on DEV -- LR :0.0001506666666666671 C-LOSS : 0.9312057495117188 AVG-LOSS :1.3424398543083504

Confusion Matrix : 
[[380   3  23]
 [435  16  17]
 [209   5  19]]
F-Measure : 0.2498077380078472

-=-=-=-=-=-=-=-=-=-=-=-=-=-=-=-- Test iteration 365 on DEV -- LR :0.0001376000000000002 C-LOSS : 1.0112582445144653 AVG-LOSS :1.3415349865220283

Confusion Matrix : 
[[373   2  31]
 [431  14  23]
 [206   4  23]]
F-Measure : 0.2487101470557988

-=-=-=-=-=-=-=-=-=-=-=-=-=-=-=-- Test iteration 366 on DEV -- LR :0.00012453333333333318 C-LOSS : 1.0137766599655151 AVG-LOSS :1.3406419120627464

Confusion Matrix : 
[[371   2  33]
 [428  14  26]
 [205   3  25]]
F-Measure : 0.25050793756882317

-=-=-=-=-=-=-=-=-=-=-=-=-=-=-=-- Test iteration 367 on DEV -- LR :0.00011146666666666714 C-LOSS : 1.0243759155273438 AVG-LOSS :1.3397824935939

Confusion Matrix : 
[[370   2  34]
 [422  20  26]
 [206   4  23]]
F-Measure : 0.2581762080846401

-=-=-=-=-=-=-=-=-=-=-=-=-=-=-=-- Test iteration 368 on DEV -- LR :9.840000000000011e-05 C-LOSS : 1.0010910034179688 AVG-LOSS :1.338864630476892

Confusion Matrix : 
[[371   4  31]
 [421  23  24]
 [204   6  23]]
F-Measure : 0.2640525030755946

-=-=-=-=-=-=-=-=-=-=-=-=-=-=-=-- Test iteration 369 on DEV -- LR :8.53333333333332e-05 C-LOSS : 0.9411292672157288 AVG-LOSS :1.3377896700356458

Confusion Matrix : 
[[376   7  23]
 [425  25  18]
 [205   9  19]]
F-Measure : 0.2641531653276626

-=-=-=-=-=-=-=-=-=-=-=-=-=-=-=-- Test iteration 370 on DEV -- LR :7.226666666666705e-05 C-LOSS : 0.9109588861465454 AVG-LOSS :1.336639182747535

Confusion Matrix : 
[[379   9  18]
 [422  30  16]
 [208  11  14]]
F-Measure : 0.2664095110290919

-=-=-=-=-=-=-=-=-=-=-=-=-=-=-=-- Test iteration 371 on DEV -- LR :5.920000000000014e-05 C-LOSS : 0.9640628695487976 AVG-LOSS :1.335637633518506

Confusion Matrix : 
[[375  14  17]
 [417  38  13]
 [206  15  12]]
F-Measure : 0.27434248448558407

-=-=-=-=-=-=-=-=-=-=-=-=-=-=-=-- Test iteration 372 on DEV -- LR :4.613333333333312e-05 C-LOSS : 0.9970203042030334 AVG-LOSS :1.3347298122602878

Confusion Matrix : 
[[374  15  17]
 [413  41  14]
 [205  16  12]]
F-Measure : 0.2787333922975355

-=-=-=-=-=-=-=-=-=-=-=-=-=-=-=-- Test iteration 373 on DEV -- LR :3.306666666666707e-05 C-LOSS : 1.019228458404541 AVG-LOSS :1.333886225752652

Confusion Matrix : 
[[369  20  17]
 [411  43  14]
 [204  17  12]]
F-Measure : 0.27937293339646413

-=-=-=-=-=-=-=-=-=-=-=-=-=-=-=-- Test iteration 374 on DEV -- LR :2.0000000000000052e-05 C-LOSS : 1.0006804466247559 AVG-LOSS :1.332997677008311

Confusion Matrix : 
[[370  19  17]
 [410  43  15]
 [204  17  12]]
F-Measure : 0.27995585835946557

-=-=-=-=-=-=-=-=-=-=-=-=-=-=-=-- Test Best Model pid-33887 on TEST --=-=-=-=-=-=-=-=-=-=-=-=-=-

> Best Model on DEV pid-33887 loaded
Confusion Matrix : 
[[331 500   1]
 [375 880   1]
 [228 292   1]]
F-Measure : 0.40967552584112615
