SpeechBrain system description
==============================
Python version:
3.8.0 (default, Nov  6 2019, 21:49:08) 
[GCC 7.3.0]
==============================
Installed Python packages:
absl-py==0.13.0
appdirs==1.4.4
astunparse==1.6.3
attrs==21.2.0
backports.entry-points-selectable==1.1.0
black==19.10b0
cachetools==4.2.2
certifi==2021.5.30
cfgv==3.3.1
charset-normalizer==2.0.4
clang==5.0
click==8.0.3
cycler==0.10.0
distlib==0.3.2
entrypoints==0.3
filelock==3.0.12
flake8==3.7.9
flatbuffers==1.12
gast==0.4.0
google-auth==1.35.0
google-auth-oauthlib==0.4.6
google-pasta==0.2.0
grpcio==1.39.0
h5py==3.1.0
huggingface-hub==0.0.16
HyperPyYAML==1.0.0
identify==2.2.13
idna==3.2
joblib==1.0.1
keras==2.6.0
Keras-Preprocessing==1.1.2
kiwisolver==1.3.2
Markdown==3.3.4
matplotlib==3.4.3
mccabe==0.6.1
more-itertools==8.8.0
nodeenv==1.6.0
numpy==1.19.5
oauthlib==3.1.1
opt-einsum==3.3.0
packaging==21.0
pandas==1.3.2
pathspec==0.9.0
Pillow==8.3.1
platformdirs==2.3.0
pluggy==0.13.1
pre-commit==2.14.1
protobuf==3.17.3
py==1.10.0
pyasn1==0.4.8
pyasn1-modules==0.2.8
pybind11==2.8.1
pycodestyle==2.5.0
pyflakes==2.1.1
pyparsing==2.4.7
pytest==5.4.1
python-dateutil==2.8.2
pytz==2021.1
PyYAML==5.4.1
regex==2021.8.28
requests==2.26.0
requests-oauthlib==1.3.0
rsa==4.7.2
ruamel.yaml==0.17.16
ruamel.yaml.clib==0.2.6
scikit-learn==0.24.2
scipy==1.7.1
sentencepiece==0.1.96
six==1.15.0
sklearn==0.0
-e git+https://github.com/speechbrain/speechbrain@2e78d2cc9aca596a68ee54308534b572e702b13a#egg=speechbrain
tensorboard==2.6.0
tensorboard-data-server==0.6.1
tensorboard-plugin-wit==1.8.0
tensorflow==2.6.0
tensorflow-estimator==2.6.0
termcolor==1.1.0
threadpoolctl==2.2.0
toml==0.10.2
torch==1.8.1
torchaudio==0.8.1
tqdm==4.62.2
typed-ast==1.4.3
typing-extensions==3.7.4.3
urllib3==1.26.6
virtualenv==20.7.2
wcwidth==0.2.5
Werkzeug==2.0.1
wrapt==1.12.1
yamllint==1.23.0
==============================
Git revision:
2e78d2cc
==============================
Cuda version:
10.2