train_test.py
Namespace(acoustic_model='/data/coros1/qraymondaud/acoustic_models/finalf10.raw', architecture='tdnn', batch_size=128, data='/data/coros1/qraymondaud/MELD/meld-mfcc-hires', feature_size=1536, kaldi_pybind_path='/users/qraymondaud/kaldi/src/pybind', load_egs='exp/pytorch_egs/', load_model='', lr=0.001, max_seq_len=600, mode='train-test', model_dir='exp/pytorch_resnet_block256_ecapatdnn_good/tdnn_sentiment/finalf10', multi_gpu=True, num_epochs=5, num_iterations=75, output_size=3, rollback_threshold=7, task='sentiment', use_cuda=True, weight_decay=0.001)
SGD

-=-=-=-=-=-=-=-=-=-=-=-=-=-=-=-- Train epoch 0 --=-=-=-=-=-=-=-=-=-=-=-=-=-


-=-=-=-=-=-=-=-=-=-=-=-=-=-=-=-- Test iteration 0 on DEV -- LR :0.0009869333333333335 C-LOSS : 1.1270427703857422 AVG-LOSS :1.1270427703857422

Confusion Matrix : 
[[  1   0 404]
 [  0   0 469]
 [  0   0 233]]
F-Measure : 0.07505324858571039
> Save best model exp/pytorch_resnet_block256_ecapatdnn_good/tdnn_sentiment/finalf10/finalf10_tdnn_sentiment_pid-2815.mat

-=-=-=-=-=-=-=-=-=-=-=-=-=-=-=-- Test iteration 1 on DEV -- LR :0.0009738666666666665 C-LOSS : 39.915870666503906 AVG-LOSS :20.521456718444824

Confusion Matrix : 
[[  0 406   0]
 [  0 469   0]
 [  0 232   0]]
F-Measure : 0.25215747504344754
> Save best model exp/pytorch_resnet_block256_ecapatdnn_good/tdnn_sentiment/finalf10/finalf10_tdnn_sentiment_pid-2815.mat

-=-=-=-=-=-=-=-=-=-=-=-=-=-=-=-- Test iteration 2 on DEV -- LR :0.0009607999999999999 C-LOSS : 33.7371711730957 AVG-LOSS :24.926694869995117

Confusion Matrix : 
[[406   0   0]
 [469   0   0]
 [232   0   0]]
F-Measure : 0.19683191324092134

-=-=-=-=-=-=-=-=-=-=-=-=-=-=-=-- Test iteration 3 on DEV -- LR :0.0009477333333333335 C-LOSS : 14.865666389465332 AVG-LOSS :22.41143774986267

Confusion Matrix : 
[[  0   0 406]
 [  0   0 469]
 [  0   0 232]]
F-Measure : 0.07262359902663006

-=-=-=-=-=-=-=-=-=-=-=-=-=-=-=-- Test iteration 4 on DEV -- LR :0.0009346666666666665 C-LOSS : 5.629825115203857 AVG-LOSS :19.055115222930908

Confusion Matrix : 
[[  0   0 406]
 [  0   0 469]
 [  0   0 232]]
F-Measure : 0.07262359902663006

-=-=-=-=-=-=-=-=-=-=-=-=-=-=-=-- Test iteration 5 on DEV -- LR :0.0009216 C-LOSS : 2.6412646770477295 AVG-LOSS :16.31947346528371

Confusion Matrix : 
[[406   0   0]
 [469   0   0]
 [232   0   0]]
F-Measure : 0.19683191324092134

-=-=-=-=-=-=-=-=-=-=-=-=-=-=-=-- Test iteration 6 on DEV -- LR :0.0009085333333333334 C-LOSS : 4.978279113769531 AVG-LOSS :14.69930284363883

Confusion Matrix : 
[[  0 406   0]
 [  0 469   0]
 [  0 232   0]]
F-Measure : 0.25215747504344754

-=-=-=-=-=-=-=-=-=-=-=-=-=-=-=-- Test iteration 7 on DEV -- LR :0.0008954666666666669 C-LOSS : 3.3751182556152344 AVG-LOSS :13.28377977013588

Confusion Matrix : 
[[  0 406   0]
 [  0 469   0]
 [  0 232   0]]
F-Measure : 0.25215747504344754

-=-=-=-=-=-=-=-=-=-=-=-=-=-=-=-- Test iteration 8 on DEV -- LR :0.0008823999999999999 C-LOSS : 1.1404516696929932 AVG-LOSS :11.934521092308891

Confusion Matrix : 
[[ 21 385   0]
 [ 27 442   0]
 [  9 223   0]]
F-Measure : 0.2798278823992833
> Save best model exp/pytorch_resnet_block256_ecapatdnn_good/tdnn_sentiment/finalf10/finalf10_tdnn_sentiment_pid-2815.mat

-=-=-=-=-=-=-=-=-=-=-=-=-=-=-=-- Test iteration 9 on DEV -- LR :0.0008693333333333334 C-LOSS : 2.0987865924835205 AVG-LOSS :10.950947642326355

Confusion Matrix : 
[[248   0 158]
 [287   0 182]
 [110   0 122]]
F-Measure : 0.2467677595591667

-=-=-=-=-=-=-=-=-=-=-=-=-=-=-=-- Test iteration 10 on DEV -- LR :0.0008562666666666668 C-LOSS : 2.1245105266571045 AVG-LOSS :10.148544268174605

Confusion Matrix : 
[[406   0   0]
 [469   0   0]
 [232   0   0]]
F-Measure : 0.19683191324092134

-=-=-=-=-=-=-=-=-=-=-=-=-=-=-=-- Test iteration 11 on DEV -- LR :0.0008431999999999999 C-LOSS : 1.826749563217163 AVG-LOSS :9.455061376094818

Confusion Matrix : 
[[406   0   0]
 [469   0   0]
 [232   0   0]]
F-Measure : 0.19683191324092134

-=-=-=-=-=-=-=-=-=-=-=-=-=-=-=-- Test iteration 12 on DEV -- LR :0.0008301333333333334 C-LOSS : 1.188408374786377 AVG-LOSS :8.819164991378784

Confusion Matrix : 
[[406   0   0]
 [469   0   0]
 [232   0   0]]
F-Measure : 0.19683191324092134

-=-=-=-=-=-=-=-=-=-=-=-=-=-=-=-- Test iteration 13 on DEV -- LR :0.0008170666666666668 C-LOSS : 1.0912740230560303 AVG-LOSS :8.26717277935573

Confusion Matrix : 
[[393   8   5]
 [457   8   4]
 [231   1   0]]
F-Measure : 0.20780869890592002

-=-=-=-=-=-=-=-=-=-=-=-=-=-=-=-- Test iteration 14 on DEV -- LR :0.0008039999999999998 C-LOSS : 1.2898386716842651 AVG-LOSS :7.802017172177632

Confusion Matrix : 
[[  2 404   0]
 [  2 467   0]
 [  1 231   0]]
F-Measure : 0.2554507036188525

-=-=-=-=-=-=-=-=-=-=-=-=-=-=-=-- Test iteration 15 on DEV -- LR :0.0007909333333333333 C-LOSS : 1.285361647605896 AVG-LOSS :7.394726201891899

Confusion Matrix : 
[[  1 405   0]
 [  0 469   0]
 [  0 232   0]]
F-Measure : 0.25411982073228684

-=-=-=-=-=-=-=-=-=-=-=-=-=-=-=-- Test iteration 16 on DEV -- LR :0.0007778666666666669 C-LOSS : 1.1780626773834229 AVG-LOSS :7.02904011221493

Confusion Matrix : 
[[  4 402   0]
 [  3 466   0]
 [  1 231   0]]
F-Measure : 0.25890990765210153

-=-=-=-=-=-=-=-=-=-=-=-=-=-=-=-- Test iteration 17 on DEV -- LR :0.0007647999999999998 C-LOSS : 1.1647813320159912 AVG-LOSS :6.703247957759434

Confusion Matrix : 
[[119 286   1]
 [103 366   0]
 [ 51 181   0]]
F-Measure : 0.36674498437701364
> Save best model exp/pytorch_resnet_block256_ecapatdnn_good/tdnn_sentiment/finalf10/finalf10_tdnn_sentiment_pid-2815.mat

-=-=-=-=-=-=-=-=-=-=-=-=-=-=-=-- Test iteration 18 on DEV -- LR :0.0007517333333333332 C-LOSS : 1.0973021984100342 AVG-LOSS :6.40819818095157

Confusion Matrix : 
[[379   2  25]
 [441   0  28]
 [217   0  15]]
F-Measure : 0.21361298759672742

-=-=-=-=-=-=-=-=-=-=-=-=-=-=-=-- Test iteration 19 on DEV -- LR :0.0007386666666666668 C-LOSS : 1.1049978733062744 AVG-LOSS :6.143038165569306

Confusion Matrix : 
[[406   0   0]
 [469   0   0]
 [232   0   0]]
F-Measure : 0.19683191324092134

-=-=-=-=-=-=-=-=-=-=-=-=-=-=-=-- Test iteration 20 on DEV -- LR :0.0007255999999999999 C-LOSS : 1.1155177354812622 AVG-LOSS :5.903632430803208

Confusion Matrix : 
[[406   0   0]
 [469   0   0]
 [232   0   0]]
F-Measure : 0.19683191324092134

-=-=-=-=-=-=-=-=-=-=-=-=-=-=-=-- Test iteration 21 on DEV -- LR :0.0007125333333333333 C-LOSS : 1.1102197170257568 AVG-LOSS :5.685750034722415

Confusion Matrix : 
[[406   0   0]
 [469   0   0]
 [232   0   0]]
F-Measure : 0.19683191324092134

-=-=-=-=-=-=-=-=-=-=-=-=-=-=-=-- Test iteration 22 on DEV -- LR :0.0006994666666666667 C-LOSS : 1.173669695854187 AVG-LOSS :5.489572628684666

Confusion Matrix : 
[[406   0   0]
 [467   0   2]
 [232   0   0]]
F-Measure : 0.19709244522403307

-=-=-=-=-=-=-=-=-=-=-=-=-=-=-=-- Test iteration 23 on DEV -- LR :0.0006864000000000002 C-LOSS : 1.1104094982147217 AVG-LOSS :5.307107498248418

Confusion Matrix : 
[[400   0   6]
 [460   0   9]
 [229   0   3]]
F-Measure : 0.20128773720290158

-=-=-=-=-=-=-=-=-=-=-=-=-=-=-=-- Test iteration 24 on DEV -- LR :0.0006733333333333333 C-LOSS : 1.0990709066390991 AVG-LOSS :5.1387860345840455

Confusion Matrix : 
[[358   0  48]
 [407   0  62]
 [204   0  28]]
F-Measure : 0.2226998972364826

-=-=-=-=-=-=-=-=-=-=-=-=-=-=-=-- Test iteration 25 on DEV -- LR :0.0006602666666666667 C-LOSS : 1.1079756021499634 AVG-LOSS :4.983754864105811

Confusion Matrix : 
[[364   0  42]
 [411   0  58]
 [189   0  43]]
F-Measure : 0.24295248331234331

-=-=-=-=-=-=-=-=-=-=-=-=-=-=-=-- Test iteration 26 on DEV -- LR :0.0006472000000000001 C-LOSS : 1.0813403129577637 AVG-LOSS :4.839220991841069

Confusion Matrix : 
[[403   0   3]
 [464   0   5]
 [229   0   3]]
F-Measure : 0.20198305263726418

-=-=-=-=-=-=-=-=-=-=-=-=-=-=-=-- Test iteration 27 on DEV -- LR :0.0006341333333333332 C-LOSS : 1.0907779932022095 AVG-LOSS :4.705348027603967

Confusion Matrix : 
[[406   0   0]
 [469   0   0]
 [232   0   0]]
F-Measure : 0.19683191324092134

-=-=-=-=-=-=-=-=-=-=-=-=-=-=-=-- Test iteration 28 on DEV -- LR :0.0006210666666666667 C-LOSS : 1.0954840183258057 AVG-LOSS :4.580869958318513

Confusion Matrix : 
[[406   0   0]
 [469   0   0]
 [232   0   0]]
F-Measure : 0.19683191324092134

-=-=-=-=-=-=-=-=-=-=-=-=-=-=-=-- Test iteration 29 on DEV -- LR :0.0006080000000000001 C-LOSS : 1.0905094146728516 AVG-LOSS :4.464524606863658

Confusion Matrix : 
[[406   0   0]
 [469   0   0]
 [232   0   0]]
F-Measure : 0.19683191324092134

-=-=-=-=-=-=-=-=-=-=-=-=-=-=-=-- Test iteration 30 on DEV -- LR :0.0005949333333333336 C-LOSS : 1.0995278358459473 AVG-LOSS :4.355976323927602

Confusion Matrix : 
[[406   0   0]
 [469   0   0]
 [232   0   0]]
F-Measure : 0.19683191324092134

-=-=-=-=-=-=-=-=-=-=-=-=-=-=-=-- Test iteration 31 on DEV -- LR :0.0005818666666666666 C-LOSS : 1.103416085243225 AVG-LOSS :4.254333816468716

Confusion Matrix : 
[[406   0   0]
 [469   0   0]
 [232   0   0]]
F-Measure : 0.19683191324092134

-=-=-=-=-=-=-=-=-=-=-=-=-=-=-=-- Test iteration 32 on DEV -- LR :0.0005688000000000002 C-LOSS : 1.0755454301834106 AVG-LOSS :4.158006895672191

Confusion Matrix : 
[[406   0   0]
 [469   0   0]
 [232   0   0]]
F-Measure : 0.19683191324092134

-=-=-=-=-=-=-=-=-=-=-=-=-=-=-=-- Test iteration 33 on DEV -- LR :0.0005557333333333336 C-LOSS : 1.0836677551269531 AVG-LOSS :4.06758515624439

Confusion Matrix : 
[[406   0   0]
 [469   0   0]
 [232   0   0]]
F-Measure : 0.19683191324092134

-=-=-=-=-=-=-=-=-=-=-=-=-=-=-=-- Test iteration 34 on DEV -- LR :0.0005426666666666666 C-LOSS : 1.1064786911010742 AVG-LOSS :3.9829821143831525

Confusion Matrix : 
[[406   0   0]
 [469   0   0]
 [232   0   0]]
F-Measure : 0.19683191324092134

-=-=-=-=-=-=-=-=-=-=-=-=-=-=-=-- Test iteration 35 on DEV -- LR :0.0005296000000000001 C-LOSS : 1.0828864574432373 AVG-LOSS :3.9024239016903772

Confusion Matrix : 
[[406   0   0]
 [469   0   0]
 [232   0   0]]
F-Measure : 0.19683191324092134

-=-=-=-=-=-=-=-=-=-=-=-=-=-=-=-- Test iteration 36 on DEV -- LR :0.0005165333333333336 C-LOSS : 1.0792951583862305 AVG-LOSS :3.8261231248443193

Confusion Matrix : 
[[406   0   0]
 [469   0   0]
 [232   0   0]]
F-Measure : 0.19683191324092134

-=-=-=-=-=-=-=-=-=-=-=-=-=-=-=-- Test iteration 37 on DEV -- LR :0.0005034666666666666 C-LOSS : 1.1049383878707886 AVG-LOSS :3.7545130001871208

Confusion Matrix : 
[[406   0   0]
 [469   0   0]
 [232   0   0]]
F-Measure : 0.19683191324092134

-=-=-=-=-=-=-=-=-=-=-=-=-=-=-=-- Test iteration 38 on DEV -- LR :0.0004904 C-LOSS : 1.0936613082885742 AVG-LOSS :3.6862860337281838

Confusion Matrix : 
[[406   0   0]
 [469   0   0]
 [232   0   0]]
F-Measure : 0.19683191324092134

-=-=-=-=-=-=-=-=-=-=-=-=-=-=-=-- Test iteration 39 on DEV -- LR :0.0004773333333333335 C-LOSS : 1.076595425605774 AVG-LOSS :3.6210437685251238

Confusion Matrix : 
[[406   0   0]
 [469   0   0]
 [232   0   0]]
F-Measure : 0.19683191324092134

-=-=-=-=-=-=-=-=-=-=-=-=-=-=-=-- Test iteration 40 on DEV -- LR :0.0004642666666666665 C-LOSS : 1.0865763425827026 AVG-LOSS :3.559227489843601

Confusion Matrix : 
[[406   0   0]
 [469   0   0]
 [232   0   0]]
F-Measure : 0.19683191324092134

-=-=-=-=-=-=-=-=-=-=-=-=-=-=-=-- Test iteration 41 on DEV -- LR :0.0004512 C-LOSS : 1.071204423904419 AVG-LOSS :3.499988845416478

Confusion Matrix : 
[[406   0   0]
 [469   0   0]
 [232   0   0]]
F-Measure : 0.19683191324092134

-=-=-=-=-=-=-=-=-=-=-=-=-=-=-=-- Test iteration 42 on DEV -- LR :0.00043813333333333343 C-LOSS : 1.0895754098892212 AVG-LOSS :3.4439327190088673

Confusion Matrix : 
[[406   0   0]
 [469   0   0]
 [232   0   0]]
F-Measure : 0.19683191324092134

-=-=-=-=-=-=-=-=-=-=-=-=-=-=-=-- Test iteration 43 on DEV -- LR :0.0004250666666666665 C-LOSS : 1.0905026197433472 AVG-LOSS :3.3904456712982873

Confusion Matrix : 
[[406   0   0]
 [469   0   0]
 [232   0   0]]
F-Measure : 0.19683191324092134

-=-=-=-=-=-=-=-=-=-=-=-=-=-=-=-- Test iteration 44 on DEV -- LR :0.00041199999999999993 C-LOSS : 1.0719517469406128 AVG-LOSS :3.3389235840903386

Confusion Matrix : 
[[406   0   0]
 [469   0   0]
 [232   0   0]]
F-Measure : 0.19683191324092134

-=-=-=-=-=-=-=-=-=-=-=-=-=-=-=-- Test iteration 45 on DEV -- LR :0.00039893333333333345 C-LOSS : 1.075270175933838 AVG-LOSS :3.2897137273912844

Confusion Matrix : 
[[406   0   0]
 [469   0   0]
 [232   0   0]]
F-Measure : 0.19683191324092134

-=-=-=-=-=-=-=-=-=-=-=-=-=-=-=-- Test iteration 46 on DEV -- LR :0.00038586666666666643 C-LOSS : 1.0783965587615967 AVG-LOSS :3.2426644259310784

Confusion Matrix : 
[[406   0   0]
 [469   0   0]
 [232   0   0]]
F-Measure : 0.19683191324092134

-=-=-=-=-=-=-=-=-=-=-=-=-=-=-=-- Test iteration 47 on DEV -- LR :0.00037279999999999995 C-LOSS : 1.0693466663360596 AVG-LOSS :3.197386972606182

Confusion Matrix : 
[[401   0   5]
 [465   0   4]
 [226   0   6]]
F-Measure : 0.2065363514381546

-=-=-=-=-=-=-=-=-=-=-=-=-=-=-=-- Test iteration 48 on DEV -- LR :0.00035973333333333337 C-LOSS : 1.1129231452941895 AVG-LOSS :3.154846894497774

Confusion Matrix : 
[[389   0  17]
 [460   0   9]
 [218   0  14]]
F-Measure : 0.2152853782308306

-=-=-=-=-=-=-=-=-=-=-=-=-=-=-=-- Test iteration 49 on DEV -- LR :0.0003466666666666669 C-LOSS : 1.1251423358917236 AVG-LOSS :3.114252803325653

Confusion Matrix : 
[[382   0  24]
 [451   0  18]
 [208   0  24]]
F-Measure : 0.22740075720740383

-=-=-=-=-=-=-=-=-=-=-=-=-=-=-=-- Test iteration 50 on DEV -- LR :0.00033359999999999987 C-LOSS : 1.105169415473938 AVG-LOSS :3.074859011406992

Confusion Matrix : 
[[380   0  26]
 [450   0  19]
 [207   0  25]]
F-Measure : 0.22786168912265933

-=-=-=-=-=-=-=-=-=-=-=-=-=-=-=-- Test iteration 51 on DEV -- LR :0.0003205333333333334 C-LOSS : 1.0809656381607056 AVG-LOSS :3.0365149080753326

Confusion Matrix : 
[[380   0  26]
 [450   0  19]
 [206   0  26]]
F-Measure : 0.22926446616298435

-=-=-=-=-=-=-=-=-=-=-=-=-=-=-=-- Test iteration 52 on DEV -- LR :0.0003074666666666668 C-LOSS : 1.0650088787078857 AVG-LOSS :2.9993166811061354

Confusion Matrix : 
[[379   0  27]
 [449   0  20]
 [206   0  26]]
F-Measure : 0.22878770302578558

-=-=-=-=-=-=-=-=-=-=-=-=-=-=-=-- Test iteration 53 on DEV -- LR :0.0002944000000000003 C-LOSS : 1.099856972694397 AVG-LOSS :2.964141501320733

Confusion Matrix : 
[[378   0  28]
 [447   0  22]
 [203   0  29]]
F-Measure : 0.2324378699486206

-=-=-=-=-=-=-=-=-=-=-=-=-=-=-=-- Test iteration 54 on DEV -- LR :0.0002813333333333333 C-LOSS : 1.0717319250106812 AVG-LOSS :2.929734054478732

Confusion Matrix : 
[[380   0  26]
 [452   0  17]
 [208   0  24]]
F-Measure : 0.22640723172999289

-=-=-=-=-=-=-=-=-=-=-=-=-=-=-=-- Test iteration 55 on DEV -- LR :0.0002682666666666668 C-LOSS : 1.0886292457580566 AVG-LOSS :2.896857182894434

Confusion Matrix : 
[[386   0  20]
 [456   0  13]
 [212   0  20]]
F-Measure : 0.22334313962381794

-=-=-=-=-=-=-=-=-=-=-=-=-=-=-=-- Test iteration 56 on DEV -- LR :0.00025520000000000024 C-LOSS : 1.103449821472168 AVG-LOSS :2.8653938958519385

Confusion Matrix : 
[[389   0  17]
 [460   0   9]
 [215   0  17]]
F-Measure : 0.2200179104244145

-=-=-=-=-=-=-=-=-=-=-=-=-=-=-=-- Test iteration 57 on DEV -- LR :0.00024213333333333333 C-LOSS : 1.0650255680084229 AVG-LOSS :2.834353062613257

Confusion Matrix : 
[[393   0  13]
 [462   0   7]
 [218   0  14]]
F-Measure : 0.21696997155730072

-=-=-=-=-=-=-=-=-=-=-=-=-=-=-=-- Test iteration 58 on DEV -- LR :0.00022906666666666674 C-LOSS : 1.0890915393829346 AVG-LOSS :2.8047723588296924

Confusion Matrix : 
[[394   0  12]
 [462   0   7]
 [218   0  14]]
F-Measure : 0.21741714102505638

-=-=-=-=-=-=-=-=-=-=-=-=-=-=-=-- Test iteration 59 on DEV -- LR :0.00021600000000000026 C-LOSS : 1.0747981071472168 AVG-LOSS :2.7759394546349845

Confusion Matrix : 
[[395   0  11]
 [462   0   7]
 [221   0  11]]
F-Measure : 0.2129066224275101

-=-=-=-=-=-=-=-=-=-=-=-=-=-=-=-- Test iteration 60 on DEV -- LR :0.00020293333333333324 C-LOSS : 1.0940806865692139 AVG-LOSS :2.7483679994207915

Confusion Matrix : 
[[395   0  11]
 [463   0   6]
 [223   0   9]]
F-Measure : 0.20946890586394384

-=-=-=-=-=-=-=-=-=-=-=-=-=-=-=-- Test iteration 61 on DEV -- LR :0.00018986666666666676 C-LOSS : 1.0919013023376465 AVG-LOSS :2.7216507946291277

Confusion Matrix : 
[[398   0   8]
 [466   0   3]
 [224   0   8]]
F-Measure : 0.20876673442613683

-=-=-=-=-=-=-=-=-=-=-=-=-=-=-=-- Test iteration 62 on DEV -- LR :0.00017680000000000018 C-LOSS : 1.0704073905944824 AVG-LOSS :2.695440581866673

Confusion Matrix : 
[[399   0   7]
 [467   0   2]
 [225   0   7]]
F-Measure : 0.2073366069493651

-=-=-=-=-=-=-=-=-=-=-=-=-=-=-=-- Test iteration 63 on DEV -- LR :0.00016373333333333327 C-LOSS : 1.099891185760498 AVG-LOSS :2.670510122552514

Confusion Matrix : 
[[399   0   7]
 [467   0   2]
 [225   0   7]]
F-Measure : 0.2073366069493651

-=-=-=-=-=-=-=-=-=-=-=-=-=-=-=-- Test iteration 64 on DEV -- LR :0.00015066666666666668 C-LOSS : 1.0665316581726074 AVG-LOSS :2.645833530792823

Confusion Matrix : 
[[398   0   8]
 [467   0   2]
 [225   0   7]]
F-Measure : 0.20692946221747222

-=-=-=-=-=-=-=-=-=-=-=-=-=-=-=-- Test iteration 65 on DEV -- LR :0.0001376000000000002 C-LOSS : 1.0698015689849854 AVG-LOSS :2.6219542586442195

Confusion Matrix : 
[[398   0   8]
 [467   0   2]
 [225   0   7]]
F-Measure : 0.20692946221747222

-=-=-=-=-=-=-=-=-=-=-=-=-=-=-=-- Test iteration 66 on DEV -- LR :0.00012453333333333318 C-LOSS : 1.055232048034668 AVG-LOSS :2.5985703450530324

Confusion Matrix : 
[[398   0   8]
 [467   0   2]
 [226   0   6]]
F-Measure : 0.205156493208075

-=-=-=-=-=-=-=-=-=-=-=-=-=-=-=-- Test iteration 67 on DEV -- LR :0.0001114666666666667 C-LOSS : 1.0729665756225586 AVG-LOSS :2.576134995502584

Confusion Matrix : 
[[398   0   8]
 [466   0   3]
 [224   0   8]]
F-Measure : 0.20876673442613683

-=-=-=-=-=-=-=-=-=-=-=-=-=-=-=-- Test iteration 68 on DEV -- LR :9.840000000000011e-05 C-LOSS : 1.07817542552948 AVG-LOSS :2.554425436517467

Confusion Matrix : 
[[395   0  11]
 [463   0   6]
 [224   0   8]]
F-Measure : 0.20776391602109684

-=-=-=-=-=-=-=-=-=-=-=-=-=-=-=-- Test iteration 69 on DEV -- LR :8.53333333333332e-05 C-LOSS : 1.0775235891342163 AVG-LOSS :2.533326838697706

Confusion Matrix : 
[[395   0  11]
 [463   0   6]
 [223   0   9]]
F-Measure : 0.20946890586394384

-=-=-=-=-=-=-=-=-=-=-=-=-=-=-=-- Test iteration 70 on DEV -- LR :7.226666666666662e-05 C-LOSS : 1.0726701021194458 AVG-LOSS :2.5127542086050543

Confusion Matrix : 
[[395   0  11]
 [463   0   6]
 [220   0  12]]
F-Measure : 0.2145125644128559

-=-=-=-=-=-=-=-=-=-=-=-=-=-=-=-- Test iteration 71 on DEV -- LR :5.920000000000014e-05 C-LOSS : 1.0765571594238281 AVG-LOSS :2.4928070273664265

Confusion Matrix : 
[[395   0  11]
 [462   0   7]
 [220   0  12]]
F-Measure : 0.2145706627247752

-=-=-=-=-=-=-=-=-=-=-=-=-=-=-=-- Test iteration 72 on DEV -- LR :4.613333333333312e-05 C-LOSS : 1.050081729888916 AVG-LOSS :2.4730436671270084

Confusion Matrix : 
[[395   0  11]
 [462   0   7]
 [221   0  11]]
F-Measure : 0.2129066224275101

-=-=-=-=-=-=-=-=-=-=-=-=-=-=-=-- Test iteration 73 on DEV -- LR :3.306666666666664e-05 C-LOSS : 1.0785751342773438 AVG-LOSS :2.454199497764175

Confusion Matrix : 
[[395   0  11]
 [462   0   7]
 [220   0  12]]
F-Measure : 0.2145706627247752

-=-=-=-=-=-=-=-=-=-=-=-=-=-=-=-- Test iteration 74 on DEV -- LR :2.0000000000000052e-05 C-LOSS : 1.0896267890930176 AVG-LOSS :2.436005194981893

Confusion Matrix : 
[[395   0  11]
 [463   0   6]
 [220   0  12]]
F-Measure : 0.2145125644128559

-=-=-=-=-=-=-=-=-=-=-=-=-=-=-=-- Train epoch 1 --=-=-=-=-=-=-=-=-=-=-=-=-=-


-=-=-=-=-=-=-=-=-=-=-=-=-=-=-=-- Test iteration 75 on DEV -- LR :3.306666666666707e-05 C-LOSS : 1.5108716487884521 AVG-LOSS :2.4238323851635584

Confusion Matrix : 
[[404   2   0]
 [466   3   0]
 [232   0   0]]
F-Measure : 0.20187458933985641

-=-=-=-=-=-=-=-=-=-=-=-=-=-=-=-- Test iteration 76 on DEV -- LR :4.613333333333312e-05 C-LOSS : 1.1303186416625977 AVG-LOSS :2.4070335053778313

Confusion Matrix : 
[[404   2   0]
 [466   3   0]
 [232   0   0]]
F-Measure : 0.20187458933985641

-=-=-=-=-=-=-=-=-=-=-=-=-=-=-=-- Test iteration 77 on DEV -- LR :5.920000000000014e-05 C-LOSS : 1.1295310258865356 AVG-LOSS :2.3906552684612765

Confusion Matrix : 
[[404   2   0]
 [466   3   0]
 [232   0   0]]
F-Measure : 0.20187458933985641

-=-=-=-=-=-=-=-=-=-=-=-=-=-=-=-- Test iteration 78 on DEV -- LR :7.226666666666662e-05 C-LOSS : 1.1378182172775269 AVG-LOSS :2.3747965716108492

Confusion Matrix : 
[[404   2   0]
 [468   1   0]
 [232   0   0]]
F-Measure : 0.1980466298657823

-=-=-=-=-=-=-=-=-=-=-=-=-=-=-=-- Test iteration 79 on DEV -- LR :8.53333333333332e-05 C-LOSS : 1.1158684492111206 AVG-LOSS :2.3590599700808523

Confusion Matrix : 
[[404   2   0]
 [468   1   0]
 [232   0   0]]
F-Measure : 0.1980466298657823

-=-=-=-=-=-=-=-=-=-=-=-=-=-=-=-- Test iteration 80 on DEV -- LR :9.840000000000011e-05 C-LOSS : 1.110180139541626 AVG-LOSS :2.3436417005680226

Confusion Matrix : 
[[404   2   0]
 [469   0   0]
 [232   0   0]]
F-Measure : 0.19612154647908714

-=-=-=-=-=-=-=-=-=-=-=-=-=-=-=-- Test iteration 81 on DEV -- LR :0.0001114666666666667 C-LOSS : 1.0932222604751587 AVG-LOSS :2.3283926830059145

Confusion Matrix : 
[[406   0   0]
 [469   0   0]
 [232   0   0]]
F-Measure : 0.19683191324092134

-=-=-=-=-=-=-=-=-=-=-=-=-=-=-=-- Test iteration 82 on DEV -- LR :0.00012453333333333318 C-LOSS : 1.096624732017517 AVG-LOSS :2.3135521052831627

Confusion Matrix : 
[[406   0   0]
 [469   0   0]
 [232   0   0]]
F-Measure : 0.19683191324092134

-=-=-=-=-=-=-=-=-=-=-=-=-=-=-=-- Test iteration 83 on DEV -- LR :0.0001376000000000002 C-LOSS : 1.0549479722976685 AVG-LOSS :2.2985687227476213

Confusion Matrix : 
[[406   0   0]
 [469   0   0]
 [232   0   0]]
F-Measure : 0.19683191324092134

-=-=-=-=-=-=-=-=-=-=-=-=-=-=-=-- Test iteration 84 on DEV -- LR :0.00015066666666666668 C-LOSS : 1.0861181020736694 AVG-LOSS :2.2843045977985157

Confusion Matrix : 
[[406   0   0]
 [469   0   0]
 [232   0   0]]
F-Measure : 0.19683191324092134

-=-=-=-=-=-=-=-=-=-=-=-=-=-=-=-- Test iteration 85 on DEV -- LR :0.00016373333333333327 C-LOSS : 1.0942541360855103 AVG-LOSS :2.2704668017320855

Confusion Matrix : 
[[406   0   0]
 [469   0   0]
 [232   0   0]]
F-Measure : 0.19683191324092134

-=-=-=-=-=-=-=-=-=-=-=-=-=-=-=-- Test iteration 86 on DEV -- LR :0.00017680000000000018 C-LOSS : 1.0757719278335571 AVG-LOSS :2.2567346767447463

Confusion Matrix : 
[[406   0   0]
 [469   0   0]
 [232   0   0]]
F-Measure : 0.19683191324092134

-=-=-=-=-=-=-=-=-=-=-=-=-=-=-=-- Test iteration 87 on DEV -- LR :0.00018986666666666676 C-LOSS : 1.1179149150848389 AVG-LOSS :2.2437935430895197

Confusion Matrix : 
[[406   0   0]
 [469   0   0]
 [232   0   0]]
F-Measure : 0.19683191324092134

-=-=-=-=-=-=-=-=-=-=-=-=-=-=-=-- Test iteration 88 on DEV -- LR :0.00020293333333333324 C-LOSS : 1.0955034494400024 AVG-LOSS :2.2308914072058172

Confusion Matrix : 
[[406   0   0]
 [469   0   0]
 [232   0   0]]
F-Measure : 0.19683191324092134

-=-=-=-=-=-=-=-=-=-=-=-=-=-=-=-- Test iteration 89 on DEV -- LR :0.00021600000000000026 C-LOSS : 1.096664547920227 AVG-LOSS :2.2182888865470884

Confusion Matrix : 
[[406   0   0]
 [469   0   0]
 [232   0   0]]
F-Measure : 0.19683191324092134

-=-=-=-=-=-=-=-=-=-=-=-=-=-=-=-- Test iteration 90 on DEV -- LR :0.00022906666666666674 C-LOSS : 1.094014286994934 AVG-LOSS :2.205934220617944

Confusion Matrix : 
[[406   0   0]
 [469   0   0]
 [232   0   0]]
F-Measure : 0.19683191324092134

-=-=-=-=-=-=-=-=-=-=-=-=-=-=-=-- Test iteration 91 on DEV -- LR :0.00024213333333333333 C-LOSS : 1.1512672901153564 AVG-LOSS :2.1944704496342204

Confusion Matrix : 
[[406   0   0]
 [469   0   0]
 [232   0   0]]
F-Measure : 0.19683191324092134

-=-=-=-=-=-=-=-=-=-=-=-=-=-=-=-- Test iteration 92 on DEV -- LR :0.00025520000000000024 C-LOSS : 1.0621623992919922 AVG-LOSS :2.1822950942541963

Confusion Matrix : 
[[406   0   0]
 [469   0   0]
 [232   0   0]]
F-Measure : 0.19683191324092134

-=-=-=-=-=-=-=-=-=-=-=-=-=-=-=-- Test iteration 93 on DEV -- LR :0.0002682666666666668 C-LOSS : 1.0620770454406738 AVG-LOSS :2.170377880968946

Confusion Matrix : 
[[406   0   0]
 [469   0   0]
 [232   0   0]]
F-Measure : 0.19683191324092134

-=-=-=-=-=-=-=-=-=-=-=-=-=-=-=-- Test iteration 94 on DEV -- LR :0.0002813333333333333 C-LOSS : 1.0569099187850952 AVG-LOSS :2.1586571655775373

Confusion Matrix : 
[[406   0   0]
 [469   0   0]
 [232   0   0]]
F-Measure : 0.19683191324092134

-=-=-=-=-=-=-=-=-=-=-=-=-=-=-=-- Test iteration 95 on DEV -- LR :0.0002944000000000003 C-LOSS : 1.078365683555603 AVG-LOSS :2.147404129306475

Confusion Matrix : 
[[406   0   0]
 [469   0   0]
 [232   0   0]]
F-Measure : 0.19683191324092134

-=-=-=-=-=-=-=-=-=-=-=-=-=-=-=-- Test iteration 96 on DEV -- LR :0.00030746666666666637 C-LOSS : 1.1077910661697388 AVG-LOSS :2.136686468861767

Confusion Matrix : 
[[406   0   0]
 [469   0   0]
 [232   0   0]]
F-Measure : 0.19683191324092134

-=-=-=-=-=-=-=-=-=-=-=-=-=-=-=-- Test iteration 97 on DEV -- LR :0.0003205333333333334 C-LOSS : 1.0763591527938843 AVG-LOSS :2.125866802371278

Confusion Matrix : 
[[406   0   0]
 [469   0   0]
 [232   0   0]]
F-Measure : 0.19683191324092134

-=-=-=-=-=-=-=-=-=-=-=-=-=-=-=-- Test iteration 98 on DEV -- LR :0.0003336000000000003 C-LOSS : 1.0742942094802856 AVG-LOSS :2.1152448569885407

Confusion Matrix : 
[[406   0   0]
 [469   0   0]
 [232   0   0]]
F-Measure : 0.19683191324092134

-=-=-=-=-=-=-=-=-=-=-=-=-=-=-=-- Test iteration 99 on DEV -- LR :0.00034666666666666646 C-LOSS : 1.0749695301055908 AVG-LOSS :2.104842103719711

Confusion Matrix : 
[[406   0   0]
 [469   0   0]
 [232   0   0]]
F-Measure : 0.19683191324092134

-=-=-=-=-=-=-=-=-=-=-=-=-=-=-=-- Test iteration 100 on DEV -- LR :0.00035973333333333337 C-LOSS : 1.0537225008010864 AVG-LOSS :2.094434978938339

Confusion Matrix : 
[[406   0   0]
 [469   0   0]
 [232   0   0]]
F-Measure : 0.19683191324092134

-=-=-=-=-=-=-=-=-=-=-=-=-=-=-=-- Test iteration 101 on DEV -- LR :0.0003728000000000004 C-LOSS : 1.0619306564331055 AVG-LOSS :2.0843123875412286

Confusion Matrix : 
[[406   0   0]
 [469   0   0]
 [232   0   0]]
F-Measure : 0.19683191324092134

-=-=-=-=-=-=-=-=-=-=-=-=-=-=-=-- Test iteration 102 on DEV -- LR :0.00038586666666666643 C-LOSS : 1.0748990774154663 AVG-LOSS :2.0745122583167066

Confusion Matrix : 
[[406   0   0]
 [469   0   0]
 [232   0   0]]
F-Measure : 0.19683191324092134

-=-=-=-=-=-=-=-=-=-=-=-=-=-=-=-- Test iteration 103 on DEV -- LR :0.00039893333333333345 C-LOSS : 1.0775290727615356 AVG-LOSS :2.064925881532522

Confusion Matrix : 
[[406   0   0]
 [469   0   0]
 [232   0   0]]
F-Measure : 0.19683191324092134

-=-=-=-=-=-=-=-=-=-=-=-=-=-=-=-- Test iteration 104 on DEV -- LR :0.00041199999999999993 C-LOSS : 1.0645735263824463 AVG-LOSS :2.055398716245379

Confusion Matrix : 
[[406   0   0]
 [469   0   0]
 [232   0   0]]
F-Measure : 0.19683191324092134

-=-=-=-=-=-=-=-=-=-=-=-=-=-=-=-- Test iteration 105 on DEV -- LR :0.0004250666666666665 C-LOSS : 1.0809366703033447 AVG-LOSS :2.0462056780761144

Confusion Matrix : 
[[406   0   0]
 [469   0   0]
 [232   0   0]]
F-Measure : 0.19683191324092134

-=-=-=-=-=-=-=-=-=-=-=-=-=-=-=-- Test iteration 106 on DEV -- LR :0.00043813333333333343 C-LOSS : 1.1007719039916992 AVG-LOSS :2.037369848411774

Confusion Matrix : 
[[406   0   0]
 [469   0   0]
 [232   0   0]]
F-Measure : 0.19683191324092134

-=-=-=-=-=-=-=-=-=-=-=-=-=-=-=-- Test iteration 107 on DEV -- LR :0.0004512 C-LOSS : 1.0711565017700195 AVG-LOSS :2.0284234285354614

Confusion Matrix : 
[[405   1   0]
 [469   0   0]
 [232   0   0]]
F-Measure : 0.19647696476964768

-=-=-=-=-=-=-=-=-=-=-=-=-=-=-=-- Test iteration 108 on DEV -- LR :0.0004642666666666665 C-LOSS : 1.0495424270629883 AVG-LOSS :2.019442868888925

Confusion Matrix : 
[[405   1   0]
 [469   0   0]
 [232   0   0]]
F-Measure : 0.19647696476964768

-=-=-=-=-=-=-=-=-=-=-=-=-=-=-=-- Test iteration 109 on DEV -- LR :0.0004773333333333335 C-LOSS : 1.071455955505371 AVG-LOSS :2.0108248060399836

Confusion Matrix : 
[[405   1   0]
 [469   0   0]
 [232   0   0]]
F-Measure : 0.19647696476964768

-=-=-=-=-=-=-=-=-=-=-=-=-=-=-=-- Test iteration 110 on DEV -- LR :0.0004904 C-LOSS : 1.080618143081665 AVG-LOSS :2.002444565833152

Confusion Matrix : 
[[405   1   0]
 [469   0   0]
 [232   0   0]]
F-Measure : 0.19647696476964768

-=-=-=-=-=-=-=-=-=-=-=-=-=-=-=-- Test iteration 111 on DEV -- LR :0.0005034666666666666 C-LOSS : 1.0690319538116455 AVG-LOSS :1.9941105246543884

Confusion Matrix : 
[[406   0   0]
 [469   0   0]
 [232   0   0]]
F-Measure : 0.19683191324092134

-=-=-=-=-=-=-=-=-=-=-=-=-=-=-=-- Test iteration 112 on DEV -- LR :0.0005165333333333336 C-LOSS : 1.0593922138214111 AVG-LOSS :1.9858386811956894

Confusion Matrix : 
[[406   0   0]
 [469   0   0]
 [232   0   0]]
F-Measure : 0.19683191324092134

-=-=-=-=-=-=-=-=-=-=-=-=-=-=-=-- Test iteration 113 on DEV -- LR :0.0005296000000000001 C-LOSS : 1.1002206802368164 AVG-LOSS :1.9780701022399099

Confusion Matrix : 
[[406   0   0]
 [469   0   0]
 [232   0   0]]
F-Measure : 0.19683191324092134

-=-=-=-=-=-=-=-=-=-=-=-=-=-=-=-- Test iteration 114 on DEV -- LR :0.0005426666666666666 C-LOSS : 1.0746703147888184 AVG-LOSS :1.9702144519142482

Confusion Matrix : 
[[405   1   0]
 [469   0   0]
 [232   0   0]]
F-Measure : 0.19647696476964768

-=-=-=-=-=-=-=-=-=-=-=-=-=-=-=-- Test iteration 115 on DEV -- LR :0.0005557333333333336 C-LOSS : 1.0799758434295654 AVG-LOSS :1.9625399811514492

Confusion Matrix : 
[[405   1   0]
 [469   0   0]
 [232   0   0]]
F-Measure : 0.19647696476964768

-=-=-=-=-=-=-=-=-=-=-=-=-=-=-=-- Test iteration 116 on DEV -- LR :0.0005688000000000002 C-LOSS : 1.0378892421722412 AVG-LOSS :1.9546369833823962

Confusion Matrix : 
[[405   1   0]
 [469   0   0]
 [232   0   0]]
F-Measure : 0.19647696476964768

-=-=-=-=-=-=-=-=-=-=-=-=-=-=-=-- Test iteration 117 on DEV -- LR :0.0005818666666666666 C-LOSS : 1.0777636766433716 AVG-LOSS :1.947205853664269

Confusion Matrix : 
[[405   1   0]
 [469   0   0]
 [232   0   0]]
F-Measure : 0.19647696476964768

-=-=-=-=-=-=-=-=-=-=-=-=-=-=-=-- Test iteration 118 on DEV -- LR :0.0005949333333333336 C-LOSS : 1.045064091682434 AVG-LOSS :1.9396248304543375

Confusion Matrix : 
[[405   1   0]
 [469   0   0]
 [232   0   0]]
F-Measure : 0.19647696476964768

-=-=-=-=-=-=-=-=-=-=-=-=-=-=-=-- Test iteration 119 on DEV -- LR :0.0006080000000000001 C-LOSS : 1.0935146808624268 AVG-LOSS :1.9325739125410715

Confusion Matrix : 
[[404   2   0]
 [468   1   0]
 [232   0   0]]
F-Measure : 0.1980466298657823

-=-=-=-=-=-=-=-=-=-=-=-=-=-=-=-- Test iteration 120 on DEV -- LR :0.0006210666666666667 C-LOSS : 1.119585633277893 AVG-LOSS :1.9258550011422024

Confusion Matrix : 
[[402   4   0]
 [465   4   0]
 [232   0   0]]
F-Measure : 0.20303419272633888

-=-=-=-=-=-=-=-=-=-=-=-=-=-=-=-- Test iteration 121 on DEV -- LR :0.0006341333333333336 C-LOSS : 1.0501301288604736 AVG-LOSS :1.9186769284185816

Confusion Matrix : 
[[397   9   0]
 [454  15   0]
 [231   1   0]]
F-Measure : 0.221431124204876

-=-=-=-=-=-=-=-=-=-=-=-=-=-=-=-- Test iteration 122 on DEV -- LR :0.0006471999999999997 C-LOSS : 1.0926432609558105 AVG-LOSS :1.9119612075449006

Confusion Matrix : 
[[391  15   0]
 [438  31   0]
 [225   7   0]]
F-Measure : 0.24676174780082616

-=-=-=-=-=-=-=-=-=-=-=-=-=-=-=-- Test iteration 123 on DEV -- LR :0.0006602666666666667 C-LOSS : 1.0759623050689697 AVG-LOSS :1.90521928091203

Confusion Matrix : 
[[386  20   0]
 [428  41   0]
 [223   9   0]]
F-Measure : 0.26066778912307365

-=-=-=-=-=-=-=-=-=-=-=-=-=-=-=-- Test iteration 124 on DEV -- LR :0.0006733333333333337 C-LOSS : 1.0739282369613647 AVG-LOSS :1.8985689525604248

Confusion Matrix : 
[[391  15   0]
 [436  33   0]
 [225   7   0]]
F-Measure : 0.2500732542657384

-=-=-=-=-=-=-=-=-=-=-=-=-=-=-=-- Test iteration 125 on DEV -- LR :0.0006863999999999998 C-LOSS : 1.1020187139511108 AVG-LOSS :1.8922471252698747

Confusion Matrix : 
[[396  10   0]
 [453  16   0]
 [230   2   0]]
F-Measure : 0.22288212866479212

-=-=-=-=-=-=-=-=-=-=-=-=-=-=-=-- Test iteration 126 on DEV -- LR :0.0006994666666666667 C-LOSS : 1.064860224723816 AVG-LOSS :1.8857322677852602

Confusion Matrix : 
[[402   4   0]
 [465   4   0]
 [232   0   0]]
F-Measure : 0.20303419272633888

-=-=-=-=-=-=-=-=-=-=-=-=-=-=-=-- Test iteration 127 on DEV -- LR :0.0007125333333333337 C-LOSS : 1.0787392854690552 AVG-LOSS :1.8794276351109147

Confusion Matrix : 
[[404   2   0]
 [468   1   0]
 [232   0   0]]
F-Measure : 0.1980466298657823

-=-=-=-=-=-=-=-=-=-=-=-=-=-=-=-- Test iteration 128 on DEV -- LR :0.0007255999999999999 C-LOSS : 1.0561180114746094 AVG-LOSS :1.8730453899664472

Confusion Matrix : 
[[404   1   1]
 [469   0   0]
 [230   0   2]]
F-Measure : 0.19994872360588115

-=-=-=-=-=-=-=-=-=-=-=-=-=-=-=-- Test iteration 129 on DEV -- LR :0.0007386666666666668 C-LOSS : 1.0565528869628906 AVG-LOSS :1.8667646784048815

Confusion Matrix : 
[[405   0   1]
 [468   0   1]
 [229   0   3]]
F-Measure : 0.20230383089290158

-=-=-=-=-=-=-=-=-=-=-=-=-=-=-=-- Test iteration 130 on DEV -- LR :0.0007517333333333332 C-LOSS : 1.0608084201812744 AVG-LOSS :1.8606123405558463

Confusion Matrix : 
[[405   0   1]
 [469   0   0]
 [232   0   0]]
F-Measure : 0.19647696476964768

-=-=-=-=-=-=-=-=-=-=-=-=-=-=-=-- Test iteration 131 on DEV -- LR :0.0007647999999999998 C-LOSS : 1.1114500761032104 AVG-LOSS :1.8549368688554475

Confusion Matrix : 
[[406   0   0]
 [469   0   0]
 [232   0   0]]
F-Measure : 0.19683191324092134

-=-=-=-=-=-=-=-=-=-=-=-=-=-=-=-- Test iteration 132 on DEV -- LR :0.0007778666666666669 C-LOSS : 1.0686722993850708 AVG-LOSS :1.8490251051752191

Confusion Matrix : 
[[404   2   0]
 [468   1   0]
 [232   0   0]]
F-Measure : 0.1980466298657823

-=-=-=-=-=-=-=-=-=-=-=-=-=-=-=-- Test iteration 133 on DEV -- LR :0.0007909333333333333 C-LOSS : 1.0747066736221313 AVG-LOSS :1.8432466094173603

Confusion Matrix : 
[[400   6   0]
 [464   5   0]
 [232   0   0]]
F-Measure : 0.20416968382215261

-=-=-=-=-=-=-=-=-=-=-=-=-=-=-=-- Test iteration 134 on DEV -- LR :0.0008039999999999998 C-LOSS : 1.0632365942001343 AVG-LOSS :1.8374687574527881

Confusion Matrix : 
[[398   8   0]
 [453  16   0]
 [231   1   0]]
F-Measure : 0.2236393304829541

-=-=-=-=-=-=-=-=-=-=-=-=-=-=-=-- Test iteration 135 on DEV -- LR :0.0008170666666666668 C-LOSS : 1.102220892906189 AVG-LOSS :1.8320625231546515

Confusion Matrix : 
[[396  10   0]
 [452  17   0]
 [231   1   0]]
F-Measure : 0.22458702834289687

-=-=-=-=-=-=-=-=-=-=-=-=-=-=-=-- Test iteration 136 on DEV -- LR :0.0008301333333333334 C-LOSS : 1.0293166637420654 AVG-LOSS :1.8262030643268223

Confusion Matrix : 
[[403   3   0]
 [466   3   0]
 [231   0   1]]
F-Measure : 0.20343614042115488

-=-=-=-=-=-=-=-=-=-=-=-=-=-=-=-- Test iteration 137 on DEV -- LR :0.0008431999999999999 C-LOSS : 1.0624713897705078 AVG-LOSS :1.8206687768300374

Confusion Matrix : 
[[403   2   1]
 [466   2   1]
 [230   0   2]]
F-Measure : 0.20355098002790203

-=-=-=-=-=-=-=-=-=-=-=-=-=-=-=-- Test iteration 138 on DEV -- LR :0.0008562666666666668 C-LOSS : 1.0777755975723267 AVG-LOSS :1.815324221583579

Confusion Matrix : 
[[392   1  13]
 [464   0   5]
 [218   0  14]]
F-Measure : 0.21650978398945878

-=-=-=-=-=-=-=-=-=-=-=-=-=-=-=-- Test iteration 139 on DEV -- LR :0.0008693333333333334 C-LOSS : 1.0919508934020996 AVG-LOSS :1.8101572692394257

Confusion Matrix : 
[[395   1  10]
 [466   0   3]
 [222   0  10]]
F-Measure : 0.21102293712113085

-=-=-=-=-=-=-=-=-=-=-=-=-=-=-=-- Test iteration 140 on DEV -- LR :0.0008823999999999999 C-LOSS : 1.0384217500686646 AVG-LOSS :1.804683967685023

Confusion Matrix : 
[[387   1  18]
 [463   0   6]
 [212   0  20]]
F-Measure : 0.2237451298152887

-=-=-=-=-=-=-=-=-=-=-=-=-=-=-=-- Test iteration 141 on DEV -- LR :0.0008954666666666669 C-LOSS : 1.0276668071746826 AVG-LOSS :1.7992120158504432

Confusion Matrix : 
[[378   1  27]
 [453   0  16]
 [210   0  22]]
F-Measure : 0.2226641707235453

-=-=-=-=-=-=-=-=-=-=-=-=-=-=-=-- Test iteration 142 on DEV -- LR :0.0009085333333333334 C-LOSS : 1.0386574268341064 AVG-LOSS :1.7938934522908885

Confusion Matrix : 
[[341   1  64]
 [447   0  22]
 [191   0  41]]
F-Measure : 0.22846762882989055

-=-=-=-=-=-=-=-=-=-=-=-=-=-=-=-- Test iteration 143 on DEV -- LR :0.0009216 C-LOSS : 1.0647376775741577 AVG-LOSS :1.7888298705220222

Confusion Matrix : 
[[283   1 122]
 [398   2  69]
 [158   0  74]]
F-Measure : 0.23273369086493312

-=-=-=-=-=-=-=-=-=-=-=-=-=-=-=-- Test iteration 144 on DEV -- LR :0.000934666666666667 C-LOSS : 1.0688717365264893 AVG-LOSS :1.7838646420117081

Confusion Matrix : 
[[294   3 109]
 [404   4  61]
 [165   0  67]]
F-Measure : 0.23693857151668574

-=-=-=-=-=-=-=-=-=-=-=-=-=-=-=-- Test iteration 145 on DEV -- LR :0.0009477333333333335 C-LOSS : 1.0834115743637085 AVG-LOSS :1.7790670182606945

Confusion Matrix : 
[[320  10  76]
 [420  12  37]
 [178   0  54]]
F-Measure : 0.25472033649572695

-=-=-=-=-=-=-=-=-=-=-=-=-=-=-=-- Test iteration 146 on DEV -- LR :0.0009607999999999999 C-LOSS : 1.056776523590088 AVG-LOSS :1.7741534774806225

Confusion Matrix : 
[[326   8  72]
 [425  10  34]
 [184   0  48]]
F-Measure : 0.24784030547040845

-=-=-=-=-=-=-=-=-=-=-=-=-=-=-=-- Test iteration 147 on DEV -- LR :0.000973866666666667 C-LOSS : 1.049071192741394 AVG-LOSS :1.769254272854006

Confusion Matrix : 
[[317   6  83]
 [415   6  48]
 [173   0  59]]
F-Measure : 0.24653512691076812

-=-=-=-=-=-=-=-=-=-=-=-=-=-=-=-- Test iteration 148 on DEV -- LR :0.0009869333333333331 C-LOSS : 1.0641846656799316 AVG-LOSS :1.7645222620676029

Confusion Matrix : 
[[322   9  75]
 [418  12  39]
 [180   1  51]]
F-Measure : 0.2526776876711706

-=-=-=-=-=-=-=-=-=-=-=-=-=-=-=-- Test iteration 149 on DEV -- LR :0.001 C-LOSS : 1.0509390830993652 AVG-LOSS :1.7597650408744812

Confusion Matrix : 
[[294  26  86]
 [361  51  57]
 [153  13  66]]
F-Measure : 0.31767461012970766

-=-=-=-=-=-=-=-=-=-=-=-=-=-=-=-- Train epoch 2 --=-=-=-=-=-=-=-=-=-=-=-=-=-


-=-=-=-=-=-=-=-=-=-=-=-=-=-=-=-- Test iteration 150 on DEV -- LR :0.0009869333333333331 C-LOSS : 1.9837197065353394 AVG-LOSS :1.7612481843556789

Confusion Matrix : 
[[345  46  15]
 [374  92   3]
 [190  29  13]]
F-Measure : 0.3357318124121449

-=-=-=-=-=-=-=-=-=-=-=-=-=-=-=-- Test iteration 151 on DEV -- LR :0.0009738666666666661 C-LOSS : 1.0121597051620483 AVG-LOSS :1.7563199706767734

Confusion Matrix : 
[[322  57  27]
 [344 118   7]
 [179  32  21]]
F-Measure : 0.36737935332014804
> Save best model exp/pytorch_resnet_block256_ecapatdnn_good/tdnn_sentiment/finalf10/finalf10_tdnn_sentiment_pid-2815.mat

-=-=-=-=-=-=-=-=-=-=-=-=-=-=-=-- Test iteration 152 on DEV -- LR :0.0009607999999999999 C-LOSS : 1.0393595695495605 AVG-LOSS :1.7516339549831315

Confusion Matrix : 
[[309  37  60]
 [359  81  29]
 [171  17  44]]
F-Measure : 0.3462133400400192

-=-=-=-=-=-=-=-=-=-=-=-=-=-=-=-- Test iteration 153 on DEV -- LR :0.0009477333333333339 C-LOSS : 1.0941293239593506 AVG-LOSS :1.747364444392068

Confusion Matrix : 
[[307  18  81]
 [387  26  56]
 [165   2  65]]
F-Measure : 0.283568995443825

-=-=-=-=-=-=-=-=-=-=-=-=-=-=-=-- Test iteration 154 on DEV -- LR :0.000934666666666667 C-LOSS : 1.0906157493591309 AVG-LOSS :1.7431273560370169

Confusion Matrix : 
[[346   7  53]
 [429  15  25]
 [193   0  39]]
F-Measure : 0.25743834280289796

-=-=-=-=-=-=-=-=-=-=-=-=-=-=-=-- Test iteration 155 on DEV -- LR :0.0009216 C-LOSS : 1.1076785326004028 AVG-LOSS :1.7390539661431923

Confusion Matrix : 
[[362   7  37]
 [444  11  14]
 [202   0  30]]
F-Measure : 0.2471010748739954

-=-=-=-=-=-=-=-=-=-=-=-=-=-=-=-- Test iteration 156 on DEV -- LR :0.0009085333333333329 C-LOSS : 1.0322725772857666 AVG-LOSS :1.7345521738574763

Confusion Matrix : 
[[368   8  30]
 [448  11  10]
 [203   1  28]]
F-Measure : 0.24760822923408798

-=-=-=-=-=-=-=-=-=-=-=-=-=-=-=-- Test iteration 157 on DEV -- LR :0.0008954666666666669 C-LOSS : 1.086174726486206 AVG-LOSS :1.7304485191272785

Confusion Matrix : 
[[374   8  24]
 [446  15   8]
 [206   1  25]]
F-Measure : 0.253613900411344

-=-=-=-=-=-=-=-=-=-=-=-=-=-=-=-- Test iteration 158 on DEV -- LR :0.0008823999999999999 C-LOSS : 1.0133415460586548 AVG-LOSS :1.7259384123784192

Confusion Matrix : 
[[381   3  22]
 [459   3   7]
 [208   0  24]]
F-Measure : 0.2328554061669384

-=-=-=-=-=-=-=-=-=-=-=-=-=-=-=-- Test iteration 159 on DEV -- LR :0.0008693333333333338 C-LOSS : 1.0777182579040527 AVG-LOSS :1.7218870364129544

Confusion Matrix : 
[[383   2  21]
 [461   2   6]
 [210   0  22]]
F-Measure : 0.22882071761595585

-=-=-=-=-=-=-=-=-=-=-=-=-=-=-=-- Test iteration 160 on DEV -- LR :0.0008562666666666668 C-LOSS : 1.0875226259231567 AVG-LOSS :1.7179468847950052

Confusion Matrix : 
[[390   2  14]
 [462   1   6]
 [210   0  22]]
F-Measure : 0.23032053607302133

-=-=-=-=-=-=-=-=-=-=-=-=-=-=-=-- Test iteration 161 on DEV -- LR :0.0008431999999999999 C-LOSS : 1.0260244607925415 AVG-LOSS :1.713675758720916

Confusion Matrix : 
[[399   4   3]
 [458   9   2]
 [226   1   5]]
F-Measure : 0.22100513138419123

-=-=-=-=-=-=-=-=-=-=-=-=-=-=-=-- Test iteration 162 on DEV -- LR :0.000830133333333333 C-LOSS : 0.9849894046783447 AVG-LOSS :1.709205290291207

Confusion Matrix : 
[[386  18   2]
 [438  30   1]
 [223   8   1]]
F-Measure : 0.24505853432403316

-=-=-=-=-=-=-=-=-=-=-=-=-=-=-=-- Test iteration 163 on DEV -- LR :0.0008170666666666668 C-LOSS : 1.1076881885528564 AVG-LOSS :1.7055375030854854

Confusion Matrix : 
[[363  41   2]
 [371  96   2]
 [211  20   1]]
F-Measure : 0.3287991120846377

-=-=-=-=-=-=-=-=-=-=-=-=-=-=-=-- Test iteration 164 on DEV -- LR :0.0008039999999999998 C-LOSS : 1.024065375328064 AVG-LOSS :1.7014073689778646

Confusion Matrix : 
[[393  10   3]
 [450  17   2]
 [220   5   7]]
F-Measure : 0.237012927637538

-=-=-=-=-=-=-=-=-=-=-=-=-=-=-=-- Test iteration 165 on DEV -- LR :0.0007909333333333338 C-LOSS : 1.0530864000320435 AVG-LOSS :1.6975018209721668

Confusion Matrix : 
[[397   2   7]
 [459   6   4]
 [215   0  17]]
F-Measure : 0.23522414439696696

-=-=-=-=-=-=-=-=-=-=-=-=-=-=-=-- Test iteration 166 on DEV -- LR :0.0007778666666666669 C-LOSS : 1.0749518871307373 AVG-LOSS :1.6937739770569487

Confusion Matrix : 
[[391   5  10]
 [456   8   5]
 [214   0  18]]
F-Measure : 0.2380380100113308

-=-=-=-=-=-=-=-=-=-=-=-=-=-=-=-- Test iteration 167 on DEV -- LR :0.0007647999999999998 C-LOSS : 1.0493922233581543 AVG-LOSS :1.6899383713801701

Confusion Matrix : 
[[387  12   7]
 [446  18   5]
 [208   6  18]]
F-Measure : 0.2551769121839233

-=-=-=-=-=-=-=-=-=-=-=-=-=-=-=-- Test iteration 168 on DEV -- LR :0.0007517333333333328 C-LOSS : 1.0903619527816772 AVG-LOSS :1.6863905819210074

Confusion Matrix : 
[[385  16   5]
 [443  23   3]
 [212   7  13]]
F-Measure : 0.2546789189176841

-=-=-=-=-=-=-=-=-=-=-=-=-=-=-=-- Test iteration 169 on DEV -- LR :0.0007386666666666668 C-LOSS : 1.0910202264785767 AVG-LOSS :1.6828884033595815

Confusion Matrix : 
[[362  35   9]
 [382  84   3]
 [202  15  15]]
F-Measure : 0.33871134121290464

-=-=-=-=-=-=-=-=-=-=-=-=-=-=-=-- Test iteration 170 on DEV -- LR :0.0007256000000000007 C-LOSS : 1.0171010494232178 AVG-LOSS :1.6789949100617079

Confusion Matrix : 
[[287  19 100]
 [383  33  53]
 [166   9  57]]
F-Measure : 0.2763116066041247

-=-=-=-=-=-=-=-=-=-=-=-=-=-=-=-- Test iteration 171 on DEV -- LR :0.0007125333333333337 C-LOSS : 1.0946863889694214 AVG-LOSS :1.675597767497218

Confusion Matrix : 
[[206  13 187]
 [320  21 128]
 [127   7  98]]
F-Measure : 0.24126065028437482

-=-=-=-=-=-=-=-=-=-=-=-=-=-=-=-- Test iteration 172 on DEV -- LR :0.0006994666666666667 C-LOSS : 1.047617793083191 AVG-LOSS :1.671967825448582

Confusion Matrix : 
[[277  18 111]
 [377  34  58]
 [162   8  62]]
F-Measure : 0.27685947335759054

-=-=-=-=-=-=-=-=-=-=-=-=-=-=-=-- Test iteration 173 on DEV -- LR :0.0006863999999999998 C-LOSS : 1.074680209159851 AVG-LOSS :1.6685351379986466

Confusion Matrix : 
[[349  19  38]
 [420  36  13]
 [194   8  30]]
F-Measure : 0.28450784097737586

-=-=-=-=-=-=-=-=-=-=-=-=-=-=-=-- Test iteration 174 on DEV -- LR :0.0006733333333333329 C-LOSS : 1.141944169998169 AVG-LOSS :1.6655260467529296

Confusion Matrix : 
[[367  36   3]
 [387  79   3]
 [214  11   7]]
F-Measure : 0.3204031055229475

-=-=-=-=-=-=-=-=-=-=-=-=-=-=-=-- Test iteration 175 on DEV -- LR :0.0006602666666666667 C-LOSS : 1.0784975290298462 AVG-LOSS :1.6621906574476848

Confusion Matrix : 
[[353  51   2]
 [366 101   2]
 [211  17   4]]
F-Measure : 0.33493532116924524

-=-=-=-=-=-=-=-=-=-=-=-=-=-=-=-- Test iteration 176 on DEV -- LR :0.0006472000000000006 C-LOSS : 1.1540107727050781 AVG-LOSS :1.6593195846525288

Confusion Matrix : 
[[335  68   3]
 [330 137   2]
 [194  31   7]]
F-Measure : 0.3709350160043025
> Save best model exp/pytorch_resnet_block256_ecapatdnn_good/tdnn_sentiment/finalf10/finalf10_tdnn_sentiment_pid-2815.mat

-=-=-=-=-=-=-=-=-=-=-=-=-=-=-=-- Test iteration 177 on DEV -- LR :0.0006341333333333336 C-LOSS : 1.1336079835891724 AVG-LOSS :1.656366148691499

Confusion Matrix : 
[[340  23  43]
 [405  51  13]
 [192  11  29]]
F-Measure : 0.30204855491002136

-=-=-=-=-=-=-=-=-=-=-=-=-=-=-=-- Test iteration 178 on DEV -- LR :0.0006210666666666667 C-LOSS : 1.1201776266098022 AVG-LOSS :1.6533706820876906

Confusion Matrix : 
[[279   2 125]
 [404   9  56]
 [160   2  70]]
F-Measure : 0.24041951801139594

-=-=-=-=-=-=-=-=-=-=-=-=-=-=-=-- Test iteration 179 on DEV -- LR :0.0006079999999999997 C-LOSS : 1.0583627223968506 AVG-LOSS :1.6500650823116303

Confusion Matrix : 
[[257   1 148]
 [388   3  78]
 [156   0  76]]
F-Measure : 0.22121182806973272

-=-=-=-=-=-=-=-=-=-=-=-=-=-=-=-- Test iteration 180 on DEV -- LR :0.0005949333333333327 C-LOSS : 1.0202751159667969 AVG-LOSS :1.6465855797351394

Confusion Matrix : 
[[323   1  82]
 [439   1  29]
 [184   1  47]]
F-Measure : 0.22754865502610386

-=-=-=-=-=-=-=-=-=-=-=-=-=-=-=-- Test iteration 181 on DEV -- LR :0.0005818666666666666 C-LOSS : 1.0307453870773315 AVG-LOSS :1.6432018424128438

Confusion Matrix : 
[[393   1  12]
 [462   3   4]
 [215   0  17]]
F-Measure : 0.22756869901594642

-=-=-=-=-=-=-=-=-=-=-=-=-=-=-=-- Test iteration 182 on DEV -- LR :0.0005688000000000006 C-LOSS : 1.1566343307495117 AVG-LOSS :1.6405430035512956

Confusion Matrix : 
[[404   2   0]
 [462   5   2]
 [227   0   5]]
F-Measure : 0.21536099113749765

-=-=-=-=-=-=-=-=-=-=-=-=-=-=-=-- Test iteration 183 on DEV -- LR :0.0005557333333333336 C-LOSS : 1.0164449214935303 AVG-LOSS :1.6371511661488076

Confusion Matrix : 
[[397   8   1]
 [451  16   2]
 [224   6   2]]
F-Measure : 0.22773262738644098

-=-=-=-=-=-=-=-=-=-=-=-=-=-=-=-- Test iteration 184 on DEV -- LR :0.0005426666666666666 C-LOSS : 1.1686487197875977 AVG-LOSS :1.634618720492801

Confusion Matrix : 
[[392  13   1]
 [444  23   2]
 [223   7   2]]
F-Measure : 0.2378723446369932

-=-=-=-=-=-=-=-=-=-=-=-=-=-=-=-- Test iteration 185 on DEV -- LR :0.0005295999999999996 C-LOSS : 1.073779821395874 AVG-LOSS :1.6316034575944305

Confusion Matrix : 
[[393   4   9]
 [460   7   2]
 [224   0   8]]
F-Measure : 0.2201000442475559

-=-=-=-=-=-=-=-=-=-=-=-=-=-=-=-- Test iteration 186 on DEV -- LR :0.0005165333333333336 C-LOSS : 1.0695030689239502 AVG-LOSS :1.6285975731630375

Confusion Matrix : 
[[368   1  37]
 [457   3   9]
 [206   0  26]]
F-Measure : 0.22906756913339912

-=-=-=-=-=-=-=-=-=-=-=-=-=-=-=-- Test iteration 187 on DEV -- LR :0.0005034666666666666 C-LOSS : 1.0690524578094482 AVG-LOSS :1.6256212693579652

Confusion Matrix : 
[[319   1  86]
 [443   1  25]
 [180   1  51]]
F-Measure : 0.2296345726023944

-=-=-=-=-=-=-=-=-=-=-=-=-=-=-=-- Test iteration 188 on DEV -- LR :0.0004904000000000004 C-LOSS : 1.0808645486831665 AVG-LOSS :1.6227389586665644

Confusion Matrix : 
[[317   2  87]
 [442   2  25]
 [179   1  52]]
F-Measure : 0.23162414830153502

-=-=-=-=-=-=-=-=-=-=-=-=-=-=-=-- Test iteration 189 on DEV -- LR :0.0004773333333333335 C-LOSS : 1.084702968597412 AVG-LOSS :1.6199071902977793

Confusion Matrix : 
[[335   2  69]
 [446   6  17]
 [194   1  37]]
F-Measure : 0.2322563954635118

-=-=-=-=-=-=-=-=-=-=-=-=-=-=-=-- Test iteration 190 on DEV -- LR :0.0004642666666666665 C-LOSS : 1.0168638229370117 AVG-LOSS :1.616749895180707

Confusion Matrix : 
[[383   1  22]
 [457   6   6]
 [211   1  20]]
F-Measure : 0.23341567584376974

-=-=-=-=-=-=-=-=-=-=-=-=-=-=-=-- Test iteration 191 on DEV -- LR :0.0004511999999999996 C-LOSS : 1.0512075424194336 AVG-LOSS :1.6138043620934088

Confusion Matrix : 
[[395   3   8]
 [462   5   2]
 [219   1  12]]
F-Measure : 0.2241704851044271

-=-=-=-=-=-=-=-=-=-=-=-=-=-=-=-- Test iteration 192 on DEV -- LR :0.00043813333333333343 C-LOSS : 1.0706239938735962 AVG-LOSS :1.6109899560404566

Confusion Matrix : 
[[399   3   4]
 [460   7   2]
 [226   0   6]]
F-Measure : 0.21898223589823695

-=-=-=-=-=-=-=-=-=-=-=-=-=-=-=-- Test iteration 193 on DEV -- LR :0.0004250666666666674 C-LOSS : 1.020093560218811 AVG-LOSS :1.6079440983300357

Confusion Matrix : 
[[401   4   1]
 [458  10   1]
 [226   2   4]]
F-Measure : 0.22179178142648573

-=-=-=-=-=-=-=-=-=-=-=-=-=-=-=-- Test iteration 194 on DEV -- LR :0.00041200000000000037 C-LOSS : 1.0694317817687988 AVG-LOSS :1.6051824967066446

Confusion Matrix : 
[[396   8   2]
 [454  14   1]
 [226   3   3]]
F-Measure : 0.2252966534473746

-=-=-=-=-=-=-=-=-=-=-=-=-=-=-=-- Test iteration 195 on DEV -- LR :0.00039893333333333345 C-LOSS : 1.0786521434783936 AVG-LOSS :1.6024961173534393

Confusion Matrix : 
[[395   8   3]
 [452  16   1]
 [225   3   4]]
F-Measure : 0.23035308952960512

-=-=-=-=-=-=-=-=-=-=-=-=-=-=-=-- Test iteration 196 on DEV -- LR :0.00038586666666666643 C-LOSS : 1.040998935699463 AVG-LOSS :1.5996458778526577

Confusion Matrix : 
[[396   6   4]
 [453  15   1]
 [221   5   6]]
F-Measure : 0.23282266583946218

-=-=-=-=-=-=-=-=-=-=-=-=-=-=-=-- Test iteration 197 on DEV -- LR :0.0003727999999999995 C-LOSS : 1.0201667547225952 AVG-LOSS :1.596719215614627

Confusion Matrix : 
[[395   5   6]
 [452  14   3]
 [213   9  10]]
F-Measure : 0.23820632585435028

-=-=-=-=-=-=-=-=-=-=-=-=-=-=-=-- Test iteration 198 on DEV -- LR :0.00035973333333333337 C-LOSS : 1.0407276153564453 AVG-LOSS :1.5939252879751387

Confusion Matrix : 
[[390   6  10]
 [444  21   4]
 [203  12  17]]
F-Measure : 0.260368062735233

-=-=-=-=-=-=-=-=-=-=-=-=-=-=-=-- Test iteration 199 on DEV -- LR :0.0003466666666666673 C-LOSS : 1.037258505821228 AVG-LOSS :1.5911419540643692

Confusion Matrix : 
[[387   7  12]
 [441  23   5]
 [201  13  18]]
F-Measure : 0.26414000314368835

-=-=-=-=-=-=-=-=-=-=-=-=-=-=-=-- Test iteration 200 on DEV -- LR :0.0003336000000000003 C-LOSS : 1.0376311540603638 AVG-LOSS :1.5883881689897223

Confusion Matrix : 
[[385   6  15]
 [445  18   6]
 [203  12  17]]
F-Measure : 0.2528424274000105

-=-=-=-=-=-=-=-=-=-=-=-=-=-=-=-- Test iteration 201 on DEV -- LR :0.0003205333333333334 C-LOSS : 1.063341736793518 AVG-LOSS :1.585788929226375

Confusion Matrix : 
[[387   4  15]
 [448  15   6]
 [203  12  17]]
F-Measure : 0.24839685043339954

-=-=-=-=-=-=-=-=-=-=-=-=-=-=-=-- Test iteration 202 on DEV -- LR :0.00030746666666666637 C-LOSS : 1.079443335533142 AVG-LOSS :1.58329461595695

Confusion Matrix : 
[[392   4  10]
 [450  14   5]
 [204  12  16]]
F-Measure : 0.2473011752508192

-=-=-=-=-=-=-=-=-=-=-=-=-=-=-=-- Test iteration 203 on DEV -- LR :0.00029439999999999946 C-LOSS : 1.0296545028686523 AVG-LOSS :1.5805806938339682

Confusion Matrix : 
[[396   4   6]
 [457   9   3]
 [212  10  10]]
F-Measure : 0.22966463053228542

-=-=-=-=-=-=-=-=-=-=-=-=-=-=-=-- Test iteration 204 on DEV -- LR :0.0002813333333333333 C-LOSS : 1.058956503868103 AVG-LOSS :1.5780361855902323

Confusion Matrix : 
[[401   3   2]
 [457   9   3]
 [220   6   6]]
F-Measure : 0.2242155254939533

-=-=-=-=-=-=-=-=-=-=-=-=-=-=-=-- Test iteration 205 on DEV -- LR :0.00026826666666666726 C-LOSS : 1.0240178108215332 AVG-LOSS :1.5753467760039765

Confusion Matrix : 
[[400   4   2]
 [459   8   2]
 [222   5   5]]
F-Measure : 0.2199577660677425

-=-=-=-=-=-=-=-=-=-=-=-=-=-=-=-- Test iteration 206 on DEV -- LR :0.00025520000000000024 C-LOSS : 1.0128581523895264 AVG-LOSS :1.572629439658013

Confusion Matrix : 
[[400   4   2]
 [460   8   1]
 [223   4   5]]
F-Measure : 0.21975772968945653

-=-=-=-=-=-=-=-=-=-=-=-=-=-=-=-- Test iteration 207 on DEV -- LR :0.00024213333333333333 C-LOSS : 1.027825117111206 AVG-LOSS :1.5700101881073072

Confusion Matrix : 
[[400   4   2]
 [457  11   1]
 [222   5   5]]
F-Measure : 0.2253725473226584

-=-=-=-=-=-=-=-=-=-=-=-=-=-=-=-- Test iteration 208 on DEV -- LR :0.0002290666666666663 C-LOSS : 1.0403363704681396 AVG-LOSS :1.5674758636209953

Confusion Matrix : 
[[400   4   2]
 [459   9   1]
 [221   6   5]]
F-Measure : 0.221805960499671

-=-=-=-=-=-=-=-=-=-=-=-=-=-=-=-- Test iteration 209 on DEV -- LR :0.00021600000000000026 C-LOSS : 1.0656718015670776 AVG-LOSS :1.5650863204683576

Confusion Matrix : 
[[399   5   2]
 [458  10   1]
 [221   6   5]]
F-Measure : 0.2232432507014498

-=-=-=-=-=-=-=-=-=-=-=-=-=-=-=-- Test iteration 210 on DEV -- LR :0.00020293333333333324 C-LOSS : 0.9838887453079224 AVG-LOSS :1.56233182959082

Confusion Matrix : 
[[399   5   2]
 [456  12   1]
 [220   7   5]]
F-Measure : 0.22697498432071966

-=-=-=-=-=-=-=-=-=-=-=-=-=-=-=-- Test iteration 211 on DEV -- LR :0.0001898666666666672 C-LOSS : 1.06632661819458 AVG-LOSS :1.559992182367253

Confusion Matrix : 
[[399   5   2]
 [453  15   1]
 [217   9   6]]
F-Measure : 0.2343791875555935

-=-=-=-=-=-=-=-=-=-=-=-=-=-=-=-- Test iteration 212 on DEV -- LR :0.00017680000000000018 C-LOSS : 1.0377728939056396 AVG-LOSS :1.5575404486186069

Confusion Matrix : 
[[398   5   3]
 [452  14   3]
 [212   9  11]]
F-Measure : 0.2412535376185337

-=-=-=-=-=-=-=-=-=-=-=-=-=-=-=-- Test iteration 213 on DEV -- LR :0.00016373333333333327 C-LOSS : 1.0044870376586914 AVG-LOSS :1.5549560868851493

Confusion Matrix : 
[[393   6   7]
 [451  13   5]
 [209  10  13]]
F-Measure : 0.2409025957607052

-=-=-=-=-=-=-=-=-=-=-=-=-=-=-=-- Test iteration 214 on DEV -- LR :0.00015066666666666625 C-LOSS : 1.079607367515564 AVG-LOSS :1.5527451626090116

Confusion Matrix : 
[[388   5  13]
 [448  13   8]
 [206   9  17]]
F-Measure : 0.24514869262096406

-=-=-=-=-=-=-=-=-=-=-=-=-=-=-=-- Test iteration 215 on DEV -- LR :0.0001376000000000002 C-LOSS : 1.0742347240447998 AVG-LOSS :1.5505298365045477

Confusion Matrix : 
[[384   6  16]
 [446  14   9]
 [205   9  18]]
F-Measure : 0.24672398763949474

-=-=-=-=-=-=-=-=-=-=-=-=-=-=-=-- Test iteration 216 on DEV -- LR :0.00012453333333333318 C-LOSS : 1.041502594947815 AVG-LOSS :1.5481840888476042

Confusion Matrix : 
[[385   5  16]
 [450  10   9]
 [205   9  18]]
F-Measure : 0.2399220254128442

-=-=-=-=-=-=-=-=-=-=-=-=-=-=-=-- Test iteration 217 on DEV -- LR :0.00011146666666666714 C-LOSS : 1.0368387699127197 AVG-LOSS :1.545838468118545

Confusion Matrix : 
[[387   4  15]
 [453   7   9]
 [206   8  18]]
F-Measure : 0.23519255416523055

-=-=-=-=-=-=-=-=-=-=-=-=-=-=-=-- Test iteration 218 on DEV -- LR :9.840000000000011e-05 C-LOSS : 1.0232641696929932 AVG-LOSS :1.5434522841074696

Confusion Matrix : 
[[390   2  14]
 [456   6   7]
 [210   5  17]]
F-Measure : 0.23260935004827063

-=-=-=-=-=-=-=-=-=-=-=-=-=-=-=-- Test iteration 219 on DEV -- LR :8.53333333333332e-05 C-LOSS : 1.0407335758209229 AVG-LOSS :1.5411671990698035

Confusion Matrix : 
[[394   1  11]
 [457   4   8]
 [210   5  17]]
F-Measure : 0.23066755566814415

-=-=-=-=-=-=-=-=-=-=-=-=-=-=-=-- Test iteration 220 on DEV -- LR :7.226666666666618e-05 C-LOSS : 1.0504506826400757 AVG-LOSS :1.538946762343877

Confusion Matrix : 
[[395   1  10]
 [458   3   8]
 [212   5  15]]
F-Measure : 0.22601023345131308

-=-=-=-=-=-=-=-=-=-=-=-=-=-=-=-- Test iteration 221 on DEV -- LR :5.920000000000014e-05 C-LOSS : 1.0132843255996704 AVG-LOSS :1.5365789135297139

Confusion Matrix : 
[[395   1  10]
 [458   3   8]
 [212   5  15]]
F-Measure : 0.22601023345131308

-=-=-=-=-=-=-=-=-=-=-=-=-=-=-=-- Test iteration 222 on DEV -- LR :4.6133333333333985e-05 C-LOSS : 1.0367028713226318 AVG-LOSS :1.5343373169278884

Confusion Matrix : 
[[395   1  10]
 [458   3   8]
 [212   5  15]]
F-Measure : 0.22601023345131308

-=-=-=-=-=-=-=-=-=-=-=-=-=-=-=-- Test iteration 223 on DEV -- LR :3.306666666666707e-05 C-LOSS : 1.0404130220413208 AVG-LOSS :1.5321322977542877

Confusion Matrix : 
[[394   2  10]
 [458   3   8]
 [212   5  15]]
F-Measure : 0.22563413299110877

-=-=-=-=-=-=-=-=-=-=-=-=-=-=-=-- Test iteration 224 on DEV -- LR :2.0000000000000052e-05 C-LOSS : 1.0307252407073975 AVG-LOSS :1.5299038219451904

Confusion Matrix : 
[[394   2  10]
 [458   3   8]
 [210   5  17]]
F-Measure : 0.22886397028486616

-=-=-=-=-=-=-=-=-=-=-=-=-=-=-=-- Train epoch 3 --=-=-=-=-=-=-=-=-=-=-=-=-=-


-=-=-=-=-=-=-=-=-=-=-=-=-=-=-=-- Test iteration 225 on DEV -- LR :3.306666666666707e-05 C-LOSS : 3.329348087310791 AVG-LOSS :1.5378659647122948

Confusion Matrix : 
[[396   5   5]
 [447  19   3]
 [208  13  11]]
F-Measure : 0.249548855580753

-=-=-=-=-=-=-=-=-=-=-=-=-=-=-=-- Test iteration 226 on DEV -- LR :4.6133333333333985e-05 C-LOSS : 1.013818621635437 AVG-LOSS :1.535557386108432

Confusion Matrix : 
[[396   5   5]
 [446  20   3]
 [208  13  11]]
F-Measure : 0.25129429773019274

-=-=-=-=-=-=-=-=-=-=-=-=-=-=-=-- Test iteration 227 on DEV -- LR :5.920000000000014e-05 C-LOSS : 0.997726321220398 AVG-LOSS :1.5331984779290986

Confusion Matrix : 
[[395   5   6]
 [446  20   3]
 [208  13  11]]
F-Measure : 0.2508543840862794

-=-=-=-=-=-=-=-=-=-=-=-=-=-=-=-- Test iteration 228 on DEV -- LR :7.226666666666618e-05 C-LOSS : 1.0385507345199585 AVG-LOSS :1.5310384441150848

Confusion Matrix : 
[[392   6   8]
 [446  20   3]
 [209  12  11]]
F-Measure : 0.24946993586847055

-=-=-=-=-=-=-=-=-=-=-=-=-=-=-=-- Test iteration 229 on DEV -- LR :8.53333333333332e-05 C-LOSS : 1.0123088359832764 AVG-LOSS :1.5287830979927726

Confusion Matrix : 
[[392   5   9]
 [446  20   3]
 [208  12  12]]
F-Measure : 0.25116777747807023

-=-=-=-=-=-=-=-=-=-=-=-=-=-=-=-- Test iteration 230 on DEV -- LR :9.840000000000011e-05 C-LOSS : 1.0459976196289062 AVG-LOSS :1.5266931175669551

Confusion Matrix : 
[[394   5   7]
 [447  18   4]
 [209  10  13]]
F-Measure : 0.25015965254401756

-=-=-=-=-=-=-=-=-=-=-=-=-=-=-=-- Test iteration 231 on DEV -- LR :0.00011146666666666714 C-LOSS : 1.0446659326553345 AVG-LOSS :1.5246154141837154

Confusion Matrix : 
[[394   5   7]
 [447  17   5]
 [208  10  14]]
F-Measure : 0.2501250450122831

-=-=-=-=-=-=-=-=-=-=-=-=-=-=-=-- Test iteration 232 on DEV -- LR :0.00012453333333333318 C-LOSS : 1.035074234008789 AVG-LOSS :1.5225143790756683

Confusion Matrix : 
[[394   5   7]
 [448  16   5]
 [209   9  14]]
F-Measure : 0.2482695625092545

-=-=-=-=-=-=-=-=-=-=-=-=-=-=-=-- Test iteration 233 on DEV -- LR :0.0001376000000000002 C-LOSS : 1.0012775659561157 AVG-LOSS :1.5202868713272943

Confusion Matrix : 
[[395   4   7]
 [448  15   6]
 [208   9  15]]
F-Measure : 0.2486145964623337

-=-=-=-=-=-=-=-=-=-=-=-=-=-=-=-- Test iteration 234 on DEV -- LR :0.00015066666666666625 C-LOSS : 1.033777117729187 AVG-LOSS :1.518216617056664

Confusion Matrix : 
[[395   4   7]
 [447  14   7]
 [209   8  16]]
F-Measure : 0.24843125025749624

-=-=-=-=-=-=-=-=-=-=-=-=-=-=-=-- Test iteration 235 on DEV -- LR :0.00016373333333333327 C-LOSS : 1.0359786748886108 AVG-LOSS :1.5161732359457825

Confusion Matrix : 
[[393   4   9]
 [446  13   9]
 [208   8  17]]
F-Measure : 0.2473955241888233

-=-=-=-=-=-=-=-=-=-=-=-=-=-=-=-- Test iteration 236 on DEV -- LR :0.00017680000000000018 C-LOSS : 1.0013011693954468 AVG-LOSS :1.5140007799687767

Confusion Matrix : 
[[389   4  13]
 [443  15  10]
 [205   8  20]]
F-Measure : 0.2538649459823019

-=-=-=-=-=-=-=-=-=-=-=-=-=-=-=-- Test iteration 237 on DEV -- LR :0.0001898666666666672 C-LOSS : 1.0216078758239746 AVG-LOSS :1.5119319022202693

Confusion Matrix : 
[[391   4  11]
 [446  12  10]
 [207   7  19]]
F-Measure : 0.24775790260134467

-=-=-=-=-=-=-=-=-=-=-=-=-=-=-=-- Test iteration 238 on DEV -- LR :0.00020293333333333324 C-LOSS : 1.0079352855682373 AVG-LOSS :1.5098231297656581

Confusion Matrix : 
[[391   4  11]
 [446  12  10]
 [207   7  19]]
F-Measure : 0.24775790260134467

-=-=-=-=-=-=-=-=-=-=-=-=-=-=-=-- Test iteration 239 on DEV -- LR :0.00021600000000000026 C-LOSS : 1.012549638748169 AVG-LOSS :1.5077511568864186

Confusion Matrix : 
[[393   4   9]
 [448  11   9]
 [208   9  16]]
F-Measure : 0.24225441214223817

-=-=-=-=-=-=-=-=-=-=-=-=-=-=-=-- Test iteration 240 on DEV -- LR :0.0002290666666666663 C-LOSS : 0.9937990307807922 AVG-LOSS :1.5056185754502958

Confusion Matrix : 
[[396   4   6]
 [449  10   9]
 [212   8  13]]
F-Measure : 0.23676806004506393

-=-=-=-=-=-=-=-=-=-=-=-=-=-=-=-- Test iteration 241 on DEV -- LR :0.00024213333333333333 C-LOSS : 1.0215965509414673 AVG-LOSS :1.5036184844399287

Confusion Matrix : 
[[396   4   6]
 [449  10   9]
 [212   8  13]]
F-Measure : 0.23676806004506393

-=-=-=-=-=-=-=-=-=-=-=-=-=-=-=-- Test iteration 242 on DEV -- LR :0.00025520000000000024 C-LOSS : 1.0364127159118652 AVG-LOSS :1.5016958269562741

Confusion Matrix : 
[[397   4   5]
 [450   9   9]
 [212   8  13]]
F-Measure : 0.23538453466292378

-=-=-=-=-=-=-=-=-=-=-=-=-=-=-=-- Test iteration 243 on DEV -- LR :0.00026826666666666726 C-LOSS : 1.0228159427642822 AVG-LOSS :1.4997332044800773

Confusion Matrix : 
[[399   3   4]
 [451   9   8]
 [215   6  12]]
F-Measure : 0.23427484927692854

-=-=-=-=-=-=-=-=-=-=-=-=-=-=-=-- Test iteration 244 on DEV -- LR :0.0002813333333333333 C-LOSS : 1.0395829677581787 AVG-LOSS :1.4978550402485595

Confusion Matrix : 
[[400   2   4]
 [453   8   7]
 [218   4  11]]
F-Measure : 0.23084231595663907

-=-=-=-=-=-=-=-=-=-=-=-=-=-=-=-- Test iteration 245 on DEV -- LR :0.00029439999999999946 C-LOSS : 1.0358238220214844 AVG-LOSS :1.4959768645647096

Confusion Matrix : 
[[400   2   4]
 [455   6   7]
 [219   3  11]]
F-Measure : 0.22699715097654774

-=-=-=-=-=-=-=-=-=-=-=-=-=-=-=-- Test iteration 246 on DEV -- LR :0.00030746666666666637 C-LOSS : 0.9622044563293457 AVG-LOSS :1.4938158426690198

Confusion Matrix : 
[[401   2   3]
 [455   5   8]
 [219   3  11]]
F-Measure : 0.22561184292552725

-=-=-=-=-=-=-=-=-=-=-=-=-=-=-=-- Test iteration 247 on DEV -- LR :0.0003205333333333334 C-LOSS : 1.0218350887298584 AVG-LOSS :1.4919126944676522

Confusion Matrix : 
[[399   3   4]
 [453   8   7]
 [218   4  11]]
F-Measure : 0.23045088655377258

-=-=-=-=-=-=-=-=-=-=-=-=-=-=-=-- Test iteration 248 on DEV -- LR :0.0003336000000000003 C-LOSS : 1.016223669052124 AVG-LOSS :1.4900022967752204

Confusion Matrix : 
[[397   4   5]
 [451   8   9]
 [212   6  15]]
F-Measure : 0.23665798077229222

-=-=-=-=-=-=-=-=-=-=-=-=-=-=-=-- Test iteration 249 on DEV -- LR :0.0003466666666666673 C-LOSS : 1.0080004930496216 AVG-LOSS :1.488074289560318

Confusion Matrix : 
[[387   6  13]
 [441  17  10]
 [206   9  18]]
F-Measure : 0.2535340006198116

-=-=-=-=-=-=-=-=-=-=-=-=-=-=-=-- Test iteration 250 on DEV -- LR :0.00035973333333333337 C-LOSS : 0.9863986968994141 AVG-LOSS :1.4860755820198364

Confusion Matrix : 
[[380  11  15]
 [429  30   9]
 [202  11  20]]
F-Measure : 0.2758825939889553

-=-=-=-=-=-=-=-=-=-=-=-=-=-=-=-- Test iteration 251 on DEV -- LR :0.0003727999999999995 C-LOSS : 1.0335290431976318 AVG-LOSS :1.4842797624213355

Confusion Matrix : 
[[370  15  21]
 [417  42   9]
 [196  15  22]]
F-Measure : 0.293650791205852

-=-=-=-=-=-=-=-=-=-=-=-=-=-=-=-- Test iteration 252 on DEV -- LR :0.00038586666666666643 C-LOSS : 1.013257622718811 AVG-LOSS :1.4824180148335784

Confusion Matrix : 
[[367  16  23]
 [412  48   8]
 [192  18  23]]
F-Measure : 0.3030240435866388

-=-=-=-=-=-=-=-=-=-=-=-=-=-=-=-- Test iteration 253 on DEV -- LR :0.00039893333333333345 C-LOSS : 1.0745396614074707 AVG-LOSS :1.4808121945444994

Confusion Matrix : 
[[369  17  20]
 [427  32   9]
 [197  13  23]]
F-Measure : 0.2784943141748236

-=-=-=-=-=-=-=-=-=-=-=-=-=-=-=-- Test iteration 254 on DEV -- LR :0.00041200000000000037 C-LOSS : 0.9893971085548401 AVG-LOSS :1.4788850765602262

Confusion Matrix : 
[[384   9  13]
 [438  22   8]
 [204   8  21]]
F-Measure : 0.26553193850100787

-=-=-=-=-=-=-=-=-=-=-=-=-=-=-=-- Test iteration 255 on DEV -- LR :0.0004250666666666674 C-LOSS : 1.023271083831787 AVG-LOSS :1.4771053344011307

Confusion Matrix : 
[[391   7   8]
 [449  11   8]
 [211   7  15]]
F-Measure : 0.23962934441287648

-=-=-=-=-=-=-=-=-=-=-=-=-=-=-=-- Test iteration 256 on DEV -- LR :0.00043813333333333343 C-LOSS : 1.0615403652191162 AVG-LOSS :1.4754883500852474

Confusion Matrix : 
[[391  10   5]
 [443  20   5]
 [213   9  11]]
F-Measure : 0.24897208125077439

-=-=-=-=-=-=-=-=-=-=-=-=-=-=-=-- Test iteration 257 on DEV -- LR :0.0004511999999999996 C-LOSS : 1.0543843507766724 AVG-LOSS :1.4738561640414156

Confusion Matrix : 
[[387  13   6]
 [423  42   3]
 [208  16   9]]
F-Measure : 0.28032628236116824

-=-=-=-=-=-=-=-=-=-=-=-=-=-=-=-- Test iteration 258 on DEV -- LR :0.0004642666666666665 C-LOSS : 1.030907154083252 AVG-LOSS :1.4721459362037395

Confusion Matrix : 
[[375  24   7]
 [407  56   5]
 [207  18   8]]
F-Measure : 0.2941486193402672

-=-=-=-=-=-=-=-=-=-=-=-=-=-=-=-- Test iteration 259 on DEV -- LR :0.0004773333333333335 C-LOSS : 1.0437796115875244 AVG-LOSS :1.4704983734167538

Confusion Matrix : 
[[380  14  12]
 [422  39   7]
 [198  17  18]]
F-Measure : 0.28760381864622203

-=-=-=-=-=-=-=-=-=-=-=-=-=-=-=-- Test iteration 260 on DEV -- LR :0.0004904000000000004 C-LOSS : 1.0198168754577637 AVG-LOSS :1.4687716243824283

Confusion Matrix : 
[[366  15  25]
 [421  37  10]
 [193  14  26]]
F-Measure : 0.2895113454040231

-=-=-=-=-=-=-=-=-=-=-=-=-=-=-=-- Test iteration 261 on DEV -- LR :0.0005034666666666666 C-LOSS : 0.9989462494850159 AVG-LOSS :1.4669783977606825

Confusion Matrix : 
[[363  11  32]
 [426  26  16]
 [194   9  30]]
F-Measure : 0.2750726426406671

-=-=-=-=-=-=-=-=-=-=-=-=-=-=-=-- Test iteration 262 on DEV -- LR :0.0005165333333333336 C-LOSS : 0.9957046508789062 AVG-LOSS :1.4651864823732992

Confusion Matrix : 
[[364   7  35]
 [433  19  16]
 [195   7  31]]
F-Measure : 0.26447999541271455

-=-=-=-=-=-=-=-=-=-=-=-=-=-=-=-- Test iteration 263 on DEV -- LR :0.0005295999999999996 C-LOSS : 0.9899770021438599 AVG-LOSS :1.4633864464633393

Confusion Matrix : 
[[374   5  27]
 [442  11  15]
 [199   6  28]]
F-Measure : 0.25093878670539477

-=-=-=-=-=-=-=-=-=-=-=-=-=-=-=-- Test iteration 264 on DEV -- LR :0.0005426666666666666 C-LOSS : 1.057407259941101 AVG-LOSS :1.4618544495330668

Confusion Matrix : 
[[383   5  18]
 [448  10  10]
 [202   5  26]]
F-Measure : 0.2506918547362554

-=-=-=-=-=-=-=-=-=-=-=-=-=-=-=-- Test iteration 265 on DEV -- LR :0.0005557333333333336 C-LOSS : 1.0069307088851929 AVG-LOSS :1.460144209906571

Confusion Matrix : 
[[394   6   6]
 [449  11   8]
 [208   9  16]]
F-Measure : 0.2427930207484928

-=-=-=-=-=-=-=-=-=-=-=-=-=-=-=-- Test iteration 266 on DEV -- LR :0.0005688000000000006 C-LOSS : 1.066511631011963 AVG-LOSS :1.4586699305848683

Confusion Matrix : 
[[393   9   4]
 [446  19   3]
 [214  12   7]]
F-Measure : 0.24113528849134527

-=-=-=-=-=-=-=-=-=-=-=-=-=-=-=-- Test iteration 267 on DEV -- LR :0.0005818666666666666 C-LOSS : 0.9961704015731812 AVG-LOSS :1.4569441860736305

Confusion Matrix : 
[[394  10   2]
 [437  29   2]
 [211  17   5]]
F-Measure : 0.2550807382767177

-=-=-=-=-=-=-=-=-=-=-=-=-=-=-=-- Test iteration 268 on DEV -- LR :0.0005949333333333327 C-LOSS : 1.0127999782562256 AVG-LOSS :1.4552930923642722

Confusion Matrix : 
[[393  11   2]
 [432  34   2]
 [209  19   5]]
F-Measure : 0.26292319907774847

-=-=-=-=-=-=-=-=-=-=-=-=-=-=-=-- Test iteration 269 on DEV -- LR :0.0006079999999999997 C-LOSS : 1.0065430402755737 AVG-LOSS :1.4536310551343141

Confusion Matrix : 
[[393  11   2]
 [439  27   2]
 [210  16   7]]
F-Measure : 0.25489306545891344

-=-=-=-=-=-=-=-=-=-=-=-=-=-=-=-- Test iteration 270 on DEV -- LR :0.0006210666666666667 C-LOSS : 1.0129518508911133 AVG-LOSS :1.4520049326094313

Confusion Matrix : 
[[396   9   1]
 [448  18   2]
 [213  14   6]]
F-Measure : 0.2388829170335404

-=-=-=-=-=-=-=-=-=-=-=-=-=-=-=-- Test iteration 271 on DEV -- LR :0.0006341333333333336 C-LOSS : 0.965596079826355 AVG-LOSS :1.4502166647683172

Confusion Matrix : 
[[396   8   2]
 [451  14   3]
 [212  11  10]]
F-Measure : 0.23887572809270233

-=-=-=-=-=-=-=-=-=-=-=-=-=-=-=-- Test iteration 272 on DEV -- LR :0.0006472000000000006 C-LOSS : 1.0129932165145874 AVG-LOSS :1.4486151136758127

Confusion Matrix : 
[[380   8  18]
 [427  19  22]
 [205   9  19]]
F-Measure : 0.2558354912317166

-=-=-=-=-=-=-=-=-=-=-=-=-=-=-=-- Test iteration 273 on DEV -- LR :0.0006602666666666667 C-LOSS : 1.0238063335418701 AVG-LOSS :1.4470647166680246

Confusion Matrix : 
[[336  10  60]
 [389  23  56]
 [171  13  49]]
F-Measure : 0.2789552979907379

-=-=-=-=-=-=-=-=-=-=-=-=-=-=-=-- Test iteration 274 on DEV -- LR :0.0006733333333333329 C-LOSS : 1.1028081178665161 AVG-LOSS :1.4458128744905645

Confusion Matrix : 
[[348  13  45]
 [394  29  45]
 [177  20  36]]
F-Measure : 0.28112900181926614

-=-=-=-=-=-=-=-=-=-=-=-=-=-=-=-- Test iteration 275 on DEV -- LR :0.0006863999999999998 C-LOSS : 1.0354925394058228 AVG-LOSS :1.4443262066098228

Confusion Matrix : 
[[383  15   8]
 [426  31  11]
 [206  16  11]]
F-Measure : 0.26476495660798693

-=-=-=-=-=-=-=-=-=-=-=-=-=-=-=-- Test iteration 276 on DEV -- LR :0.0006994666666666667 C-LOSS : 1.0794038772583008 AVG-LOSS :1.4430087974785897

Confusion Matrix : 
[[384  22   0]
 [423  43   2]
 [205  23   5]]
F-Measure : 0.2728000264788303

-=-=-=-=-=-=-=-=-=-=-=-=-=-=-=-- Test iteration 277 on DEV -- LR :0.0007125333333333337 C-LOSS : 0.9612306356430054 AVG-LOSS :1.441275782507958

Confusion Matrix : 
[[384  22   0]
 [430  37   1]
 [207  22   4]]
F-Measure : 0.2614452181918983

-=-=-=-=-=-=-=-=-=-=-=-=-=-=-=-- Test iteration 278 on DEV -- LR :0.0007256000000000007 C-LOSS : 1.0799121856689453 AVG-LOSS :1.4399805724834456

Confusion Matrix : 
[[388  18   0]
 [431  36   1]
 [211  18   4]]
F-Measure : 0.2616352858752639

-=-=-=-=-=-=-=-=-=-=-=-=-=-=-=-- Test iteration 279 on DEV -- LR :0.0007386666666666668 C-LOSS : 1.0082062482833862 AVG-LOSS :1.4384385213255881

Confusion Matrix : 
[[383  16   7]
 [419  38  11]
 [200  20  13]]
F-Measure : 0.27953787429288435

-=-=-=-=-=-=-=-=-=-=-=-=-=-=-=-- Test iteration 280 on DEV -- LR :0.0007517333333333328 C-LOSS : 1.0280241966247559 AVG-LOSS :1.4369779721273646

Confusion Matrix : 
[[357  13  36]
 [403  38  27]
 [184  20  29]]
F-Measure : 0.29114660851401075

-=-=-=-=-=-=-=-=-=-=-=-=-=-=-=-- Test iteration 281 on DEV -- LR :0.0007647999999999998 C-LOSS : 1.0421541929244995 AVG-LOSS :1.4355778878039502

Confusion Matrix : 
[[361  14  31]
 [408  42  18]
 [185  21  27]]
F-Measure : 0.29664750857073396

-=-=-=-=-=-=-=-=-=-=-=-=-=-=-=-- Test iteration 282 on DEV -- LR :0.0007778666666666669 C-LOSS : 1.032108187675476 AVG-LOSS :1.4341521998176305

Confusion Matrix : 
[[368  23  15]
 [402  59   7]
 [190  26  17]]
F-Measure : 0.3105262531395446

-=-=-=-=-=-=-=-=-=-=-=-=-=-=-=-- Test iteration 283 on DEV -- LR :0.0007909333333333338 C-LOSS : 1.0195618867874146 AVG-LOSS :1.4326923747717495

Confusion Matrix : 
[[369  33   4]
 [385  81   2]
 [199  27   7]]
F-Measure : 0.3236039698564746

-=-=-=-=-=-=-=-=-=-=-=-=-=-=-=-- Test iteration 284 on DEV -- LR :0.0008039999999999998 C-LOSS : 1.0268903970718384 AVG-LOSS :1.4312685081833287

Confusion Matrix : 
[[375  27   4]
 [404  62   2]
 [200  24   9]]
F-Measure : 0.30411006901854704

-=-=-=-=-=-=-=-=-=-=-=-=-=-=-=-- Test iteration 285 on DEV -- LR :0.0008170666666666668 C-LOSS : 0.9784854054450989 AVG-LOSS :1.4296853504814468

Confusion Matrix : 
[[386  14   6]
 [428  34   6]
 [203  15  15]]
F-Measure : 0.2773967825751012

-=-=-=-=-=-=-=-=-=-=-=-=-=-=-=-- Test iteration 286 on DEV -- LR :0.000830133333333333 C-LOSS : 0.950771152973175 AVG-LOSS :1.4280166598977944

Confusion Matrix : 
[[381   6  19]
 [434  22  12]
 [201   9  23]]
F-Measure : 0.26710240902759996

-=-=-=-=-=-=-=-=-=-=-=-=-=-=-=-- Test iteration 287 on DEV -- LR :0.0008431999999999999 C-LOSS : 1.0859423875808716 AVG-LOSS :1.4268289020078049

Confusion Matrix : 
[[359   9  38]
 [417  30  21]
 [186  10  37]]
F-Measure : 0.2888990825076065

-=-=-=-=-=-=-=-=-=-=-=-=-=-=-=-- Test iteration 288 on DEV -- LR :0.0008562666666666668 C-LOSS : 0.9951708912849426 AVG-LOSS :1.425335275673124

Confusion Matrix : 
[[346  19  41]
 [384  61  23]
 [180  15  38]]
F-Measure : 0.33221582434178176

-=-=-=-=-=-=-=-=-=-=-=-=-=-=-=-- Test iteration 289 on DEV -- LR :0.0008693333333333338 C-LOSS : 0.9283004403114319 AVG-LOSS :1.4236213624477387

Confusion Matrix : 
[[308  62  36]
 [311 142  15]
 [159  48  26]]
F-Measure : 0.39287588138886326
> Save best model exp/pytorch_resnet_block256_ecapatdnn_good/tdnn_sentiment/finalf10/finalf10_tdnn_sentiment_pid-2815.mat

-=-=-=-=-=-=-=-=-=-=-=-=-=-=-=-- Test iteration 290 on DEV -- LR :0.0008823999999999999 C-LOSS : 0.9975923299789429 AVG-LOSS :1.4221573451540315

Confusion Matrix : 
[[257 126  23]
 [204 253  11]
 [118  94  21]]
F-Measure : 0.44940991964019605
> Save best model exp/pytorch_resnet_block256_ecapatdnn_good/tdnn_sentiment/finalf10/finalf10_tdnn_sentiment_pid-2815.mat

-=-=-=-=-=-=-=-=-=-=-=-=-=-=-=-- Test iteration 291 on DEV -- LR :0.0008954666666666669 C-LOSS : 1.0976088047027588 AVG-LOSS :1.4210458775497463

Confusion Matrix : 
[[299  83  24]
 [267 188  13]
 [141  69  23]]
F-Measure : 0.42682994379029177

-=-=-=-=-=-=-=-=-=-=-=-=-=-=-=-- Test iteration 292 on DEV -- LR :0.0009085333333333329 C-LOSS : 0.9741871356964111 AVG-LOSS :1.4195207623898374

Confusion Matrix : 
[[393   9   4]
 [425  35   8]
 [205  12  16]]
F-Measure : 0.28401114680774464

-=-=-=-=-=-=-=-=-=-=-=-=-=-=-=-- Test iteration 293 on DEV -- LR :0.0009216 C-LOSS : 1.1185723543167114 AVG-LOSS :1.4184971283487722

Confusion Matrix : 
[[402   1   3]
 [459   5   4]
 [222   4   7]]
F-Measure : 0.2188084125914514

-=-=-=-=-=-=-=-=-=-=-=-=-=-=-=-- Test iteration 294 on DEV -- LR :0.000934666666666667 C-LOSS : 1.0167895555496216 AVG-LOSS :1.4171354077630123

Confusion Matrix : 
[[381   4  21]
 [432  16  20]
 [196   7  30]]
F-Measure : 0.26637655229466783

-=-=-=-=-=-=-=-=-=-=-=-=-=-=-=-- Test iteration 295 on DEV -- LR :0.0009477333333333339 C-LOSS : 1.0333731174468994 AVG-LOSS :1.4158389135389715

Confusion Matrix : 
[[290  31  85]
 [320  73  75]
 [134  26  73]]
F-Measure : 0.3541337732217902

-=-=-=-=-=-=-=-=-=-=-=-=-=-=-=-- Test iteration 296 on DEV -- LR :0.0009607999999999999 C-LOSS : 1.1947189569473267 AVG-LOSS :1.4150944019006158

Confusion Matrix : 
[[246  70  90]
 [269 128  71]
 [108  53  72]]
F-Measure : 0.3909249155598858

-=-=-=-=-=-=-=-=-=-=-=-=-=-=-=-- Test iteration 297 on DEV -- LR :0.0009738666666666661 C-LOSS : 1.066231369972229 AVG-LOSS :1.4139237205854198

Confusion Matrix : 
[[321  76   9]
 [311 151   6]
 [145  75  13]]
F-Measure : 0.38581331135441826

-=-=-=-=-=-=-=-=-=-=-=-=-=-=-=-- Test iteration 298 on DEV -- LR :0.0009869333333333331 C-LOSS : 1.1506532430648804 AVG-LOSS :1.4130432173161203

Confusion Matrix : 
[[361  42   3]
 [386  81   1]
 [192  38   3]]
F-Measure : 0.3110218506549303

-=-=-=-=-=-=-=-=-=-=-=-=-=-=-=-- Test iteration 299 on DEV -- LR :0.001 C-LOSS : 0.9852944612503052 AVG-LOSS :1.4116173881292342

Confusion Matrix : 
[[393  11   2]
 [450  16   2]
 [217  12   4]]
F-Measure : 0.23030798269481023

-=-=-=-=-=-=-=-=-=-=-=-=-=-=-=-- Train epoch 4 --=-=-=-=-=-=-=-=-=-=-=-=-=-


-=-=-=-=-=-=-=-=-=-=-=-=-=-=-=-- Test iteration 300 on DEV -- LR :0.0009869333333333331 C-LOSS : 1.387376070022583 AVG-LOSS :1.4115368521886806

Confusion Matrix : 
[[392   2  12]
 [443  14  11]
 [207   8  18]]
F-Measure : 0.2502895116960111

-=-=-=-=-=-=-=-=-=-=-=-=-=-=-=-- Test iteration 301 on DEV -- LR :0.000973866666666667 C-LOSS : 1.0345978736877441 AVG-LOSS :1.4102887098757637

Confusion Matrix : 
[[393   2  11]
 [453   9   6]
 [219   1  13]]
F-Measure : 0.23263085623655771

-=-=-=-=-=-=-=-=-=-=-=-=-=-=-=-- Test iteration 302 on DEV -- LR :0.0009607999999999999 C-LOSS : 1.0038915872573853 AVG-LOSS :1.40894746524666

Confusion Matrix : 
[[384  10  12]
 [426  28  14]
 [205   7  21]]
F-Measure : 0.275940642029645

-=-=-=-=-=-=-=-=-=-=-=-=-=-=-=-- Test iteration 303 on DEV -- LR :0.000947733333333333 C-LOSS : 1.0639787912368774 AVG-LOSS :1.4078126998716278

Confusion Matrix : 
[[368  25  13]
 [373  84  11]
 [181  27  25]]
F-Measure : 0.35817189734491717

-=-=-=-=-=-=-=-=-=-=-=-=-=-=-=-- Test iteration 304 on DEV -- LR :0.000934666666666667 C-LOSS : 1.0777666568756104 AVG-LOSS :1.4067305816978706

Confusion Matrix : 
[[378  16  12]
 [402  61   5]
 [204  15  14]]
F-Measure : 0.31389930465791727

-=-=-=-=-=-=-=-=-=-=-=-=-=-=-=-- Test iteration 305 on DEV -- LR :0.0009216 C-LOSS : 0.9860944747924805 AVG-LOSS :1.405355953897526

Confusion Matrix : 
[[402   3   1]
 [463   4   1]
 [227   1   5]]
F-Measure : 0.21271944138021273

-=-=-=-=-=-=-=-=-=-=-=-=-=-=-=-- Test iteration 306 on DEV -- LR :0.0009085333333333329 C-LOSS : 1.1468254327774048 AVG-LOSS :1.4045138349362227

Confusion Matrix : 
[[405   0   1]
 [465   2   1]
 [229   0   4]]
F-Measure : 0.20803411906982594

-=-=-=-=-=-=-=-=-=-=-=-=-=-=-=-- Test iteration 307 on DEV -- LR :0.0008954666666666669 C-LOSS : 1.0998138189315796 AVG-LOSS :1.403524549169974

Confusion Matrix : 
[[387   2  17]
 [443   6  19]
 [221   1  11]]
F-Measure : 0.2220049862703147

-=-=-=-=-=-=-=-=-=-=-=-=-=-=-=-- Test iteration 308 on DEV -- LR :0.0008823999999999999 C-LOSS : 0.9991222620010376 AVG-LOSS :1.402215803904055

Confusion Matrix : 
[[390   3  13]
 [454   4  10]
 [224   1   8]]
F-Measure : 0.21393922343978375

-=-=-=-=-=-=-=-=-=-=-=-=-=-=-=-- Test iteration 309 on DEV -- LR :0.000869333333333333 C-LOSS : 1.02040433883667 AVG-LOSS :1.400984154016741

Confusion Matrix : 
[[398   3   5]
 [460   4   4]
 [227   1   5]]
F-Measure : 0.2114272071436083

-=-=-=-=-=-=-=-=-=-=-=-=-=-=-=-- Test iteration 310 on DEV -- LR :0.0008562666666666668 C-LOSS : 1.0075839757919312 AVG-LOSS :1.399719201675182

Confusion Matrix : 
[[400   4   2]
 [460   7   1]
 [230   1   2]]
F-Measure : 0.21199482010098936

-=-=-=-=-=-=-=-=-=-=-=-=-=-=-=-- Test iteration 311 on DEV -- LR :0.0008431999999999999 C-LOSS : 1.0490882396697998 AVG-LOSS :1.3985953844892673

Confusion Matrix : 
[[393  11   2]
 [450  17   1]
 [228   4   1]]
F-Measure : 0.22569748578469112

-=-=-=-=-=-=-=-=-=-=-=-=-=-=-=-- Test iteration 312 on DEV -- LR :0.0008301333333333339 C-LOSS : 1.0406454801559448 AVG-LOSS :1.3974517745712696

Confusion Matrix : 
[[398   5   3]
 [458   9   1]
 [229   1   3]]
F-Measure : 0.21681767614972

-=-=-=-=-=-=-=-=-=-=-=-=-=-=-=-- Test iteration 313 on DEV -- LR :0.0008170666666666668 C-LOSS : 1.0716822147369385 AVG-LOSS :1.3964142918966378

Confusion Matrix : 
[[388  13   5]
 [439  27   2]
 [225   5   3]]
F-Measure : 0.24489976134569902

-=-=-=-=-=-=-=-=-=-=-=-=-=-=-=-- Test iteration 314 on DEV -- LR :0.0008039999999999998 C-LOSS : 0.9968094825744629 AVG-LOSS :1.395145705200377

Confusion Matrix : 
[[381  22   3]
 [421  45   2]
 [222   9   2]]
F-Measure : 0.26888334224536997

-=-=-=-=-=-=-=-=-=-=-=-=-=-=-=-- Test iteration 315 on DEV -- LR :0.0007909333333333338 C-LOSS : 1.0084844827651978 AVG-LOSS :1.3939220937369745

Confusion Matrix : 
[[360  44   2]
 [354 113   1]
 [206  25   2]]
F-Measure : 0.349673401151163

-=-=-=-=-=-=-=-=-=-=-=-=-=-=-=-- Test iteration 316 on DEV -- LR :0.0007778666666666669 C-LOSS : 1.0734997987747192 AVG-LOSS :1.3929112978538127

Confusion Matrix : 
[[373  30   3]
 [409  59   0]
 [220  11   2]]
F-Measure : 0.2856839331109089

-=-=-=-=-=-=-=-=-=-=-=-=-=-=-=-- Test iteration 317 on DEV -- LR :0.0007647999999999998 C-LOSS : 1.0707584619522095 AVG-LOSS :1.3918982386214178

Confusion Matrix : 
[[391  10   5]
 [446  18   4]
 [222   4   7]]
F-Measure : 0.23804380338177694

-=-=-=-=-=-=-=-=-=-=-=-=-=-=-=-- Test iteration 318 on DEV -- LR :0.0007517333333333337 C-LOSS : 1.0377010107040405 AVG-LOSS :1.3907879024837457

Confusion Matrix : 
[[384  11  11]
 [427  28  13]
 [213   9  11]]
F-Measure : 0.26013108924445605

-=-=-=-=-=-=-=-=-=-=-=-=-=-=-=-- Test iteration 319 on DEV -- LR :0.0007386666666666668 C-LOSS : 1.026419997215271 AVG-LOSS :1.389649252779782

Confusion Matrix : 
[[354  27  25]
 [382  60  26]
 [189  22  22]]
F-Measure : 0.3132775315209957

-=-=-=-=-=-=-=-=-=-=-=-=-=-=-=-- Test iteration 320 on DEV -- LR :0.0007255999999999999 C-LOSS : 1.039267659187317 AVG-LOSS :1.3885577213355684

Confusion Matrix : 
[[351  35  20]
 [364  74  30]
 [185  27  21]]
F-Measure : 0.3298094471407266

-=-=-=-=-=-=-=-=-=-=-=-=-=-=-=-- Test iteration 321 on DEV -- LR :0.0007125333333333337 C-LOSS : 1.0064746141433716 AVG-LOSS :1.3873711278349716

Confusion Matrix : 
[[371  19  16]
 [401  49  18]
 [198  16  19]]
F-Measure : 0.30079325927250666

-=-=-=-=-=-=-=-=-=-=-=-=-=-=-=-- Test iteration 322 on DEV -- LR :0.0006994666666666667 C-LOSS : 1.0558443069458008 AVG-LOSS :1.3863447290086894

Confusion Matrix : 
[[394   7   5]
 [424  25  19]
 [209   6  18]]
F-Measure : 0.2710066659574955

-=-=-=-=-=-=-=-=-=-=-=-=-=-=-=-- Test iteration 323 on DEV -- LR :0.0006863999999999998 C-LOSS : 0.973762035369873 AVG-LOSS :1.385071325633261

Confusion Matrix : 
[[396   6   4]
 [432  20  16]
 [211   5  17]]
F-Measure : 0.26141202027190547

-=-=-=-=-=-=-=-=-=-=-=-=-=-=-=-- Test iteration 324 on DEV -- LR :0.0006733333333333337 C-LOSS : 1.0620914697647095 AVG-LOSS :1.3840775414613578

Confusion Matrix : 
[[394   6   6]
 [423  25  20]
 [206   6  21]]
F-Measure : 0.2756721489907728

-=-=-=-=-=-=-=-=-=-=-=-=-=-=-=-- Test iteration 325 on DEV -- LR :0.0006602666666666667 C-LOSS : 1.0331394672393799 AVG-LOSS :1.3830010443011675

Confusion Matrix : 
[[361  14  31]
 [390  39  39]
 [190  10  33]]
F-Measure : 0.30002893508496575

-=-=-=-=-=-=-=-=-=-=-=-=-=-=-=-- Test iteration 326 on DEV -- LR :0.0006471999999999997 C-LOSS : 1.0598185062408447 AVG-LOSS :1.3820127184967017

Confusion Matrix : 
[[337  24  45]
 [352  62  54]
 [172  19  42]]
F-Measure : 0.33386353953533876

-=-=-=-=-=-=-=-=-=-=-=-=-=-=-=-- Test iteration 327 on DEV -- LR :0.0006341333333333336 C-LOSS : 0.9444389343261719 AVG-LOSS :1.3806786520815477

Confusion Matrix : 
[[345  29  32]
 [369  66  33]
 [177  26  30]]
F-Measure : 0.3283609316994174

-=-=-=-=-=-=-=-=-=-=-=-=-=-=-=-- Test iteration 328 on DEV -- LR :0.0006210666666666667 C-LOSS : 1.009108543395996 AVG-LOSS :1.379549259653932

Confusion Matrix : 
[[362  25  19]
 [390  58  20]
 [188  20  25]]
F-Measure : 0.3185946285487962

-=-=-=-=-=-=-=-=-=-=-=-=-=-=-=-- Test iteration 329 on DEV -- LR :0.0006079999999999997 C-LOSS : 1.0123919248580933 AVG-LOSS :1.3784366616697021

Confusion Matrix : 
[[386  12   8]
 [417  37  14]
 [204   9  20]]
F-Measure : 0.2904710513967543

-=-=-=-=-=-=-=-=-=-=-=-=-=-=-=-- Test iteration 330 on DEV -- LR :0.0005949333333333336 C-LOSS : 0.9865873456001282 AVG-LOSS :1.3772528268779514

Confusion Matrix : 
[[383  15   8]
 [418  40  10]
 [204  13  16]]
F-Measure : 0.2874291427474153

-=-=-=-=-=-=-=-=-=-=-=-=-=-=-=-- Test iteration 331 on DEV -- LR :0.0005818666666666666 C-LOSS : 1.0284465551376343 AVG-LOSS :1.3762022055775287

Confusion Matrix : 
[[371  28   7]
 [409  51   8]
 [196  23  14]]
F-Measure : 0.29505940889231846

-=-=-=-=-=-=-=-=-=-=-=-=-=-=-=-- Test iteration 332 on DEV -- LR :0.0005687999999999997 C-LOSS : 1.0637749433517456 AVG-LOSS :1.3752639855708446

Confusion Matrix : 
[[347  45  14]
 [381  79   8]
 [183  35  15]]
F-Measure : 0.32318492767497564

-=-=-=-=-=-=-=-=-=-=-=-=-=-=-=-- Test iteration 333 on DEV -- LR :0.0005557333333333336 C-LOSS : 1.0238666534423828 AVG-LOSS :1.3742118977501008

Confusion Matrix : 
[[312  76  18]
 [302 153  13]
 [151  62  20]]
F-Measure : 0.3955240862325191

-=-=-=-=-=-=-=-=-=-=-=-=-=-=-=-- Test iteration 334 on DEV -- LR :0.0005426666666666666 C-LOSS : 1.021982192993164 AVG-LOSS :1.3731604657956025

Confusion Matrix : 
[[307  76  23]
 [310 135  23]
 [148  59  26]]
F-Measure : 0.38285944028448343

-=-=-=-=-=-=-=-=-=-=-=-=-=-=-=-- Test iteration 335 on DEV -- LR :0.0005295999999999996 C-LOSS : 0.9884247779846191 AVG-LOSS :1.3720154191056888

Confusion Matrix : 
[[325  61  20]
 [344 107  17]
 [161  46  26]]
F-Measure : 0.3625060516494777

-=-=-=-=-=-=-=-=-=-=-=-=-=-=-=-- Test iteration 336 on DEV -- LR :0.0005165333333333336 C-LOSS : 0.9668111801147461 AVG-LOSS :1.3708130326398402

Confusion Matrix : 
[[348  37  21]
 [382  72  14]
 [187  24  22]]
F-Measure : 0.326171758993765

-=-=-=-=-=-=-=-=-=-=-=-=-=-=-=-- Test iteration 337 on DEV -- LR :0.0005034666666666666 C-LOSS : 0.9992061257362366 AVG-LOSS :1.3697136039211906

Confusion Matrix : 
[[357  34  15]
 [393  66   9]
 [192  20  21]]
F-Measure : 0.3209667037791544

-=-=-=-=-=-=-=-=-=-=-=-=-=-=-=-- Test iteration 338 on DEV -- LR :0.0004904000000000004 C-LOSS : 1.0192890167236328 AVG-LOSS :1.368679903074

Confusion Matrix : 
[[351  40  15]
 [377  80  11]
 [182  32  19]]
F-Measure : 0.333511817973625

-=-=-=-=-=-=-=-=-=-=-=-=-=-=-=-- Test iteration 339 on DEV -- LR :0.0004773333333333335 C-LOSS : 1.0589215755462646 AVG-LOSS :1.3677688491695068

Confusion Matrix : 
[[336  53  17]
 [353 108   7]
 [172  41  20]]
F-Measure : 0.36121123568307656

-=-=-=-=-=-=-=-=-=-=-=-=-=-=-=-- Test iteration 340 on DEV -- LR :0.0004642666666666665 C-LOSS : 0.9973126649856567 AVG-LOSS :1.3666824673977065

Confusion Matrix : 
[[338  48  20]
 [364  89  15]
 [176  34  23]]
F-Measure : 0.3441270019147

-=-=-=-=-=-=-=-=-=-=-=-=-=-=-=-- Test iteration 341 on DEV -- LR :0.00045120000000000045 C-LOSS : 1.0276542901992798 AVG-LOSS :1.365691156938062

Confusion Matrix : 
[[346  38  22]
 [377  73  18]
 [184  25  24]]
F-Measure : 0.32950275070681584

-=-=-=-=-=-=-=-=-=-=-=-=-=-=-=-- Test iteration 342 on DEV -- LR :0.00043813333333333343 C-LOSS : 1.002450942993164 AVG-LOSS :1.3646321475679604

Confusion Matrix : 
[[343  34  29]
 [367  73  28]
 [179  22  32]]
F-Measure : 0.3395059535528583

-=-=-=-=-=-=-=-=-=-=-=-=-=-=-=-- Test iteration 343 on DEV -- LR :0.0004250666666666665 C-LOSS : 1.0147240161895752 AVG-LOSS :1.3636149727674418

Confusion Matrix : 
[[344  29  33]
 [371  59  38]
 [174  18  41]]
F-Measure : 0.3317850647476733

-=-=-=-=-=-=-=-=-=-=-=-=-=-=-=-- Test iteration 344 on DEV -- LR :0.00041200000000000037 C-LOSS : 0.9584835767745972 AVG-LOSS :1.3624406788660133

Confusion Matrix : 
[[340  22  44]
 [372  55  41]
 [172  14  47]]
F-Measure : 0.33072629321033215

-=-=-=-=-=-=-=-=-=-=-=-=-=-=-=-- Test iteration 345 on DEV -- LR :0.00039893333333333345 C-LOSS : 1.0157212018966675 AVG-LOSS :1.361438599452807

Confusion Matrix : 
[[345  18  43]
 [377  49  42]
 [176  12  45]]
F-Measure : 0.32199306096244723

-=-=-=-=-=-=-=-=-=-=-=-=-=-=-=-- Test iteration 346 on DEV -- LR :0.00038586666666666643 C-LOSS : 1.0161781311035156 AVG-LOSS :1.3604436125123192

Confusion Matrix : 
[[359  18  29]
 [391  50  27]
 [187  11  35]]
F-Measure : 0.3188386877473074

-=-=-=-=-=-=-=-=-=-=-=-=-=-=-=-- Test iteration 347 on DEV -- LR :0.0003728000000000004 C-LOSS : 1.0329039096832275 AVG-LOSS :1.3595024064697068

Confusion Matrix : 
[[366  25  15]
 [396  56  16]
 [193  17  23]]
F-Measure : 0.3146483197763016

-=-=-=-=-=-=-=-=-=-=-=-=-=-=-=-- Test iteration 348 on DEV -- LR :0.00035973333333333337 C-LOSS : 1.003377079963684 AVG-LOSS :1.35848199006138

Confusion Matrix : 
[[360  32  14]
 [388  66  14]
 [191  23  19]]
F-Measure : 0.3196409853895883

-=-=-=-=-=-=-=-=-=-=-=-=-=-=-=-- Test iteration 349 on DEV -- LR :0.00034666666666666646 C-LOSS : 1.028563380241394 AVG-LOSS :1.3575393654618944

Confusion Matrix : 
[[348  43  15]
 [367  86  15]
 [180  34  19]]
F-Measure : 0.3398059430411035

-=-=-=-=-=-=-=-=-=-=-=-=-=-=-=-- Test iteration 350 on DEV -- LR :0.0003336000000000003 C-LOSS : 0.9286364316940308 AVG-LOSS :1.356317419781644

Confusion Matrix : 
[[345  46  15]
 [354  97  17]
 [177  36  20]]
F-Measure : 0.35370132001360605

-=-=-=-=-=-=-=-=-=-=-=-=-=-=-=-- Test iteration 351 on DEV -- LR :0.0003205333333333334 C-LOSS : 0.992872953414917 AVG-LOSS :1.3552849070931023

Confusion Matrix : 
[[342  48  16]
 [355  95  18]
 [173  37  23]]
F-Measure : 0.3539450826994047

-=-=-=-=-=-=-=-=-=-=-=-=-=-=-=-- Test iteration 352 on DEV -- LR :0.00030746666666666637 C-LOSS : 0.9687950015068054 AVG-LOSS :1.3541900348393168

Confusion Matrix : 
[[348  41  17]
 [360  86  22]
 [172  34  27]]
F-Measure : 0.3521114130484603

-=-=-=-=-=-=-=-=-=-=-=-=-=-=-=-- Test iteration 353 on DEV -- LR :0.0002944000000000003 C-LOSS : 0.9879216551780701 AVG-LOSS :1.3531553783995958

Confusion Matrix : 
[[352  35  19]
 [367  75  26]
 [180  24  29]]
F-Measure : 0.3429566954627161

-=-=-=-=-=-=-=-=-=-=-=-=-=-=-=-- Test iteration 354 on DEV -- LR :0.0002813333333333333 C-LOSS : 0.9987413287162781 AVG-LOSS :1.352157028963868

Confusion Matrix : 
[[370  18  18]
 [393  48  27]
 [187  17  29]]
F-Measure : 0.3135699961757473

-=-=-=-=-=-=-=-=-=-=-=-=-=-=-=-- Test iteration 355 on DEV -- LR :0.0002682666666666664 C-LOSS : 0.9295646548271179 AVG-LOSS :1.350969971733147

Confusion Matrix : 
[[377  12  17]
 [400  44  24]
 [192  12  29]]
F-Measure : 0.3108149207996073

-=-=-=-=-=-=-=-=-=-=-=-=-=-=-=-- Test iteration 356 on DEV -- LR :0.00025520000000000024 C-LOSS : 1.0435861349105835 AVG-LOSS :1.3501089525823833

Confusion Matrix : 
[[378  10  18]
 [405  36  27]
 [191  11  31]]
F-Measure : 0.3011301332508524

-=-=-=-=-=-=-=-=-=-=-=-=-=-=-=-- Test iteration 357 on DEV -- LR :0.00024213333333333333 C-LOSS : 0.9609302282333374 AVG-LOSS :1.3490218611735871

Confusion Matrix : 
[[378  11  17]
 [396  43  29]
 [188  14  31]]
F-Measure : 0.31260882862821815

-=-=-=-=-=-=-=-=-=-=-=-=-=-=-=-- Test iteration 358 on DEV -- LR :0.0002290666666666663 C-LOSS : 0.9639272093772888 AVG-LOSS :1.3479491741212297

Confusion Matrix : 
[[364  24  18]
 [383  56  29]
 [186  19  28]]
F-Measure : 0.3211797153439483

-=-=-=-=-=-=-=-=-=-=-=-=-=-=-=-- Test iteration 359 on DEV -- LR :0.00021600000000000026 C-LOSS : 0.9884936213493347 AVG-LOSS :1.3469506864746412

Confusion Matrix : 
[[361  29  16]
 [375  68  25]
 [184  22  27]]
F-Measure : 0.33540634389969515

-=-=-=-=-=-=-=-=-=-=-=-=-=-=-=-- Test iteration 360 on DEV -- LR :0.00020293333333333324 C-LOSS : 1.0419362783432007 AVG-LOSS :1.3461057712166593

Confusion Matrix : 
[[351  38  17]
 [367  81  20]
 [181  28  24]]
F-Measure : 0.34301613830805633

-=-=-=-=-=-=-=-=-=-=-=-=-=-=-=-- Test iteration 361 on DEV -- LR :0.00018986666666666633 C-LOSS : 0.9971486330032349 AVG-LOSS :1.3451418012215945

Confusion Matrix : 
[[345  45  16]
 [364  87  17]
 [176  36  21]]
F-Measure : 0.34248407829385447

-=-=-=-=-=-=-=-=-=-=-=-=-=-=-=-- Test iteration 362 on DEV -- LR :0.00017680000000000018 C-LOSS : 0.9961599707603455 AVG-LOSS :1.3441804187685333

Confusion Matrix : 
[[344  47  15]
 [361  94  13]
 [178  36  19]]
F-Measure : 0.3475447603873832

-=-=-=-=-=-=-=-=-=-=-=-=-=-=-=-- Test iteration 363 on DEV -- LR :0.00016373333333333327 C-LOSS : 0.9517636895179749 AVG-LOSS :1.3431023508310318

Confusion Matrix : 
[[350  44  12]
 [366  89  13]
 [180  34  19]]
F-Measure : 0.34456266520708556

-=-=-=-=-=-=-=-=-=-=-=-=-=-=-=-- Test iteration 364 on DEV -- LR :0.0001506666666666671 C-LOSS : 0.9852796792984009 AVG-LOSS :1.342122014744641

Confusion Matrix : 
[[353  42  11]
 [369  88  11]
 [181  33  19]]
F-Measure : 0.3449167012930773

-=-=-=-=-=-=-=-=-=-=-=-=-=-=-=-- Test iteration 365 on DEV -- LR :0.0001376000000000002 C-LOSS : 0.9525172710418701 AVG-LOSS :1.3410575209093876

Confusion Matrix : 
[[358  37  11]
 [376  79  13]
 [184  30  19]]
F-Measure : 0.3361053206489112

-=-=-=-=-=-=-=-=-=-=-=-=-=-=-=-- Test iteration 366 on DEV -- LR :0.00012453333333333318 C-LOSS : 0.9905102252960205 AVG-LOSS :1.340102351166572

Confusion Matrix : 
[[367  28  11]
 [384  71  13]
 [189  25  19]]
F-Measure : 0.33038497716789883

-=-=-=-=-=-=-=-=-=-=-=-=-=-=-=-- Test iteration 367 on DEV -- LR :0.00011146666666666714 C-LOSS : 0.9681583046913147 AVG-LOSS :1.339091633648976

Confusion Matrix : 
[[367  26  13]
 [388  62  18]
 [191  19  23]]
F-Measure : 0.32401745699169787

-=-=-=-=-=-=-=-=-=-=-=-=-=-=-=-- Test iteration 368 on DEV -- LR :9.840000000000011e-05 C-LOSS : 1.049129605293274 AVG-LOSS :1.3383058286940825

Confusion Matrix : 
[[372  21  13]
 [392  56  20]
 [192  17  24]]
F-Measure : 0.3194328426727998

-=-=-=-=-=-=-=-=-=-=-=-=-=-=-=-- Test iteration 369 on DEV -- LR :8.53333333333332e-05 C-LOSS : 0.9641655683517456 AVG-LOSS :1.3372946388012654

Confusion Matrix : 
[[372  21  13]
 [392  54  22]
 [191  18  24]]
F-Measure : 0.31647724999695026

-=-=-=-=-=-=-=-=-=-=-=-=-=-=-=-- Test iteration 370 on DEV -- LR :7.226666666666705e-05 C-LOSS : 1.0468790531158447 AVG-LOSS :1.336511847465186

Confusion Matrix : 
[[372  21  13]
 [394  52  22]
 [188  19  26]]
F-Measure : 0.31637854780575286

-=-=-=-=-=-=-=-=-=-=-=-=-=-=-=-- Test iteration 371 on DEV -- LR :5.920000000000014e-05 C-LOSS : 0.982793927192688 AVG-LOSS :1.3355609928407977

Confusion Matrix : 
[[369  23  14]
 [387  57  24]
 [186  21  26]]
F-Measure : 0.32234424237359494

-=-=-=-=-=-=-=-=-=-=-=-=-=-=-=-- Test iteration 372 on DEV -- LR :4.613333333333312e-05 C-LOSS : 0.956881046295166 AVG-LOSS :1.3345457651020693

Confusion Matrix : 
[[366  23  17]
 [379  64  25]
 [186  20  27]]
F-Measure : 0.3325436709430312

-=-=-=-=-=-=-=-=-=-=-=-=-=-=-=-- Test iteration 373 on DEV -- LR :3.306666666666707e-05 C-LOSS : 0.9681054949760437 AVG-LOSS :1.3335659782835507

Confusion Matrix : 
[[362  27  17]
 [373  68  27]
 [183  22  28]]
F-Measure : 0.3374818540749752

-=-=-=-=-=-=-=-=-=-=-=-=-=-=-=-- Test iteration 374 on DEV -- LR :2.0000000000000052e-05 C-LOSS : 0.9661409258842468 AVG-LOSS :1.332586178143819

Confusion Matrix : 
[[363  26  17]
 [372  68  28]
 [180  24  29]]
F-Measure : 0.33944429976315754

-=-=-=-=-=-=-=-=-=-=-=-=-=-=-=-- Test Best Model pid-2815 on TEST --=-=-=-=-=-=-=-=-=-=-=-=-=-

> Best Model on DEV pid-2815 loaded
Confusion Matrix : 
[[461 347  24]
 [492 740  24]
 [252 229  40]]
F-Measure : 0.4475900381277217
