22;Y;0;5cae9f60-336b-484c-987f-68548b17ff47;
21;B;0;a82aecdc-2abd-4d4e-b326-e8a58f790475;
18;G;0;5cae9f60-336b-484c-987f-68548b17ff47;
15;Y;0;a82aecdc-2abd-4d4e-b326-e8a58f790475;
17;R;0;5cae9f60-336b-484c-987f-68548b17ff47;
16;R;0;a82aecdc-2abd-4d4e-b326-e8a58f790475;
10;Y;0;5cae9f60-336b-484c-987f-68548b17ff47;
13;G;0;a82aecdc-2abd-4d4e-b326-e8a58f790475;
9;G;0;5cae9f60-336b-484c-987f-68548b17ff47;
12;G;0;a82aecdc-2abd-4d4e-b326-e8a58f790475;
11;R;0;5cae9f60-336b-484c-987f-68548b17ff47;
Pass;;0;a82aecdc-2abd-4d4e-b326-e8a58f790475;
6;Y;0;5cae9f60-336b-484c-987f-68548b17ff47;
Pass;;0;5cae9f60-336b-484c-987f-68548b17ff47;
