0;0;0;0;0;0;0;0.0;0.0;null;
1;1;0;0;3;3;0;100.0;7.0;23/04/19 21:21;
2;2;0;0;3;6;0;100.0;13.0;23/04/19 21:21;
3;2;1;0;4;4;6;118.849976;5.0;23/04/19 21:21;
4;3;1;0;3;7;6;118.849976;10.0;23/04/19 21:21;
5;3;2;0;5;5;13;96.62286;4.0;23/04/19 21:21;
6;4;2;0;3;8;13;96.62286;9.0;23/04/19 21:22;
7;5;2;0;3;3;21;78.00703;5.0;24/04/19 00:43;
8;5;3;0;6;9;21;78.00703;10.0;24/04/19 00:43;
9;6;3;0;2;2;30;61.441166;9.0;24/04/19 01:28;
10;6;4;0;3;5;30;61.441166;14.0;24/04/19 01:28;
11;7;4;0;3;8;30;61.441166;20.0;24/04/19 01:28;
12;8;4;0;4;4;38;104.24434;6.0;24/04/19 02:00;
13;8;5;0;3;7;38;104.24434;12.0;24/04/19 02:00;
14;9;5;0;2;9;38;104.24434;18.0;24/04/19 02:00;
15;9;6;0;6;6;47;102.4967;5.0;24/04/19 02:00;
16;10;6;0;2;8;47;102.4967;10.0;24/04/19 02:00;
17;10;7;0;3;11;47;102.4967;16.0;24/04/19 02:01;
18;11;7;0;4;4;58;102.67107;5.0;24/04/19 02:01;
19;12;7;0;1;5;58;102.67107;11.0;24/04/19 02:01;
20;12;8;0;5;10;58;102.67107;17.0;24/04/19 02:01;
21;13;8;0;3;3;68;101.035904;5.0;24/04/19 02:02;
22;14;8;0;3;6;68;101.035904;11.0;24/04/19 02:02;
23;15;8;0;4;10;68;101.035904;17.0;24/04/19 02:02;
24;16;8;0;1;1;78;119.319496;6.0;24/04/19 02:02;
25;16;9;0;3;4;78;119.319496;12.0;24/04/19 02:02;
26;17;9;0;2;6;78;119.319496;17.0;24/04/19 02:03;
27;18;9;0;3;3;84;76.773605;5.0;24/04/19 02:31;
28;19;9;0;2;5;84;76.773605;11.0;24/04/19 02:31;
29;20;9;0;4;9;84;76.773605;17.0;24/04/19 02:31;
30;21;9;0;2;2;93;119.14569;6.0;24/04/19 02:32;
31;22;9;0;2;4;93;119.14569;12.0;24/04/19 02:32;
32;23;9;0;3;7;93;119.14569;18.0;24/04/19 02:32;
33;23;10;0;4;4;100;152.94366;5.0;24/04/19 02:32;
34;23;11;0;6;10;100;152.94366;10.0;24/04/19 02:32;
35;24;11;0;1;11;100;152.94366;16.0;24/04/19 02:32;
36;24;12;0;2;2;111;144.6712;4.0;28/04/19 17:23;
37;25;12;0;4;6;111;144.6712;8.0;28/04/19 17:23;
38;26;12;0;2;2;117;148.25867;4.0;28/04/19 17:24;
39;27;12;0;2;4;117;148.25867;9.0;28/04/19 17:24;
40;28;12;0;3;3;121;170.32518;0.0;28/04/19 17:26;
41;28;13;0;4;4;121;170.32518;1.0;28/04/19 17:26;
42;29;13;0;3;3;121;170.32518;2.0;28/04/19 17:26;
43;30;13;0;5;5;121;170.32518;3.0;28/04/19 17:26;
44;30;14;0;5;8;121;170.32518;5.0;28/04/19 17:26;
45;31;14;0;2;2;129;171.12842;6.0;28/04/19 17:26;
46;32;14;0;5;10;129;171.12842;7.0;28/04/19 17:26;
47;33;14;0;3;7;139;171.84196;7.0;28/04/19 17:26;
48;34;14;0;2;5;146;153.58638;7.0;28/04/19 17:26;
49;34;15;0;4;6;151;176.36798;10.0;28/04/19 17:26;
50;34;16;0;4;4;157;176.61948;3.0;28/04/19 17:38;
51;35;16;0;2;2;157;176.61948;3.0;28/04/19 17:38;
52;36;16;0;4;4;157;176.61948;3.0;28/04/19 17:38;
53;37;16;0;4;4;157;176.61948;3.0;28/04/19 17:38;
54;38;16;0;3;7;157;176.61948;8.0;28/04/19 17:38;
55;39;16;0;3;3;164;176.83;4.0;28/04/19 17:38;
56;40;16;0;3;7;164;176.83;8.0;28/04/19 17:38;
57;40;17;0;4;6;171;197.02841;9.0;28/04/19 17:38;
58;41;17;0;3;7;177;194.97554;8.0;28/04/19 17:38;
59;42;17;0;4;4;184;193.15012;3.0;28/04/19 17:40;
60;42;18;0;5;5;184;193.15012;3.0;28/04/19 17:40;
61;43;18;0;5;5;184;193.15012;3.0;28/04/19 17:40;
62;44;18;0;4;4;184;193.15012;4.0;28/04/19 17:40;
63;45;18;0;4;8;184;193.15012;8.0;28/04/19 17:40;
64;45;19;0;4;4;192;191.62016;4.0;28/04/19 17:40;
65;46;19;0;4;9;192;191.62016;8.0;28/04/19 17:40;
66;47;19;0;4;4;201;190.26042;5.0;28/04/19 17:40;
67;47;20;0;3;8;201;190.26042;9.0;28/04/19 17:40;
68;47;21;0;2;2;209;168.9786;7.0;28/04/19 17:40;
69;47;22;0;4;8;209;168.9786;10.0;28/04/19 17:40;
70;47;23;0;6;6;217;150.07368;6.0;28/04/19 17:40;
71;48;23;0;3;3;217;150.07368;6.0;28/04/19 17:40;
72;49;23;0;4;8;217;150.07368;11.0;28/04/19 17:40;
73;49;24;0;4;4;225;133.25687;8.0;28/04/19 17:40;
74;50;24;0;3;7;225;133.25687;13.0;28/04/19 17:40;
75;51;24;0;3;5;232;145.74959;14.0;28/04/19 17:40;
76;52;24;0;3;9;237;147.5156;13.0;28/04/19 17:40;
77;53;24;0;4;7;246;149.18433;13.0;28/04/19 17:40;
78;54;24;0;3;3;253;160.80632;4.0;28/04/19 17:53;
79;55;24;0;3;3;253;160.80632;4.0;28/04/19 17:53;
80;55;25;0;3;3;253;160.80632;4.0;28/04/19 17:53;
81;55;26;0;4;4;253;160.80632;4.0;28/04/19 17:53;
82;56;26;0;4;7;253;160.80632;9.0;28/04/19 17:53;
83;56;27;0;3;3;260;171.46637;6.0;28/04/19 17:53;
84;56;28;0;5;5;260;171.46637;5.0;28/04/19 17:53;
85;57;28;0;4;7;260;171.46637;11.0;28/04/19 17:53;
86;58;28;0;4;4;267;171.81023;6.0;28/04/19 17:53;
87;59;28;0;4;7;267;171.81023;12.0;28/04/19 17:53;
88;59;29;0;5;5;274;162.42177;7.0;28/04/19 17:53;
89;59;30;0;3;3;274;162.42177;8.0;28/04/19 17:53;
90;60;30;0;2;6;274;162.42177;12.0;28/04/19 17:53;
91;60;31;0;4;4;280;172.99052;7.0;28/04/19 17:53;
92;60;32;0;4;7;280;172.99052;12.0;28/04/19 17:53;
93;61;32;0;2;7;287;163.53535;12.0;28/04/19 17:53;
94;62;32;0;4;8;294;154.35106;12.0;28/04/19 17:53;
95;63;32;0;3;6;302;155.64415;13.0;28/04/19 17:53;
96;64;32;0;4;8;308;147.14748;11.0;28/04/19 17:53;
97;65;32;0;3;3;316;148.84026;5.0;28/04/19 17:56;
98;65;33;0;4;7;316;148.84026;10.0;28/04/19 17:56;
99;65;34;0;4;4;323;140.71866;5.0;28/04/19 17:57;
100;66;34;0;3;3;323;140.71866;5.0;28/04/19 17:57;
101;67;34;0;2;2;323;140.71866;7.0;28/04/19 17:57;
102;68;34;0;3;3;323;140.71866;7.0;28/04/19 17:57;
103;68;35;0;4;4;323;140.71866;7.0;28/04/19 17:57;
104;69;35;0;4;8;323;140.71866;11.0;28/04/19 17:57;
105;69;36;0;5;5;331;133.03772;5.0;28/04/19 17:57;
106;69;37;0;3;3;331;133.03772;8.0;28/04/19 17:57;
107;69;38;0;6;9;331;133.03772;13.0;28/04/19 17:57;
108;70;38;0;4;4;340;125.56487;8.0;28/04/19 17:57;
109;70;39;0;6;6;340;125.56487;8.0;28/04/19 17:57;
110;70;40;0;6;6;340;125.56487;8.0;28/04/19 17:57;
111;71;40;0;3;5;340;125.56487;16.0;28/04/19 17:57;
112;72;40;0;5;9;345;138.14114;14.0;28/04/19 17:57;
113;73;40;0;3;6;354;130.58766;15.0;28/04/19 17:57;
114;74;40;0;3;8;360;142.8958;13.0;28/04/19 17:57;
115;75;40;0;4;7;368;144.81136;14.0;28/04/19 17:57;
116;76;40;0;4;8;375;136.89882;14.0;28/04/19 17:57;
117;76;41;0;6;12;383;139.14014;12.0;28/04/19 17:57;
118;77;41;0;4;4;395;131.5334;4.0;28/04/19 17:59;
119;77;42;0;4;8;395;131.5334;7.0;28/04/19 17:59;
120;78;42;0;4;4;403;124.329475;4.0;28/04/19 18:00;
121;79;42;0;4;4;403;124.329475;4.0;28/04/19 18:00;
122;80;42;0;3;3;403;124.329475;4.0;28/04/19 18:00;
123;80;43;0;4;4;403;124.329475;4.0;28/04/19 18:00;
124;81;43;0;3;7;403;124.329475;9.0;28/04/19 18:00;
125;81;44;0;4;4;410;127.31556;5.0;28/04/19 18:00;
126;82;44;0;3;3;410;127.31556;5.0;28/04/19 18:00;
127;83;44;0;4;8;410;127.31556;9.0;28/04/19 18:00;
128;83;45;0;5;5;418;140.14636;5.0;28/04/19 18:00;
129;84;45;0;2;2;418;140.14636;6.0;28/04/19 18:00;
130;84;46;0;3;6;418;140.14636;11.0;28/04/19 18:00;
131;84;47;0;5;5;424;142.29395;6.0;28/04/19 18:00;
132;85;47;0;3;7;424;142.29395;11.0;28/04/19 18:00;
133;86;47;0;4;4;431;144.26881;5.0;28/04/19 18:00;
134;86;48;0;6;10;431;144.26881;11.0;28/04/19 18:00;
135;86;49;0;4;7;441;136.41196;10.0;28/04/19 18:00;
136;87;49;0;4;9;448;138.76976;10.0;28/04/19 18:00;
137;87;50;0;6;11;457;141.00075;10.0;28/04/19 18:00;
138;88;50;0;3;5;468;133.11104;11.0;28/04/19 18:00;
139;89;50;0;2;2;473;135.57666;4.0;28/04/19 18:01;
140;90;50;0;3;3;473;135.57666;4.0;28/04/19 18:01;
141;91;50;0;3;3;473;135.57666;4.0;28/04/19 18:01;
142;91;51;0;6;6;473;135.57666;3.0;28/04/19 18:01;
143;92;51;0;4;4;473;135.57666;4.0;28/04/19 18:01;
144;92;52;0;4;6;473;135.57666;9.0;28/04/19 18:01;
145;92;53;0;4;7;479;147.97552;9.0;28/04/19 18:01;
146;92;54;0;4;4;486;139.93074;6.0;28/04/19 18:01;
147;92;55;0;4;4;486;139.93074;5.0;28/04/19 18:01;
148;92;56;0;3;6;486;139.93074;10.0;28/04/19 18:01;
149;93;56;0;5;5;492;142.1076;5.0;28/04/19 18:01;
150;94;56;0;3;9;492;142.1076;9.0;28/04/19 18:01;
151;95;56;0;2;2;501;144.16643;6.0;28/04/19 18:01;
152;95;57;0;4;4;501;144.16643;5.0;28/04/19 18:01;
153;96;57;0;3;7;501;144.16643;11.0;28/04/19 18:01;
154;97;57;0;5;9;508;156.11307;10.0;28/04/19 18:01;
155;98;57;0;3;3;517;147.64537;6.0;28/04/19 18:01;
156;99;57;0;3;3;517;147.64537;5.0;28/04/19 18:01;
157;100;57;0;3;7;517;147.64537;11.0;28/04/19 18:01;
158;101;57;0;4;9;524;159.08475;10.0;28/04/19 18:01;
159;101;58;0;5;5;533;160.20027;6.0;28/04/19 18:01;
160;101;59;0;4;4;533;160.20027;5.0;28/04/19 18:01;
161;102;59;0;3;7;533;160.20027;11.0;28/04/19 18:01;
162;102;60;0;5;7;540;161.22327;12.0;28/04/19 18:01;
163;103;60;0;3;3;547;152.47305;5.0;28/04/19 18:01;
164;104;60;0;3;3;547;152.47305;7.0;28/04/19 18:01;
165;104;61;0;5;8;547;152.47305;11.0;28/04/19 18:01;
166;104;62;0;3;6;555;144.20827;11.0;28/04/19 18:01;
167;104;63;0;3;3;561;146.11877;6.0;28/04/19 18:01;
168;105;63;0;4;9;561;146.11877;10.0;28/04/19 18:01;
169;106;63;0;4;8;570;138.20149;10.0;28/04/19 18:01;
170;107;63;0;1;1;578;130.70995;6.0;28/04/19 18:01;
171;108;63;0;3;3;578;130.70995;6.0;28/04/19 18:01;
172;108;64;0;4;4;578;130.70995;7.0;28/04/19 18:01;
173;109;64;0;3;6;578;130.70995;11.0;28/04/19 18:01;
174;109;65;0;4;7;584;143.41934;12.0;28/04/19 18:01;
175;110;65;0;2;2;591;135.66676;6.0;28/04/19 18:01;
176;110;66;0;3;3;591;135.66676;5.0;28/04/19 18:01;
177;110;67;0;5;8;591;135.66676;11.0;28/04/19 18:01;
178;110;68;0;4;4;599;128.3278;7.0;28/04/19 18:01;
179;110;69;0;4;4;599;128.3278;6.0;28/04/19 18:01;
180;110;70;0;4;5;599;128.3278;12.0;28/04/19 18:01;
181;110;71;0;4;7;604;131.18399;11.0;28/04/19 18:01;
182;111;71;0;3;7;604;131.18399;12.0;28/04/19 18:01;
183;111;72;0;4;4;618;127.16988;6.0;28/04/19 18:01;
184;112;72;0;4;4;618;127.16988;6.0;28/04/19 18:01;
185;113;72;0;4;6;618;127.16988;11.0;28/04/19 18:01;
186;114;72;0;4;7;624;140.09637;11.0;28/04/19 18:01;
187;115;72;0;4;8;631;132.33804;13.0;28/04/19 18:01;
188;116;72;0;2;2;639;134.92256;8.0;28/04/19 18:01;
189;117;72;0;3;7;639;134.92256;12.0;28/04/19 18:01;
190;117;73;0;3;3;646;137.3696;9.0;28/04/19 18:01;
191;118;73;0;4;4;646;137.3696;8.0;28/04/19 18:01;
192;118;74;0;4;4;646;137.3696;8.0;28/04/19 18:01;
193;119;74;0;3;7;646;137.3696;13.0;28/04/19 18:01;
194;119;75;0;5;9;653;139.75032;13.0;28/04/19 18:02;
195;120;75;0;2;4;662;132.00311;14.0;28/04/19 18:02;
196;121;75;0;3;6;666;144.66913;14.0;28/04/19 18:02;
197;122;75;0;4;8;672;136.87563;12.0;28/04/19 18:02;
198;123;75;0;4;4;680;129.49876;3.0;28/04/19 18:04;
199;124;75;0;4;4;680;129.49876;3.0;28/04/19 18:04;
200;124;76;0;4;4;680;129.49876;4.0;28/04/19 18:04;
201;125;76;0;4;8;680;129.49876;8.0;28/04/19 18:04;
202;125;77;0;3;3;688;141.97543;5.0;28/04/19 18:04;
203;125;78;0;5;5;688;141.97543;4.0;28/04/19 18:04;
204;126;78;0;3;7;688;141.97543;8.0;28/04/19 18:04;
205;127;78;0;4;4;695;154.11215;5.0;28/04/19 18:04;
206;127;79;0;5;5;695;154.11215;5.0;28/04/19 18:04;
207;128;79;0;4;8;695;154.11215;9.0;28/04/19 18:04;
208;129;79;0;2;2;703;145.82187;6.0;28/04/19 18:04;
209;130;79;0;4;9;703;145.82187;10.0;28/04/19 18:04;
210;131;79;0;3;3;712;147.70844;6.0;28/04/19 18:04;
211;132;79;0;3;6;712;147.70844;11.0;28/04/19 18:04;
212;133;79;0;3;3;718;149.49152;5.0;28/04/19 18:04;
213;134;79;0;3;7;718;149.49152;11.0;28/04/19 18:04;
214;135;79;0;3;8;725;151.17642;10.0;28/04/19 18:04;
215;136;79;0;2;4;733;152.81418;11.0;28/04/19 18:04;
216;136;80;0;4;7;737;164.36133;11.0;28/04/19 18:04;
217;136;81;0;5;8;744;165.26323;10.0;28/04/19 18:04;
218;137;81;0;3;3;752;176.11435;4.0;28/04/19 18:13;
219;138;81;0;3;6;752;176.11435;8.0;28/04/19 18:13;
220;139;81;0;5;5;758;186.35179;5.0;28/04/19 18:16;
221;140;81;0;2;2;758;186.35179;5.0;28/04/19 18:16;
222;141;81;0;4;4;758;186.35179;5.0;28/04/19 18:16;
223;142;81;0;4;4;758;186.35179;6.0;28/04/19 18:17;
224;143;81;0;2;2;758;186.35179;7.0;28/04/19 18:17;
225;144;81;0;3;3;758;186.35179;6.0;28/04/19 18:17;
226;145;81;0;4;4;758;186.35179;8.0;28/04/19 18:17;
227;146;81;0;2;7;758;186.35179;16.0;28/04/19 18:17;
228;147;81;0;2;2;765;186.01845;9.0;28/04/19 18:17;
229;148;81;0;4;4;765;186.01845;8.0;28/04/19 18:17;
230;148;82;0;4;6;765;186.01845;15.0;28/04/19 18:17;
231;149;82;0;4;8;771;175.69469;15.0;28/04/19 18:17;
232;149;83;0;5;9;779;175.94896;15.0;28/04/19 18:17;
233;150;83;0;2;2;788;166.1959;9.0;28/04/19 18:17;
234;150;84;0;4;6;788;166.1959;16.0;28/04/19 18:17;
235;150;85;0;4;7;794;166.99457;15.0;28/04/19 18:17;
236;150;86;0;4;8;801;167.74818;16.0;28/04/19 18:17;
237;151;86;0;3;5;809;158.7247;15.0;28/04/19 18:17;
238;152;86;0;3;7;814;169.95775;15.0;28/04/19 18:17;
239;152;87;0;5;7;821;180.55896;15.0;28/04/19 18:17;
240;153;87;0;4;4;828;170.84714;3.0;28/04/19 18:17;
241;153;88;0;4;4;828;170.84714;4.0;28/04/19 18:17;
242;154;88;0;3;3;828;170.84714;5.0;28/04/19 18:17;
243;155;88;0;4;8;828;170.84714;8.0;28/04/19 18:17;
244;155;89;0;4;4;836;181.4143;5.0;28/04/19 18:17;
245;155;90;0;5;5;836;181.4143;5.0;28/04/19 18:17;
246;155;91;0;4;4;836;181.4143;5.0;28/04/19 18:17;
247;155;92;0;5;5;836;181.4143;6.0;28/04/19 18:17;
248;156;92;0;3;7;836;181.4143;11.0;28/04/19 18:17;
249;156;93;0;4;7;843;171.6712;11.0;28/04/19 18:17;
250;157;93;0;3;3;850;162.4792;6.0;28/04/19 18:17;
251;158;93;0;4;8;850;162.4792;11.0;28/04/19 18:17;
252;158;94;0;3;3;858;163.51895;7.0;28/04/19 18:17;
253;159;94;0;4;9;858;163.51895;12.0;28/04/19 18:17;
254;160;94;0;2;2;867;164.5291;7.0;28/04/19 18:17;
255;161;94;0;3;7;867;164.5291;11.0;28/04/19 18:17;
256;162;94;0;4;9;874;165.45528;12.0;28/04/19 18:17;
257;163;94;0;3;6;883;156.35501;12.0;28/04/19 18:17;
258;164;94;0;4;7;889;167.4409;11.0;28/04/19 18:17;
259;164;95;0;4;6;896;158.474;12.0;28/04/19 18:17;
260;165;95;0;4;4;902;150.00745;5.0;28/04/19 18:20;
261;166;95;0;4;4;902;150.00745;5.0;28/04/19 18:20;
262;166;96;0;2;2;902;150.00745;6.0;28/04/19 18:20;
263;167;96;0;2;2;902;150.00745;6.0;28/04/19 18:20;
264;168;96;0;4;4;902;150.00745;6.0;28/04/19 18:21;
265;169;96;0;4;4;902;150.00745;7.0;28/04/19 18:21;
266;170;96;0;3;7;902;150.00745;13.0;28/04/19 18:21;
267;171;96;0;3;3;909;161.77792;8.0;28/04/19 18:21;
268;171;97;0;4;4;909;161.77792;7.0;28/04/19 18:21;
269;172;97;0;3;3;909;161.77792;9.0;28/04/19 18:21;
270;172;98;0;4;8;909;161.77792;15.0;28/04/19 18:21;
271;172;99;0;5;5;917;153.14624;8.0;28/04/19 18:21;
272;173;99;0;2;4;917;153.14624;16.0;28/04/19 18:21;
273;174;99;0;3;5;921;144.99168;16.0;28/04/19 18:21;
274;175;99;0;4;8;926;157.06282;15.0;28/04/19 18:21;
275;176;99;0;3;7;934;168.46973;13.0;28/04/19 18:21;
276;176;100;0;3;7;941;169.23718;17.0;28/04/19 18:21;
277;177;100;0;3;6;948;160.22635;17.0;28/04/19 18:21;
278;178;100;0;3;6;954;171.47162;17.0;28/04/19 18:21;
279;179;100;0;2;7;960;172.06691;15.0;28/04/19 18:21;
280;180;100;0;4;4;967;172.62854;4.0;28/04/19 18:21;
281;180;101;0;4;4;967;172.62854;5.0;28/04/19 18:22;
282;180;102;0;4;4;967;172.62854;6.0;28/04/19 18:22;
283;181;102;0;5;5;967;172.62854;5.0;28/04/19 18:22;
284;181;103;0;3;3;967;172.62854;5.0;28/04/19 18:22;
285;181;104;0;4;8;967;172.62854;12.0;28/04/19 18:22;
286;181;105;0;2;2;975;163.4449;7.0;28/04/19 18:22;
287;182;105;0;4;4;975;163.4449;7.0;28/04/19 18:22;
288;183;105;0;2;6;975;163.4449;13.0;28/04/19 18:22;
289;183;106;0;4;4;981;174.20706;7.0;28/04/19 18:22;
290;183;107;0;5;9;981;174.20706;13.0;28/04/19 18:22;
291;183;108;0;4;4;990;164.93443;7.0;28/04/19 18:22;
292;184;108;0;5;10;990;164.93443;13.0;28/04/19 18:22;
293;184;109;0;4;4;1000;165.8984;8.0;28/04/19 18:22;
294;185;109;0;3;6;1000;165.8984;13.0;28/04/19 18:22;
295;186;109;0;4;6;1006;166.83488;14.0;28/04/19 18:22;
296;187;109;0;3;3;1012;167.71867;9.0;28/04/19 18:22;
297;188;109;0;3;7;1012;167.71867;14.0;28/04/19 18:22;
298;189;109;0;3;7;1019;168.52884;15.0;28/04/19 18:22;
299;189;110;0;4;4;1026;179.00662;10.0;28/04/19 18:22;
300;189;111;0;4;4;1026;179.00662;10.0;28/04/19 18:22;
301;190;111;0;4;8;1026;179.00662;15.0;28/04/19 18:22;
302;190;112;0;4;4;1034;169.46562;11.0;28/04/19 18:22;
303;190;113;0;4;4;1034;169.46562;11.0;28/04/19 18:22;
304;191;113;0;3;7;1034;169.46562;16.0;28/04/19 18:22;
305;191;114;0;4;7;1041;160.46297;17.0;28/04/19 18:22;
306;192;114;0;3;3;1048;151.9631;13.0;28/04/19 18:22;
307;193;114;0;2;2;1048;151.9631;12.0;28/04/19 18:22;
308;194;114;0;3;7;1048;151.9631;18.0;28/04/19 18:22;
309;195;114;0;3;3;1055;153.6529;12.0;28/04/19 18:22;
310;195;115;0;6;10;1055;153.6529;17.0;28/04/19 18:22;
311;196;115;0;4;4;1065;145.52849;12.0;28/04/19 18:22;
312;197;115;0;2;6;1065;145.52849;19.0;28/04/19 18:22;
313;198;115;0;4;8;1071;147.62866;18.0;28/04/19 18:22;
314;198;116;0;5;5;1079;139.83511;13.0;28/04/19 18:22;
315;199;116;0;2;5;1079;139.83511;19.0;28/04/19 18:22;
316;200;116;0;3;5;1084;152.25388;20.0;28/04/19 18:22;
317;201;116;0;3;6;1089;163.99838;19.0;28/04/19 18:22;
318;202;116;0;3;7;1095;174.77353;19.0;28/04/19 18:22;
319;203;116;0;3;8;1102;184.93884;18.0;28/04/19 18:22;
320;204;116;0;3;3;1110;174.8116;4.0;28/04/19 18:23;
321;204;117;0;3;3;1110;174.8116;3.0;28/04/19 18:23;
322;204;118;0;4;4;1110;174.8116;3.0;28/04/19 18:23;
323;205;118;0;3;3;1110;174.8116;3.0;28/04/19 18:23;
324;206;118;0;4;4;1110;174.8116;4.0;28/04/19 18:23;
325;206;119;0;4;7;1110;174.8116;8.0;28/04/19 18:23;
326;206;120;0;6;6;1117;165.53264;3.0;28/04/19 18:23;
327;207;120;0;3;6;1117;165.53264;9.0;28/04/19 18:23;
328;207;121;0;4;8;1123;166.51878;9.0;28/04/19 18:23;
329;208;121;0;4;7;1131;157.70758;9.0;28/04/19 18:23;
330;209;121;0;2;2;1138;168.82176;6.0;28/04/19 18:23;
331;210;121;0;3;3;1138;168.82176;6.0;28/04/19 18:23;
332;210;122;0;5;9;1138;168.82176;10.0;28/04/19 18:23;
333;211;122;0;4;4;1147;159.88159;5.0;28/04/19 18:23;
334;212;122;0;3;3;1147;159.88159;6.0;28/04/19 18:23;
335;213;122;0;3;9;1147;159.88159;9.0;28/04/19 18:23;
336;213;123;0;5;7;1156;161.1951;10.0;28/04/19 18:23;
337;213;124;0;4;7;1163;172.43527;11.0;28/04/19 18:23;
338;213;125;0;5;9;1170;173.02585;10.0;28/04/19 18:23;
339;213;126;0;3;6;1179;173.59949;11.0;28/04/19 18:23;
340;213;127;0;5;5;1185;164.41165;4.0;28/04/19 18:25;
341;214;127;0;1;1;1185;164.41165;4.0;28/04/19 18:25;
342;214;128;0;3;8;1185;164.41165;8.0;28/04/19 18:25;
343;214;129;0;5;6;1193;155.73909;8.0;28/04/19 18:25;
344;215;129;0;3;3;1199;167.31088;4.0;28/04/19 18:25;
345;215;130;0;5;5;1199;167.31088;4.0;28/04/19 18:25;
346;216;130;0;2;5;1199;167.31088;8.0;28/04/19 18:26;
347;217;130;0;3;8;1204;177.92384;8.0;28/04/19 18:26;
348;217;131;0;4;4;1212;168.23203;4.0;28/04/19 18:27;
349;217;132;0;6;6;1212;168.23203;3.0;28/04/19 18:27;
350;217;133;0;4;4;1212;168.23203;3.0;28/04/19 18:29;
351;217;134;0;3;3;1212;168.23203;4.0;28/04/19 18:29;
352;218;134;0;3;3;1212;168.23203;4.0;28/04/19 18:29;
353;218;135;0;4;4;1212;168.23203;4.0;28/04/19 18:29;
354;219;135;0;3;3;1212;168.23203;4.0;28/04/19 18:29;
355;220;135;0;2;6;1212;168.23203;8.0;28/04/19 18:29;
356;220;136;0;6;9;1218;159.08809;9.0;28/04/19 18:29;
357;221;136;0;1;4;1227;150.69939;9.0;28/04/19 18:29;
358;222;136;0;3;7;1231;162.5449;10.0;28/04/19 18:29;
359;223;136;0;3;6;1238;163.70007;9.0;28/04/19 18:29;
360;224;136;0;3;3;1244;174.82242;3.0;28/04/19 18:30;
361;225;136;0;3;3;1244;174.82242;3.0;28/04/19 18:30;
362;225;137;0;5;5;1244;174.82242;4.0;28/04/19 18:30;
363;225;138;0;3;3;1244;174.82242;4.0;28/04/19 18:30;
364;226;138;0;3;3;1244;174.82242;4.0;28/04/19 18:30;
365;226;139;0;4;7;1244;174.82242;8.0;28/04/19 18:30;
366;226;140;0;3;3;1251;165.31798;4.0;28/04/19 18:30;
367;226;141;0;4;7;1251;165.31798;9.0;28/04/19 18:30;
368;226;142;0;3;3;1258;156.34955;5.0;28/04/19 18:30;
369;227;142;0;3;8;1258;156.34955;9.0;28/04/19 18:30;
370;228;142;0;4;4;1266;148.11865;4.0;28/04/19 18:30;
371;228;143;0;5;8;1266;148.11865;8.0;28/04/19 18:30;
372;228;144;0;4;4;1274;140.33633;4.0;28/04/19 18:30;
373;229;144;0;3;6;1274;140.33633;9.0;28/04/19 18:30;
374;230;144;0;3;3;1280;152.42647;5.0;28/04/19 18:30;
375;231;144;0;4;4;1280;152.42647;4.0;28/04/19 18:30;
376;231;145;0;5;8;1280;152.42647;10.0;28/04/19 18:30;
377;232;145;0;4;4;1288;144.18152;4.0;28/04/19 18:30;
378;233;145;0;2;5;1288;144.18152;10.0;28/04/19 18:30;
379;234;145;0;3;7;1293;156.04948;9.0;28/04/19 18:30;
380;234;146;0;5;5;1300;157.54259;5.0;28/04/19 18:30;
381;235;146;0;3;7;1300;157.54259;9.0;28/04/19 18:30;
382;235;147;0;4;4;1307;158.95273;5.0;28/04/19 18:30;
383;235;148;0;4;4;1307;158.95273;5.0;28/04/19 18:30;
384;236;148;0;4;7;1307;158.95273;10.0;28/04/19 18:30;
385;236;149;0;4;8;1314;160.32307;10.0;28/04/19 18:30;
386;237;149;0;2;2;1322;151.61703;5.0;28/04/19 18:30;
387;238;149;0;3;3;1322;151.61703;5.0;28/04/19 18:30;
388;239;149;0;3;8;1322;151.61703;10.0;28/04/19 18:30;
389;240;149;0;2;6;1330;153.34378;11.0;28/04/19 18:30;
390;241;149;0;3;3;1336;164.69388;6.0;28/04/19 18:30;
391;241;150;0;5;5;1336;164.69388;4.0;28/04/19 18:30;
392;241;151;0;5;9;1336;164.69388;9.0;28/04/19 18:30;
393;242;151;0;2;6;1345;155.72194;10.0;28/04/19 18:30;
394;243;151;0;4;4;1351;157.2077;5.0;28/04/19 18:30;
395;243;152;0;4;4;1351;157.2077;6.0;28/04/19 18:30;
396;244;152;0;3;5;1351;157.2077;11.0;28/04/19 18:30;
397;244;153;0;5;5;1356;168.32767;6.0;28/04/19 18:30;
398;245;153;0;4;7;1356;168.32767;10.0;28/04/19 18:30;
399;245;154;0;4;4;1356;168.32767;5.0;28/04/19 18:30;
400;245;155;0;4;7;1363;179.13057;11.0;28/04/19 18:30;
401;246;155;0;4;9;1370;169.6042;10.0;28/04/19 18:30;
402;247;155;0;3;3;1379;160.35098;5.0;28/04/19 18:31;
403;247;156;0;4;4;1379;160.35098;5.0;28/04/19 18:31;
404;248;156;0;3;7;1379;160.35098;11.0;28/04/19 18:31;
405;248;157;0;6;6;1386;171.61737;6.0;28/04/19 18:31;
406;249;157;0;3;7;1386;171.61737;11.0;28/04/19 18:31;
407;249;158;0;5;5;1393;162.51842;5.0;28/04/19 18:31;
408;249;159;0;3;8;1393;162.51842;12.0;28/04/19 18:31;
409;250;159;0;3;7;1401;153.67856;11.0;28/04/19 18:31;
410;250;160;0;4;4;1408;155.28406;7.0;28/04/19 18:31;
411;250;161;0;3;3;1408;155.28406;6.0;28/04/19 18:31;
412;251;161;0;4;8;1408;155.28406;10.0;28/04/19 18:31;
413;251;162;0;4;7;1416;156.80066;11.0;28/04/19 18:31;
414;252;162;0;3;9;1423;158.27458;11.0;28/04/19 18:31;
415;253;162;0;4;9;1432;159.66656;10.0;28/04/19 18:31;
416;253;163;0;5;9;1441;151.22581;11.0;28/04/19 18:31;
417;254;163;0;3;6;1450;143.02116;10.0;28/04/19 18:31;
418;255;163;0;2;2;1456;145.20181;3.0;28/04/19 18:31;
419;256;163;0;2;2;1456;145.20181;3.0;28/04/19 18:31;
420;257;163;0;2;2;1456;145.20181;4.0;28/04/19 18:31;
421;258;163;0;3;3;1456;145.20181;4.0;28/04/19 18:31;
422;258;164;0;4;4;1456;145.20181;5.0;28/04/19 18:31;
423;258;165;0;4;6;1456;145.20181;9.0;28/04/19 18:31;
424;259;165;0;3;3;1462;147.3226;5.0;28/04/19 18:31;
425;260;165;0;3;3;1462;147.3226;4.0;28/04/19 18:31;
426;261;165;0;3;5;1462;147.3226;9.0;28/04/19 18:31;
427;262;165;0;4;4;1467;159.32812;5.0;28/04/19 18:31;
428;262;166;0;6;8;1467;159.32812;11.0;28/04/19 18:32;
429;262;167;0;5;5;1475;150.91534;6.0;28/04/19 18:32;
430;263;167;0;2;5;1475;150.91534;11.0;28/04/19 18:32;
431;263;168;0;4;4;1480;162.73764;5.0;28/04/19 18:32;
432;264;168;0;3;7;1480;162.73764;11.0;28/04/19 18:32;
433;265;168;0;4;7;1487;154.15416;10.0;28/04/19 18:32;
434;265;169;0;4;7;1494;155.81189;9.0;28/04/19 18:32;
435;265;170;0;5;9;1501;167.37796;10.0;28/04/19 18:32;
436;265;171;0;5;10;1510;158.29802;10.0;28/04/19 18:32;
437;266;171;0;3;7;1520;149.96689;10.0;28/04/19 18:32;
438;267;171;0;3;3;1527;142.09155;3.0;28/04/19 18:32;
439;268;171;0;4;4;1527;142.09155;3.0;28/04/19 18:32;
440;268;172;0;6;6;1527;142.09155;3.0;28/04/19 18:32;
441;268;173;0;5;5;1527;142.09155;3.0;28/04/19 18:32;
442;269;173;0;4;7;1527;142.09155;8.0;28/04/19 18:32;
443;270;173;0;4;4;1534;154.43158;4.0;28/04/19 18:32;
444;271;173;0;4;8;1534;154.43158;8.0;28/04/19 18:32;
445;271;174;0;5;11;1542;156.09944;7.0;28/04/19 18:32;
446;271;175;0;5;5;1553;147.91063;5.0;28/04/19 18:32;
447;272;175;0;4;4;1553;147.91063;4.0;28/04/19 18:32;
448;272;176;0;4;4;1553;147.91063;4.0;28/04/19 18:32;
449;273;176;0;3;8;1553;147.91063;8.0;28/04/19 18:32;
450;274;176;0;4;4;1561;159.61446;4.0;28/04/19 18:32;
451;274;177;0;3;7;1561;159.61446;9.0;28/04/19 18:32;
452;275;177;0;3;3;1568;151.23212;4.0;28/04/19 18:32;
453;276;177;0;4;4;1568;151.23212;4.0;28/04/19 18:32;
454;277;177;0;4;9;1568;151.23212;9.0;28/04/19 18:32;
455;277;178;0;5;9;1577;143.30923;9.0;28/04/19 18:32;
456;277;179;0;4;4;1586;135.8125;5.0;28/04/19 18:32;
457;278;179;0;3;7;1586;135.8125;9.0;28/04/19 18:32;
458;279;179;0;4;8;1593;148.17474;8.0;28/04/19 18:32;
459;279;180;0;5;5;1601;150.19833;5.0;28/04/19 18:32;
460;280;180;0;4;4;1601;150.19833;5.0;28/04/19 18:32;
461;281;180;0;3;6;1601;150.19833;10.0;28/04/19 18:32;
462;281;181;0;5;9;1607;162.1115;9.0;28/04/19 18:32;
463;282;181;0;3;3;1607;162.1115;5.0;28/04/19 18:32;
464;282;182;0;4;4;1616;153.36568;5.0;28/04/19 18:32;
465;283;182;0;4;4;1616;153.36568;5.0;28/04/19 18:32;
466;284;182;0;4;8;1616;153.36568;10.0;28/04/19 18:32;
467;284;183;0;4;4;1624;145.10498;6.0;28/04/19 18:32;
468;284;184;0;5;5;1624;145.10498;4.0;28/04/19 18:32;
469;285;184;0;4;4;1624;145.10498;6.0;28/04/19 18:32;
470;286;184;0;2;7;1624;145.10498;12.0;28/04/19 18:32;
471;287;184;0;2;6;1631;137.50792;11.0;28/04/19 18:32;
472;288;184;0;3;6;1637;150.11578;11.0;28/04/19 18:32;
473;289;184;0;4;8;1643;151.99138;10.0;28/04/19 18:32;
474;290;184;0;3;7;1651;144.04134;10.0;28/04/19 18:32;
475;291;184;0;4;8;1658;155.97192;10.0;28/04/19 18:32;
476;292;184;0;2;7;1666;147.56985;9.0;28/04/19 18:32;
477;292;185;0;4;8;1673;139.62865;10.0;28/04/19 18:32;
478;292;186;0;4;4;1681;132.11494;3.0;28/04/19 18:35;
479;293;186;0;3;3;1681;132.11494;4.0;28/04/19 18:35;
480;294;186;0;4;4;1681;132.11494;3.0;28/04/19 18:35;
481;295;186;0;3;3;1681;132.11494;4.0;28/04/19 18:35;
482;295;187;0;5;5;1681;132.11494;4.0;28/04/19 18:35;
483;295;188;0;3;7;1681;132.11494;9.0;28/04/19 18:35;
484;296;188;0;2;5;1688;125.18385;10.0;28/04/19 18:35;
485;296;189;0;4;4;1693;138.08716;6.0;28/04/19 18:35;
486;297;189;0;4;4;1693;138.08716;5.0;28/04/19 18:35;
487;297;190;0;4;8;1693;138.08716;10.0;28/04/19 18:35;
488;298;190;0;4;4;1701;130.84583;5.0;28/04/19 18:35;
489;299;190;0;2;5;1701;130.84583;11.0;28/04/19 18:35;
490;300;190;0;3;3;1706;143.45201;6.0;28/04/19 18:35;
491;300;191;0;5;10;1706;143.45201;10.0;28/04/19 18:35;
492;301;191;0;4;4;1716;135.92705;5.0;28/04/19 18:35;
493;302;191;0;3;7;1716;135.92705;11.0;28/04/19 18:35;
494;303;191;0;3;7;1723;138.53261;11.0;28/04/19 18:35;
495;304;191;0;2;6;1730;140.99971;11.0;28/04/19 18:35;
496;304;192;0;5;9;1736;153.06091;10.0;28/04/19 18:35;
497;304;193;0;4;7;1745;145.01749;11.0;28/04/19 18:35;
498;305;193;0;3;3;1752;137.40903;3.0;28/04/19 18:36;
499;306;193;0;4;4;1752;137.40903;3.0;28/04/19 18:36;
500;306;194;0;5;5;1752;137.40903;3.0;28/04/19 18:36;
501;307;194;0;2;2;1752;137.40903;4.0;28/04/19 18:36;
502;308;194;0;4;4;1752;137.40903;4.0;28/04/19 18:36;
503;309;194;0;3;6;1752;137.40903;8.0;28/04/19 18:36;
504;310;194;0;3;3;1758;149.66475;4.0;28/04/19 18:36;
505;310;195;0;5;9;1758;149.66475;8.0;28/04/19 18:36;
506;311;195;0;4;9;1767;141.80614;9.0;28/04/19 18:36;
507;311;196;0;4;4;1776;134.16226;5.0;28/04/19 18:36;
508;312;196;0;3;3;1776;134.16226;5.0;28/04/19 18:36;
509;313;196;0;3;3;1776;134.16226;4.0;28/04/19 18:36;
510;314;196;0;3;5;1776;134.16226;11.0;28/04/19 18:36;
511;314;197;0;4;4;1781;136.85037;6.0;28/04/19 18:36;
512;315;197;0;3;7;1781;136.85037;10.0;28/04/19 18:36;
513;315;198;0;5;8;1788;149.46655;10.0;28/04/19 18:36;
514;315;199;0;4;8;1796;141.4038;11.0;28/04/19 18:36;
515;315;200;0;4;7;1804;133.98344;10.0;28/04/19 18:36;
516;315;201;0;4;7;1811;126.952034;9.0;28/04/19 18:36;
517;315;202;0;6;10;1818;130.0221;11.0;28/04/19 18:36;
518;316;202;0;3;3;1828;123.19452;11.0;28/04/19 18:37;
519;317;202;0;3;3;1828;123.19452;11.0;28/04/19 18:37;
520;318;202;0;3;3;1828;123.19452;11.0;28/04/19 18:37;
521;318;203;0;5;5;1828;123.19452;10.0;28/04/19 18:37;
522;319;203;0;3;3;1828;123.19452;11.0;28/04/19 18:37;
523;320;203;0;3;3;1828;123.19452;12.0;28/04/19 18:37;
524;320;204;0;6;6;1828;123.19452;12.0;28/04/19 18:37;
525;321;204;0;3;3;1828;123.19452;12.0;28/04/19 18:37;
526;322;204;0;4;4;1828;123.19452;11.0;28/04/19 18:37;
527;323;204;0;3;3;1828;123.19452;13.0;28/04/19 18:37;
528;324;204;0;2;5;1828;123.19452;25.0;28/04/19 18:37;
529;325;204;0;3;6;1833;136.54256;25.0;28/04/19 18:37;
530;325;205;0;5;8;1839;139.20099;23.0;28/04/19 18:37;
531;326;205;0;1;6;1839;139.20099;24.0;28/04/19 18:37;
532;327;205;0;2;5;1853;154.10175;27.0;28/04/19 18:37;
533;327;206;0;6;9;1858;165.48267;23.0;28/04/19 18:37;
534;327;207;0;3;9;1867;176.22523;25.0;28/04/19 18:37;
535;327;208;0;3;6;1876;166.93411;26.0;28/04/19 18:37;
536;328;208;0;3;7;1882;157.9085;24.0;28/04/19 18:37;
537;328;209;0;4;7;1889;169.38722;25.0;28/04/19 18:37;
538;328;210;0;5;5;1896;170.19958;6.0;28/04/19 18:39;
539;328;211;0;5;5;1896;170.19958;6.0;28/04/19 18:39;
540;328;212;0;6;6;1896;170.19958;5.0;28/04/19 18:39;
541;328;213;0;4;4;1896;170.19958;6.0;28/04/19 18:39;
542;329;213;0;5;5;1896;170.19958;6.0;28/04/19 18:39;
543;329;214;0;3;3;1896;170.19958;8.0;28/04/19 18:39;
544;330;214;0;5;10;1896;170.19958;13.0;28/04/19 18:39;
545;330;215;0;4;4;1906;161.25157;8.0;28/04/19 18:39;
546;331;215;0;3;3;1906;161.25157;7.0;28/04/19 18:39;
547;332;215;0;2;7;1906;161.25157;15.0;28/04/19 18:39;
548;333;215;0;3;9;1913;152.5575;14.0;28/04/19 18:39;
549;334;215;0;3;3;1922;154.29509;9.0;28/04/19 18:39;
550;335;215;0;3;8;1922;154.29509;14.0;28/04/19 18:39;
551;335;216;0;5;5;1930;155.98413;9.0;28/04/19 18:39;
552;336;216;0;2;6;1930;155.98413;15.0;28/04/19 18:39;
553;337;216;0;2;5;1936;167.25302;16.0;28/04/19 18:39;
554;338;216;0;4;8;1941;158.45906;15.0;28/04/19 18:39;
555;339;216;0;2;5;1949;150.15356;15.0;28/04/19 18:39;
556;340;216;0;4;9;1954;162.07928;15.0;28/04/19 18:39;
557;340;217;0;4;7;1963;153.59209;16.0;28/04/19 18:39;
558;341;217;0;2;2;1970;145.57182;6.0;28/04/19 18:40;
559;341;218;0;5;5;1970;145.57182;5.0;28/04/19 18:40;
560;341;219;0;4;4;1970;145.57182;6.0;28/04/19 18:40;
561;342;219;0;4;4;1970;145.57182;6.0;28/04/19 18:40;
562;342;220;0;3;3;1970;145.57182;7.0;28/04/19 18:41;
563;343;220;0;3;3;1970;145.57182;6.0;28/04/19 18:41;
564;344;220;0;3;3;1970;145.57182;7.0;28/04/19 18:41;
565;345;220;0;4;4;1970;145.57182;7.0;28/04/19 18:41;
566;345;221;0;5;5;1970;145.57182;7.0;28/04/19 18:41;
567;345;222;0;5;10;1970;145.57182;13.0;28/04/19 18:41;
568;345;223;0;4;6;1980;137.98483;15.0;28/04/19 18:41;
569;346;223;0;4;8;1986;130.7992;15.0;28/04/19 18:41;
570;346;224;0;5;9;1994;123.98495;13.0;28/04/19 18:41;
571;346;225;0;5;5;2003;117.514206;8.0;28/04/19 18:41;
572;347;225;0;4;7;2003;117.514206;15.0;28/04/19 18:41;
573;347;226;0;4;7;2010;121.113304;15.0;28/04/19 18:41;
574;347;227;0;4;7;2017;124.621895;15.0;28/04/19 18:41;
575;347;228;0;4;8;2024;127.86888;15.0;28/04/19 18:41;
576;348;228;0;2;7;2032;121.207985;15.0;28/04/19 18:41;
577;349;228;0;2;7;2039;114.716324;15.0;28/04/19 18:41;
