24;Y;0;5cae9f60-336b-484c-987f-68548b17ff47;
23;B;0;a82aecdc-2abd-4d4e-b326-e8a58f790475;
17;B;0;5cae9f60-336b-484c-987f-68548b17ff47;
22;Y;0;a82aecdc-2abd-4d4e-b326-e8a58f790475;
19;G;0;5cae9f60-336b-484c-987f-68548b17ff47;
14;G;0;a82aecdc-2abd-4d4e-b326-e8a58f790475;
18;Y;0;5cae9f60-336b-484c-987f-68548b17ff47;
21;B;0;a82aecdc-2abd-4d4e-b326-e8a58f790475;
16;B;0;5cae9f60-336b-484c-987f-68548b17ff47;
15;Y;0;a82aecdc-2abd-4d4e-b326-e8a58f790475;
13;G;0;5cae9f60-336b-484c-987f-68548b17ff47;
10;B;0;a82aecdc-2abd-4d4e-b326-e8a58f790475;
12;Y;0;5cae9f60-336b-484c-987f-68548b17ff47;
9;G;0;a82aecdc-2abd-4d4e-b326-e8a58f790475;
11;B;0;5cae9f60-336b-484c-987f-68548b17ff47;
8;G;0;a82aecdc-2abd-4d4e-b326-e8a58f790475;
Pass;;0;5cae9f60-336b-484c-987f-68548b17ff47;
7;Y;0;a82aecdc-2abd-4d4e-b326-e8a58f790475;
Pass;;0;a82aecdc-2abd-4d4e-b326-e8a58f790475;
