27;P;0;a82aecdc-2abd-4d4e-b326-e8a58f790475;
26;Y;0;5cae9f60-336b-484c-987f-68548b17ff47;
20;Y;0;a82aecdc-2abd-4d4e-b326-e8a58f790475;
25;R;0;5cae9f60-336b-484c-987f-68548b17ff47;
24;G;0;a82aecdc-2abd-4d4e-b326-e8a58f790475;
19;Y;0;5cae9f60-336b-484c-987f-68548b17ff47;
23;P;0;a82aecdc-2abd-4d4e-b326-e8a58f790475;
17;P;0;5cae9f60-336b-484c-987f-68548b17ff47;
22;G;0;a82aecdc-2abd-4d4e-b326-e8a58f790475;
21;B;0;5cae9f60-336b-484c-987f-68548b17ff47;
15;G;0;a82aecdc-2abd-4d4e-b326-e8a58f790475;
18;R;0;5cae9f60-336b-484c-987f-68548b17ff47;
16;P;0;a82aecdc-2abd-4d4e-b326-e8a58f790475;
14;Y;0;5cae9f60-336b-484c-987f-68548b17ff47;
10;P;0;a82aecdc-2abd-4d4e-b326-e8a58f790475;
12;P;0;5cae9f60-336b-484c-987f-68548b17ff47;
13;R;0;a82aecdc-2abd-4d4e-b326-e8a58f790475;
9;R;0;5cae9f60-336b-484c-987f-68548b17ff47;
8;R;0;a82aecdc-2abd-4d4e-b326-e8a58f790475;
11;P;0;5cae9f60-336b-484c-987f-68548b17ff47;
5;R;0;a82aecdc-2abd-4d4e-b326-e8a58f790475;
Pass;;0;5cae9f60-336b-484c-987f-68548b17ff47;
Pass;;0;a82aecdc-2abd-4d4e-b326-e8a58f790475;
27;G;0;5cae9f60-336b-484c-987f-68548b17ff47;
26;B;0;a82aecdc-2abd-4d4e-b326-e8a58f790475;
25;G;0;5cae9f60-336b-484c-987f-68548b17ff47;
20;B;0;a82aecdc-2abd-4d4e-b326-e8a58f790475;
24;Y;0;5cae9f60-336b-484c-987f-68548b17ff47;
23;B;0;a82aecdc-2abd-4d4e-b326-e8a58f790475;
19;G;0;5cae9f60-336b-484c-987f-68548b17ff47;
14;G;0;a82aecdc-2abd-4d4e-b326-e8a58f790475;
18;Y;0;5cae9f60-336b-484c-987f-68548b17ff47;
22;P;0;a82aecdc-2abd-4d4e-b326-e8a58f790475;
17;Y;0;5cae9f60-336b-484c-987f-68548b17ff47;
21;R;0;a82aecdc-2abd-4d4e-b326-e8a58f790475;
16;P;0;5cae9f60-336b-484c-987f-68548b17ff47;
15;P;0;a82aecdc-2abd-4d4e-b326-e8a58f790475;
13;G;0;5cae9f60-336b-484c-987f-68548b17ff47;
12;Y;0;a82aecdc-2abd-4d4e-b326-e8a58f790475;
9;G;0;5cae9f60-336b-484c-987f-68548b17ff47;
11;P;0;a82aecdc-2abd-4d4e-b326-e8a58f790475;
8;Y;0;5cae9f60-336b-484c-987f-68548b17ff47;
5;G;0;a82aecdc-2abd-4d4e-b326-e8a58f790475;
7;P;0;5cae9f60-336b-484c-987f-68548b17ff47;
Pass;;0;a82aecdc-2abd-4d4e-b326-e8a58f790475;
Pass;;0;5cae9f60-336b-484c-987f-68548b17ff47;
