18;B;0;5cae9f60-336b-484c-987f-68548b17ff47;
19;G;0;5cae9f60-336b-484c-987f-68548b17ff47;
9;G;0;5cae9f60-336b-484c-987f-68548b17ff47;
22;Y;0;a82aecdc-2abd-4d4e-b326-e8a58f790475;
23;Y;0;a82aecdc-2abd-4d4e-b326-e8a58f790475;
11;R;0;a82aecdc-2abd-4d4e-b326-e8a58f790475;
8;P;0;5cae9f60-336b-484c-987f-68548b17ff47;
16;Y;0;5cae9f60-336b-484c-987f-68548b17ff47;
5;P;0;a82aecdc-2abd-4d4e-b326-e8a58f790475;
18;Y;0;5cae9f60-336b-484c-987f-68548b17ff47;
15;Y;0;a82aecdc-2abd-4d4e-b326-e8a58f790475;
22;P;0;a82aecdc-2abd-4d4e-b326-e8a58f790475;
7;R;0;5cae9f60-336b-484c-987f-68548b17ff47;
27;R;0;5cae9f60-336b-484c-987f-68548b17ff47;
4;P;0;a82aecdc-2abd-4d4e-b326-e8a58f790475;
26;P;0;a82aecdc-2abd-4d4e-b326-e8a58f790475;
17;P;0;5cae9f60-336b-484c-987f-68548b17ff47;
16;P;0;5cae9f60-336b-484c-987f-68548b17ff47;
Pass;;0;5cae9f60-336b-484c-987f-68548b17ff47;
14;R;0;a82aecdc-2abd-4d4e-b326-e8a58f790475;
21;R;0;a82aecdc-2abd-4d4e-b326-e8a58f790475;
Pass;;0;a82aecdc-2abd-4d4e-b326-e8a58f790475;
13;R;0;5cae9f60-336b-484c-987f-68548b17ff47;
17;Y;0;5cae9f60-336b-484c-987f-68548b17ff47;
12;P;0;a82aecdc-2abd-4d4e-b326-e8a58f790475;
15;P;0;a82aecdc-2abd-4d4e-b326-e8a58f790475;
25;G;0;5cae9f60-336b-484c-987f-68548b17ff47;
11;Y;0;5cae9f60-336b-484c-987f-68548b17ff47;
20;P;0;a82aecdc-2abd-4d4e-b326-e8a58f790475;
14;G;0;5cae9f60-336b-484c-987f-68548b17ff47;
10;Y;0;a82aecdc-2abd-4d4e-b326-e8a58f790475;
13;Y;0;a82aecdc-2abd-4d4e-b326-e8a58f790475;
9;R;0;5cae9f60-336b-484c-987f-68548b17ff47;
27;G;0;5cae9f60-336b-484c-987f-68548b17ff47;
8;P;0;a82aecdc-2abd-4d4e-b326-e8a58f790475;
26;Y;0;a82aecdc-2abd-4d4e-b326-e8a58f790475;
11;P;0;5cae9f60-336b-484c-987f-68548b17ff47;
24;B;0;5cae9f60-336b-484c-987f-68548b17ff47;
9;Y;0;a82aecdc-2abd-4d4e-b326-e8a58f790475;
23;G;0;a82aecdc-2abd-4d4e-b326-e8a58f790475;
7;P;0;5cae9f60-336b-484c-987f-68548b17ff47;
12;Y;0;5cae9f60-336b-484c-987f-68548b17ff47;
5;P;0;a82aecdc-2abd-4d4e-b326-e8a58f790475;
10;P;0;a82aecdc-2abd-4d4e-b326-e8a58f790475;
6;Y;0;5cae9f60-336b-484c-987f-68548b17ff47;
Pass;;0;a82aecdc-2abd-4d4e-b326-e8a58f790475;
7;P;0;5cae9f60-336b-484c-987f-68548b17ff47;
19;G;0;5cae9f60-336b-484c-987f-68548b17ff47;
Pass;;0;5cae9f60-336b-484c-987f-68548b17ff47;
Pass;;0;a82aecdc-2abd-4d4e-b326-e8a58f790475;
14;G;0;a82aecdc-2abd-4d4e-b326-e8a58f790475;
25;G;0;5cae9f60-336b-484c-987f-68548b17ff47;
27;P;0;a82aecdc-2abd-4d4e-b326-e8a58f790475;
Pass;;0;5cae9f60-336b-484c-987f-68548b17ff47;
20;Y;0;a82aecdc-2abd-4d4e-b326-e8a58f790475;
27;P;0;a82aecdc-2abd-4d4e-b326-e8a58f790475;
18;B;0;5cae9f60-336b-484c-987f-68548b17ff47;
22;R;0;a82aecdc-2abd-4d4e-b326-e8a58f790475;
26;G;0;5cae9f60-336b-484c-987f-68548b17ff47;
24;P;0;5cae9f60-336b-484c-987f-68548b17ff47;
20;G;0;a82aecdc-2abd-4d4e-b326-e8a58f790475;
16;R;0;5cae9f60-336b-484c-987f-68548b17ff47;
23;B;0;a82aecdc-2abd-4d4e-b326-e8a58f790475;
26;G;0;5cae9f60-336b-484c-987f-68548b17ff47;
21;B;0;a82aecdc-2abd-4d4e-b326-e8a58f790475;
20;G;0;a82aecdc-2abd-4d4e-b326-e8a58f790475;
25;Y;0;5cae9f60-336b-484c-987f-68548b17ff47;
19;G;0;5cae9f60-336b-484c-987f-68548b17ff47;
17;G;0;5cae9f60-336b-484c-987f-68548b17ff47;
24;R;0;a82aecdc-2abd-4d4e-b326-e8a58f790475;
14;G;0;a82aecdc-2abd-4d4e-b326-e8a58f790475;
15;R;0;a82aecdc-2abd-4d4e-b326-e8a58f790475;
18;P;0;5cae9f60-336b-484c-987f-68548b17ff47;
13;B;0;5cae9f60-336b-484c-987f-68548b17ff47;
25;R;0;5cae9f60-336b-484c-987f-68548b17ff47;
19;G;0;5cae9f60-336b-484c-987f-68548b17ff47;
22;R;0;a82aecdc-2abd-4d4e-b326-e8a58f790475;
9;B;0;a82aecdc-2abd-4d4e-b326-e8a58f790475;
24;Y;0;a82aecdc-2abd-4d4e-b326-e8a58f790475;
23;B;0;a82aecdc-2abd-4d4e-b326-e8a58f790475;
11;R;0;5cae9f60-336b-484c-987f-68548b17ff47;
27;G;0;5cae9f60-336b-484c-987f-68548b17ff47;
12;G;0;a82aecdc-2abd-4d4e-b326-e8a58f790475;
26;R;0;a82aecdc-2abd-4d4e-b326-e8a58f790475;
17;P;0;5cae9f60-336b-484c-987f-68548b17ff47;
18;Y;0;5cae9f60-336b-484c-987f-68548b17ff47;
21;B;0;a82aecdc-2abd-4d4e-b326-e8a58f790475;
8;G;0;5cae9f60-336b-484c-987f-68548b17ff47;
22;P;0;a82aecdc-2abd-4d4e-b326-e8a58f790475;
19;G;0;5cae9f60-336b-484c-987f-68548b17ff47;
10;R;0;a82aecdc-2abd-4d4e-b326-e8a58f790475;
16;R;0;5cae9f60-336b-484c-987f-68548b17ff47;
23;P;0;a82aecdc-2abd-4d4e-b326-e8a58f790475;
7;R;0;5cae9f60-336b-484c-987f-68548b17ff47;
15;R;0;a82aecdc-2abd-4d4e-b326-e8a58f790475;
Pass;;0;a82aecdc-2abd-4d4e-b326-e8a58f790475;
14;G;0;5cae9f60-336b-484c-987f-68548b17ff47;
13;G;0;5cae9f60-336b-484c-987f-68548b17ff47;
5;B;0;5cae9f60-336b-484c-987f-68548b17ff47;
21;R;0;a82aecdc-2abd-4d4e-b326-e8a58f790475;
25;P;0;5cae9f60-336b-484c-987f-68548b17ff47;
12;P;0;a82aecdc-2abd-4d4e-b326-e8a58f790475;
20;R;0;a82aecdc-2abd-4d4e-b326-e8a58f790475;
Pass;;0;5cae9f60-336b-484c-987f-68548b17ff47;
18;Y;0;5cae9f60-336b-484c-987f-68548b17ff47;
13;Y;0;5cae9f60-336b-484c-987f-68548b17ff47;
9;G;0;5cae9f60-336b-484c-987f-68548b17ff47;
27;P;0;a82aecdc-2abd-4d4e-b326-e8a58f790475;
22;Y;0;a82aecdc-2abd-4d4e-b326-e8a58f790475;
15;P;0;a82aecdc-2abd-4d4e-b326-e8a58f790475;
11;R;0;a82aecdc-2abd-4d4e-b326-e8a58f790475;
8;P;0;5cae9f60-336b-484c-987f-68548b17ff47;
9;G;0;5cae9f60-336b-484c-987f-68548b17ff47;
5;G;0;a82aecdc-2abd-4d4e-b326-e8a58f790475;
19;P;0;5cae9f60-336b-484c-987f-68548b17ff47;
16;B;0;a82aecdc-2abd-4d4e-b326-e8a58f790475;
21;B;0;5cae9f60-336b-484c-987f-68548b17ff47;
14;P;0;a82aecdc-2abd-4d4e-b326-e8a58f790475;
27;G;0;a82aecdc-2abd-4d4e-b326-e8a58f790475;
7;R;0;5cae9f60-336b-484c-987f-68548b17ff47;
15;Y;0;a82aecdc-2abd-4d4e-b326-e8a58f790475;
17;R;0;5cae9f60-336b-484c-987f-68548b17ff47;
Pass;;0;a82aecdc-2abd-4d4e-b326-e8a58f790475;
10;B;0;a82aecdc-2abd-4d4e-b326-e8a58f790475;
Pass;;0;5cae9f60-336b-484c-987f-68548b17ff47;
17;Y;0;5cae9f60-336b-484c-987f-68548b17ff47;
16;P;0;a82aecdc-2abd-4d4e-b326-e8a58f790475;
26;R;0;5cae9f60-336b-484c-987f-68548b17ff47;
12;Y;0;5cae9f60-336b-484c-987f-68548b17ff47;
20;R;0;a82aecdc-2abd-4d4e-b326-e8a58f790475;
24;G;0;5cae9f60-336b-484c-987f-68548b17ff47;
11;R;0;a82aecdc-2abd-4d4e-b326-e8a58f790475;
26;R;0;5cae9f60-336b-484c-987f-68548b17ff47;
23;B;0;a82aecdc-2abd-4d4e-b326-e8a58f790475;
14;G;0;5cae9f60-336b-484c-987f-68548b17ff47;
6;B;0;5cae9f60-336b-484c-987f-68548b17ff47;
25;G;0;a82aecdc-2abd-4d4e-b326-e8a58f790475;
10;P;0;a82aecdc-2abd-4d4e-b326-e8a58f790475;
7;R;0;a82aecdc-2abd-4d4e-b326-e8a58f790475;
22;Y;0;5cae9f60-336b-484c-987f-68548b17ff47;
13;G;0;5cae9f60-336b-484c-987f-68548b17ff47;
3;R;0;5cae9f60-336b-484c-987f-68548b17ff47;
25;P;0;5cae9f60-336b-484c-987f-68548b17ff47;
21;G;0;a82aecdc-2abd-4d4e-b326-e8a58f790475;
11;Y;0;a82aecdc-2abd-4d4e-b326-e8a58f790475;
Pass;;0;a82aecdc-2abd-4d4e-b326-e8a58f790475;
19;R;0;5cae9f60-336b-484c-987f-68548b17ff47;
24;P;0;a82aecdc-2abd-4d4e-b326-e8a58f790475;
6;P;0;5cae9f60-336b-484c-987f-68548b17ff47;
8;Y;0;5cae9f60-336b-484c-987f-68548b17ff47;
20;R;0;a82aecdc-2abd-4d4e-b326-e8a58f790475;
18;G;0;5cae9f60-336b-484c-987f-68548b17ff47;
Pass;;0;a82aecdc-2abd-4d4e-b326-e8a58f790475;
15;Y;0;a82aecdc-2abd-4d4e-b326-e8a58f790475;
5;G;0;5cae9f60-336b-484c-987f-68548b17ff47;
12;Y;0;5cae9f60-336b-484c-987f-68548b17ff47;
23;Y;0;5cae9f60-336b-484c-987f-68548b17ff47;
16;Y;0;5cae9f60-336b-484c-987f-68548b17ff47;
24;B;0;5cae9f60-336b-484c-987f-68548b17ff47;
Pass;;0;5cae9f60-336b-484c-987f-68548b17ff47;
Pass;;0;5cae9f60-336b-484c-987f-68548b17ff47;
22;G;0;a82aecdc-2abd-4d4e-b326-e8a58f790475;
17;B;0;a82aecdc-2abd-4d4e-b326-e8a58f790475;
23;P;0;a82aecdc-2abd-4d4e-b326-e8a58f790475;
27;G;0;a82aecdc-2abd-4d4e-b326-e8a58f790475;
13;P;0;5cae9f60-336b-484c-987f-68548b17ff47;
12;G;0;a82aecdc-2abd-4d4e-b326-e8a58f790475;
21;B;0;5cae9f60-336b-484c-987f-68548b17ff47;
15;G;0;a82aecdc-2abd-4d4e-b326-e8a58f790475;
18;B;0;5cae9f60-336b-484c-987f-68548b17ff47;
8;G;0;5cae9f60-336b-484c-987f-68548b17ff47;
22;G;0;a82aecdc-2abd-4d4e-b326-e8a58f790475;
11;Y;0;a82aecdc-2abd-4d4e-b326-e8a58f790475;
26;P;0;5cae9f60-336b-484c-987f-68548b17ff47;
19;R;0;5cae9f60-336b-484c-987f-68548b17ff47;
25;G;0;a82aecdc-2abd-4d4e-b326-e8a58f790475;
9;P;0;5cae9f60-336b-484c-987f-68548b17ff47;
18;P;0;a82aecdc-2abd-4d4e-b326-e8a58f790475;
14;R;0;5cae9f60-336b-484c-987f-68548b17ff47;
5;G;0;a82aecdc-2abd-4d4e-b326-e8a58f790475;
21;P;0;a82aecdc-2abd-4d4e-b326-e8a58f790475;
7;Y;0;5cae9f60-336b-484c-987f-68548b17ff47;
Pass;;0;a82aecdc-2abd-4d4e-b326-e8a58f790475;
17;P;0;5cae9f60-336b-484c-987f-68548b17ff47;
17;P;0;5cae9f60-336b-484c-987f-68548b17ff47;
Pass;;0;5cae9f60-336b-484c-987f-68548b17ff47;
15;G;0;a82aecdc-2abd-4d4e-b326-e8a58f790475;
16;G;0;a82aecdc-2abd-4d4e-b326-e8a58f790475;
19;P;0;5cae9f60-336b-484c-987f-68548b17ff47;
27;G;0;a82aecdc-2abd-4d4e-b326-e8a58f790475;
20;P;0;a82aecdc-2abd-4d4e-b326-e8a58f790475;
13;R;0;5cae9f60-336b-484c-987f-68548b17ff47;
11;G;0;5cae9f60-336b-484c-987f-68548b17ff47;
16;P;0;a82aecdc-2abd-4d4e-b326-e8a58f790475;
14;R;0;a82aecdc-2abd-4d4e-b326-e8a58f790475;
12;B;0;5cae9f60-336b-484c-987f-68548b17ff47;
13;R;0;5cae9f60-336b-484c-987f-68548b17ff47;
10;P;0;a82aecdc-2abd-4d4e-b326-e8a58f790475;
12;P;0;a82aecdc-2abd-4d4e-b326-e8a58f790475;
9;R;0;5cae9f60-336b-484c-987f-68548b17ff47;
8;P;0;5cae9f60-336b-484c-987f-68548b17ff47;
9;R;0;a82aecdc-2abd-4d4e-b326-e8a58f790475;
8;B;0;a82aecdc-2abd-4d4e-b326-e8a58f790475;
24;R;0;5cae9f60-336b-484c-987f-68548b17ff47;
5;B;0;5cae9f60-336b-484c-987f-68548b17ff47;
23;R;0;a82aecdc-2abd-4d4e-b326-e8a58f790475;
7;G;0;5cae9f60-336b-484c-987f-68548b17ff47;
26;R;0;5cae9f60-336b-484c-987f-68548b17ff47;
Pass;;0;a82aecdc-2abd-4d4e-b326-e8a58f790475;
5;R;0;a82aecdc-2abd-4d4e-b326-e8a58f790475;
20;R;0;a82aecdc-2abd-4d4e-b326-e8a58f790475;
11;P;0;5cae9f60-336b-484c-987f-68548b17ff47;
Pass;;0;5cae9f60-336b-484c-987f-68548b17ff47;
Pass;;0;a82aecdc-2abd-4d4e-b326-e8a58f790475;
Pass;;0;5cae9f60-336b-484c-987f-68548b17ff47;
27;B;0;a82aecdc-2abd-4d4e-b326-e8a58f790475;
22;Y;0;5cae9f60-336b-484c-987f-68548b17ff47;
21;G;0;a82aecdc-2abd-4d4e-b326-e8a58f790475;
18;R;0;5cae9f60-336b-484c-987f-68548b17ff47;
15;Y;0;a82aecdc-2abd-4d4e-b326-e8a58f790475;
25;R;0;5cae9f60-336b-484c-987f-68548b17ff47;
16;Y;0;5cae9f60-336b-484c-987f-68548b17ff47;
24;Y;0;a82aecdc-2abd-4d4e-b326-e8a58f790475;
17;R;0;a82aecdc-2abd-4d4e-b326-e8a58f790475;
26;R;0;5cae9f60-336b-484c-987f-68548b17ff47;
25;Y;0;a82aecdc-2abd-4d4e-b326-e8a58f790475;
14;P;0;5cae9f60-336b-484c-987f-68548b17ff47;
13;P;0;a82aecdc-2abd-4d4e-b326-e8a58f790475;
18;Y;0;5cae9f60-336b-484c-987f-68548b17ff47;
9;P;0;5cae9f60-336b-484c-987f-68548b17ff47;
23;P;0;a82aecdc-2abd-4d4e-b326-e8a58f790475;
12;R;0;a82aecdc-2abd-4d4e-b326-e8a58f790475;
8;R;0;5cae9f60-336b-484c-987f-68548b17ff47;
5;R;0;a82aecdc-2abd-4d4e-b326-e8a58f790475;
11;Y;0;5cae9f60-336b-484c-987f-68548b17ff47;
22;G;0;5cae9f60-336b-484c-987f-68548b17ff47;
Pass;;0;a82aecdc-2abd-4d4e-b326-e8a58f790475;
19;R;0;5cae9f60-336b-484c-987f-68548b17ff47;
21;G;0;a82aecdc-2abd-4d4e-b326-e8a58f790475;
Pass;;0;5cae9f60-336b-484c-987f-68548b17ff47;
20;B;0;a82aecdc-2abd-4d4e-b326-e8a58f790475;
19;R;0;5cae9f60-336b-484c-987f-68548b17ff47;
17;P;0;a82aecdc-2abd-4d4e-b326-e8a58f790475;
24;G;0;5cae9f60-336b-484c-987f-68548b17ff47;
16;G;0;5cae9f60-336b-484c-987f-68548b17ff47;
23;Y;0;a82aecdc-2abd-4d4e-b326-e8a58f790475;
15;G;0;a82aecdc-2abd-4d4e-b326-e8a58f790475;
13;Y;0;5cae9f60-336b-484c-987f-68548b17ff47;
14;R;0;a82aecdc-2abd-4d4e-b326-e8a58f790475;
9;R;0;5cae9f60-336b-484c-987f-68548b17ff47;
18;Y;0;5cae9f60-336b-484c-987f-68548b17ff47;
12;Y;0;a82aecdc-2abd-4d4e-b326-e8a58f790475;
22;P;0;a82aecdc-2abd-4d4e-b326-e8a58f790475;
8;Y;0;5cae9f60-336b-484c-987f-68548b17ff47;
5;Y;0;a82aecdc-2abd-4d4e-b326-e8a58f790475;
17;G;0;5cae9f60-336b-484c-987f-68548b17ff47;
11;G;0;5cae9f60-336b-484c-987f-68548b17ff47;
21;G;0;a82aecdc-2abd-4d4e-b326-e8a58f790475;
10;G;0;a82aecdc-2abd-4d4e-b326-e8a58f790475;
Pass;;0;5cae9f60-336b-484c-987f-68548b17ff47;
16;P;0;5cae9f60-336b-484c-987f-68548b17ff47;
Pass;;0;a82aecdc-2abd-4d4e-b326-e8a58f790475;
15;P;0;a82aecdc-2abd-4d4e-b326-e8a58f790475;
14;R;0;5cae9f60-336b-484c-987f-68548b17ff47;
13;Y;0;a82aecdc-2abd-4d4e-b326-e8a58f790475;
9;Y;0;5cae9f60-336b-484c-987f-68548b17ff47;
12;G;0;a82aecdc-2abd-4d4e-b326-e8a58f790475;
8;G;0;5cae9f60-336b-484c-987f-68548b17ff47;
5;G;0;a82aecdc-2abd-4d4e-b326-e8a58f790475;
11;P;0;5cae9f60-336b-484c-987f-68548b17ff47;
10;P;0;a82aecdc-2abd-4d4e-b326-e8a58f790475;
Pass;;0;5cae9f60-336b-484c-987f-68548b17ff47;
Pass;;0;a82aecdc-2abd-4d4e-b326-e8a58f790475;
