train_test.py
Namespace(acoustic_model='/data/coros1/qraymondaud/acoustic_models/finalf12.raw', architecture='tdnn', batch_size=128, data='/data/coros1/qraymondaud/MELD/meld-mfcc-hires', feature_size=1536, kaldi_pybind_path='/users/qraymondaud/kaldi/src/pybind', load_egs='exp/pytorch_egs/', load_model='', lr=0.001, max_seq_len=600, mode='train-test', model_dir='exp/pytorch_resnet_block256_ecapatdnn_good/tdnn_sentiment/finalf12', multi_gpu=True, num_epochs=5, num_iterations=75, output_size=3, rollback_threshold=7, task='sentiment', use_cuda=True, weight_decay=0.001)
SGD

-=-=-=-=-=-=-=-=-=-=-=-=-=-=-=-- Train epoch 0 --=-=-=-=-=-=-=-=-=-=-=-=-=-


-=-=-=-=-=-=-=-=-=-=-=-=-=-=-=-- Test iteration 0 on DEV -- LR :0.0009869333333333335 C-LOSS : 1.1530333757400513 AVG-LOSS :1.1530333757400513

Confusion Matrix : 
[[405   0   0]
 [469   0   0]
 [233   0   0]]
F-Measure : 0.195993031358885
> Save best model exp/pytorch_resnet_block256_ecapatdnn_good/tdnn_sentiment/finalf12/finalf12_tdnn_sentiment_pid-2814.mat

-=-=-=-=-=-=-=-=-=-=-=-=-=-=-=-- Test iteration 1 on DEV -- LR :0.0009738666666666665 C-LOSS : 39.9774055480957 AVG-LOSS :20.565219461917877

Confusion Matrix : 
[[  0 406   0]
 [  0 469   0]
 [  0 232   0]]
F-Measure : 0.25215747504344754
> Save best model exp/pytorch_resnet_block256_ecapatdnn_good/tdnn_sentiment/finalf12/finalf12_tdnn_sentiment_pid-2814.mat

-=-=-=-=-=-=-=-=-=-=-=-=-=-=-=-- Test iteration 2 on DEV -- LR :0.0009607999999999999 C-LOSS : 17.757204055786133 AVG-LOSS :19.62921432654063

Confusion Matrix : 
[[  0   0 406]
 [  0   0 469]
 [  0   0 232]]
F-Measure : 0.07262359902663006

-=-=-=-=-=-=-=-=-=-=-=-=-=-=-=-- Test iteration 3 on DEV -- LR :0.0009477333333333335 C-LOSS : 39.427608489990234 AVG-LOSS :24.57881286740303

Confusion Matrix : 
[[406   0   0]
 [469   0   0]
 [232   0   0]]
F-Measure : 0.19683191324092134

-=-=-=-=-=-=-=-=-=-=-=-=-=-=-=-- Test iteration 4 on DEV -- LR :0.0009346666666666665 C-LOSS : 15.399282455444336 AVG-LOSS :22.742906785011293

Confusion Matrix : 
[[406   0   0]
 [469   0   0]
 [232   0   0]]
F-Measure : 0.19683191324092134

-=-=-=-=-=-=-=-=-=-=-=-=-=-=-=-- Test iteration 5 on DEV -- LR :0.0009216 C-LOSS : 2.4629170894622803 AVG-LOSS :19.36290850241979

Confusion Matrix : 
[[406   0   0]
 [469   0   0]
 [232   0   0]]
F-Measure : 0.19683191324092134

-=-=-=-=-=-=-=-=-=-=-=-=-=-=-=-- Test iteration 6 on DEV -- LR :0.0009085333333333334 C-LOSS : 2.942126512527466 AVG-LOSS :17.017082503863744

Confusion Matrix : 
[[  0  19 387]
 [  0  19 450]
 [  0   7 225]]
F-Measure : 0.10420344496366298

-=-=-=-=-=-=-=-=-=-=-=-=-=-=-=-- Test iteration 7 on DEV -- LR :0.0008954666666666669 C-LOSS : 2.8037354946136475 AVG-LOSS :15.240414127707481

Confusion Matrix : 
[[  0 402   4]
 [  0 467   2]
 [  0 226   6]]
F-Measure : 0.2633156266715631
> Save best model exp/pytorch_resnet_block256_ecapatdnn_good/tdnn_sentiment/finalf12/finalf12_tdnn_sentiment_pid-2814.mat

-=-=-=-=-=-=-=-=-=-=-=-=-=-=-=-- Test iteration 8 on DEV -- LR :0.0008823999999999999 C-LOSS : 2.659879684448242 AVG-LOSS :13.842576967345344

Confusion Matrix : 
[[  0 342  64]
 [  0 420  49]
 [  0 194  38]]
F-Measure : 0.2913276525921779
> Save best model exp/pytorch_resnet_block256_ecapatdnn_good/tdnn_sentiment/finalf12/finalf12_tdnn_sentiment_pid-2814.mat

-=-=-=-=-=-=-=-=-=-=-=-=-=-=-=-- Test iteration 9 on DEV -- LR :0.0008693333333333334 C-LOSS : 2.2043838500976562 AVG-LOSS :12.678757655620576

Confusion Matrix : 
[[  0   0 406]
 [  0   0 469]
 [  0   0 232]]
F-Measure : 0.07262359902663006

-=-=-=-=-=-=-=-=-=-=-=-=-=-=-=-- Test iteration 10 on DEV -- LR :0.0008562666666666668 C-LOSS : 1.3510888814926147 AVG-LOSS :11.648969585245306

Confusion Matrix : 
[[  0   2 404]
 [  0   2 467]
 [  0   2 230]]
F-Measure : 0.0758893303414286

-=-=-=-=-=-=-=-=-=-=-=-=-=-=-=-- Test iteration 11 on DEV -- LR :0.0008431999999999999 C-LOSS : 1.111372947692871 AVG-LOSS :10.770836532115936

Confusion Matrix : 
[[405   0   1]
 [468   1   0]
 [232   0   0]]
F-Measure : 0.1984098365750028

-=-=-=-=-=-=-=-=-=-=-=-=-=-=-=-- Test iteration 12 on DEV -- LR :0.0008301333333333334 C-LOSS : 1.354773759841919 AVG-LOSS :10.046524011171782

Confusion Matrix : 
[[406   0   0]
 [469   0   0]
 [232   0   0]]
F-Measure : 0.19683191324092134

-=-=-=-=-=-=-=-=-=-=-=-=-=-=-=-- Test iteration 13 on DEV -- LR :0.0008170666666666668 C-LOSS : 1.238870620727539 AVG-LOSS :9.417405911854335

Confusion Matrix : 
[[406   0   0]
 [469   0   0]
 [232   0   0]]
F-Measure : 0.19683191324092134

-=-=-=-=-=-=-=-=-=-=-=-=-=-=-=-- Test iteration 14 on DEV -- LR :0.0008039999999999998 C-LOSS : 1.2518068552017212 AVG-LOSS :8.873032641410827

Confusion Matrix : 
[[406   0   0]
 [469   0   0]
 [232   0   0]]
F-Measure : 0.19683191324092134

-=-=-=-=-=-=-=-=-=-=-=-=-=-=-=-- Test iteration 15 on DEV -- LR :0.0007909333333333333 C-LOSS : 1.0967216491699219 AVG-LOSS :8.387013204395771

Confusion Matrix : 
[[406   0   0]
 [468   1   0]
 [232   0   0]]
F-Measure : 0.1987649338011636

-=-=-=-=-=-=-=-=-=-=-=-=-=-=-=-- Test iteration 16 on DEV -- LR :0.0007778666666666669 C-LOSS : 1.081526756286621 AVG-LOSS :7.957278707448174

Confusion Matrix : 
[[406   0   0]
 [469   0   0]
 [232   0   0]]
F-Measure : 0.19683191324092134

-=-=-=-=-=-=-=-=-=-=-=-=-=-=-=-- Test iteration 17 on DEV -- LR :0.0007647999999999998 C-LOSS : 1.157076120376587 AVG-LOSS :7.579489674833086

Confusion Matrix : 
[[406   0   0]
 [469   0   0]
 [232   0   0]]
F-Measure : 0.19683191324092134

-=-=-=-=-=-=-=-=-=-=-=-=-=-=-=-- Test iteration 18 on DEV -- LR :0.0007517333333333332 C-LOSS : 1.2118850946426392 AVG-LOSS :7.244352591665168

Confusion Matrix : 
[[404   0   2]
 [468   0   1]
 [230   0   2]]
F-Measure : 0.20004884675050366

-=-=-=-=-=-=-=-=-=-=-=-=-=-=-=-- Test iteration 19 on DEV -- LR :0.0007386666666666668 C-LOSS : 1.117932677268982 AVG-LOSS :6.9380315959453585

Confusion Matrix : 
[[406   0   0]
 [469   0   0]
 [232   0   0]]
F-Measure : 0.19683191324092134

-=-=-=-=-=-=-=-=-=-=-=-=-=-=-=-- Test iteration 20 on DEV -- LR :0.0007255999999999999 C-LOSS : 1.091638207435608 AVG-LOSS :6.659631910778227

Confusion Matrix : 
[[406   0   0]
 [469   0   0]
 [232   0   0]]
F-Measure : 0.19683191324092134

-=-=-=-=-=-=-=-=-=-=-=-=-=-=-=-- Test iteration 21 on DEV -- LR :0.0007125333333333333 C-LOSS : 1.097712516784668 AVG-LOSS :6.406817392869429

Confusion Matrix : 
[[406   0   0]
 [469   0   0]
 [232   0   0]]
F-Measure : 0.19683191324092134

-=-=-=-=-=-=-=-=-=-=-=-=-=-=-=-- Test iteration 22 on DEV -- LR :0.0006994666666666667 C-LOSS : 1.082534909248352 AVG-LOSS :6.175326850103295

Confusion Matrix : 
[[406   0   0]
 [469   0   0]
 [232   0   0]]
F-Measure : 0.19683191324092134

-=-=-=-=-=-=-=-=-=-=-=-=-=-=-=-- Test iteration 23 on DEV -- LR :0.0006864000000000002 C-LOSS : 1.1039304733276367 AVG-LOSS :5.964018667737643

Confusion Matrix : 
[[406   0   0]
 [469   0   0]
 [232   0   0]]
F-Measure : 0.19683191324092134

-=-=-=-=-=-=-=-=-=-=-=-=-=-=-=-- Test iteration 24 on DEV -- LR :0.0006733333333333333 C-LOSS : 1.1069916486740112 AVG-LOSS :5.769737586975098

Confusion Matrix : 
[[406   0   0]
 [469   0   0]
 [232   0   0]]
F-Measure : 0.19683191324092134

-=-=-=-=-=-=-=-=-=-=-=-=-=-=-=-- Test iteration 25 on DEV -- LR :0.0006602666666666667 C-LOSS : 1.1140457391738892 AVG-LOSS :5.590672515905821

Confusion Matrix : 
[[406   0   0]
 [469   0   0]
 [232   0   0]]
F-Measure : 0.19683191324092134

-=-=-=-=-=-=-=-=-=-=-=-=-=-=-=-- Test iteration 26 on DEV -- LR :0.0006472000000000001 C-LOSS : 1.0978707075119019 AVG-LOSS :5.424272448928268

Confusion Matrix : 
[[406   0   0]
 [469   0   0]
 [232   0   0]]
F-Measure : 0.19683191324092134

-=-=-=-=-=-=-=-=-=-=-=-=-=-=-=-- Test iteration 27 on DEV -- LR :0.0006341333333333332 C-LOSS : 1.1242985725402832 AVG-LOSS :5.270701953342983

Confusion Matrix : 
[[406   0   0]
 [469   0   0]
 [232   0   0]]
F-Measure : 0.19683191324092134

-=-=-=-=-=-=-=-=-=-=-=-=-=-=-=-- Test iteration 28 on DEV -- LR :0.0006210666666666667 C-LOSS : 1.126189947128296 AVG-LOSS :5.127787746232132

Confusion Matrix : 
[[406   0   0]
 [469   0   0]
 [232   0   0]]
F-Measure : 0.19683191324092134

-=-=-=-=-=-=-=-=-=-=-=-=-=-=-=-- Test iteration 29 on DEV -- LR :0.0006080000000000001 C-LOSS : 1.1077333688735962 AVG-LOSS :4.9937859336535135

Confusion Matrix : 
[[406   0   0]
 [469   0   0]
 [232   0   0]]
F-Measure : 0.19683191324092134

-=-=-=-=-=-=-=-=-=-=-=-=-=-=-=-- Test iteration 30 on DEV -- LR :0.0005949333333333336 C-LOSS : 1.0938818454742432 AVG-LOSS :4.867982575970311

Confusion Matrix : 
[[406   0   0]
 [469   0   0]
 [232   0   0]]
F-Measure : 0.19683191324092134

-=-=-=-=-=-=-=-=-=-=-=-=-=-=-=-- Test iteration 31 on DEV -- LR :0.0005818666666666666 C-LOSS : 1.0875439643859863 AVG-LOSS :4.749843869358301

Confusion Matrix : 
[[406   0   0]
 [469   0   0]
 [232   0   0]]
F-Measure : 0.19683191324092134

-=-=-=-=-=-=-=-=-=-=-=-=-=-=-=-- Test iteration 32 on DEV -- LR :0.0005688000000000002 C-LOSS : 1.0894997119903564 AVG-LOSS :4.63892434943806

Confusion Matrix : 
[[406   0   0]
 [469   0   0]
 [232   0   0]]
F-Measure : 0.19683191324092134

-=-=-=-=-=-=-=-=-=-=-=-=-=-=-=-- Test iteration 33 on DEV -- LR :0.0005557333333333336 C-LOSS : 1.0925756692886353 AVG-LOSS :4.534619976492489

Confusion Matrix : 
[[406   0   0]
 [469   0   0]
 [232   0   0]]
F-Measure : 0.19683191324092134

-=-=-=-=-=-=-=-=-=-=-=-=-=-=-=-- Test iteration 34 on DEV -- LR :0.0005426666666666666 C-LOSS : 1.1039237976074219 AVG-LOSS :4.436600085667202

Confusion Matrix : 
[[406   0   0]
 [469   0   0]
 [232   0   0]]
F-Measure : 0.19683191324092134

-=-=-=-=-=-=-=-=-=-=-=-=-=-=-=-- Test iteration 35 on DEV -- LR :0.0005296000000000001 C-LOSS : 1.069949746131897 AVG-LOSS :4.34308202068011

Confusion Matrix : 
[[406   0   0]
 [469   0   0]
 [232   0   0]]
F-Measure : 0.19683191324092134

-=-=-=-=-=-=-=-=-=-=-=-=-=-=-=-- Test iteration 36 on DEV -- LR :0.0005165333333333336 C-LOSS : 1.0795526504516602 AVG-LOSS :4.254878524187449

Confusion Matrix : 
[[406   0   0]
 [469   0   0]
 [232   0   0]]
F-Measure : 0.19683191324092134

-=-=-=-=-=-=-=-=-=-=-=-=-=-=-=-- Test iteration 37 on DEV -- LR :0.0005034666666666666 C-LOSS : 1.08757483959198 AVG-LOSS :4.17152842722441

Confusion Matrix : 
[[406   0   0]
 [469   0   0]
 [232   0   0]]
F-Measure : 0.19683191324092134

-=-=-=-=-=-=-=-=-=-=-=-=-=-=-=-- Test iteration 38 on DEV -- LR :0.0004904 C-LOSS : 1.0896334648132324 AVG-LOSS :4.092505479470278

Confusion Matrix : 
[[406   0   0]
 [469   0   0]
 [232   0   0]]
F-Measure : 0.19683191324092134

-=-=-=-=-=-=-=-=-=-=-=-=-=-=-=-- Test iteration 39 on DEV -- LR :0.0004773333333333335 C-LOSS : 1.0989127159118652 AVG-LOSS :4.017665660381317

Confusion Matrix : 
[[406   0   0]
 [469   0   0]
 [232   0   0]]
F-Measure : 0.19683191324092134

-=-=-=-=-=-=-=-=-=-=-=-=-=-=-=-- Test iteration 40 on DEV -- LR :0.0004642666666666665 C-LOSS : 1.0842715501785278 AVG-LOSS :3.946119462571493

Confusion Matrix : 
[[406   0   0]
 [469   0   0]
 [232   0   0]]
F-Measure : 0.19683191324092134

-=-=-=-=-=-=-=-=-=-=-=-=-=-=-=-- Test iteration 41 on DEV -- LR :0.0004512 C-LOSS : 1.0810871124267578 AVG-LOSS :3.877904406615666

Confusion Matrix : 
[[406   0   0]
 [469   0   0]
 [232   0   0]]
F-Measure : 0.19683191324092134

-=-=-=-=-=-=-=-=-=-=-=-=-=-=-=-- Test iteration 42 on DEV -- LR :0.00043813333333333343 C-LOSS : 1.0775561332702637 AVG-LOSS :3.812780028165773

Confusion Matrix : 
[[406   0   0]
 [469   0   0]
 [232   0   0]]
F-Measure : 0.19683191324092134

-=-=-=-=-=-=-=-=-=-=-=-=-=-=-=-- Test iteration 43 on DEV -- LR :0.0004250666666666665 C-LOSS : 1.0866467952728271 AVG-LOSS :3.7508224546909332

Confusion Matrix : 
[[406   0   0]
 [469   0   0]
 [232   0   0]]
F-Measure : 0.19683191324092134

-=-=-=-=-=-=-=-=-=-=-=-=-=-=-=-- Test iteration 44 on DEV -- LR :0.00041199999999999993 C-LOSS : 1.0875012874603271 AVG-LOSS :3.6916375398635863

Confusion Matrix : 
[[406   0   0]
 [469   0   0]
 [232   0   0]]
F-Measure : 0.19683191324092134

-=-=-=-=-=-=-=-=-=-=-=-=-=-=-=-- Test iteration 45 on DEV -- LR :0.00039893333333333345 C-LOSS : 1.0836646556854248 AVG-LOSS :3.6349424771640613

Confusion Matrix : 
[[406   0   0]
 [469   0   0]
 [232   0   0]]
F-Measure : 0.19683191324092134

-=-=-=-=-=-=-=-=-=-=-=-=-=-=-=-- Test iteration 46 on DEV -- LR :0.00038586666666666643 C-LOSS : 1.103045105934143 AVG-LOSS :3.581072320329382

Confusion Matrix : 
[[406   0   0]
 [469   0   0]
 [232   0   0]]
F-Measure : 0.19683191324092134

-=-=-=-=-=-=-=-=-=-=-=-=-=-=-=-- Test iteration 47 on DEV -- LR :0.00037279999999999995 C-LOSS : 1.0900235176086426 AVG-LOSS :3.5291754702727

Confusion Matrix : 
[[405   0   1]
 [468   0   1]
 [232   0   0]]
F-Measure : 0.19660699585156013

-=-=-=-=-=-=-=-=-=-=-=-=-=-=-=-- Test iteration 48 on DEV -- LR :0.00035973333333333337 C-LOSS : 1.081218957901001 AVG-LOSS :3.479217174101849

Confusion Matrix : 
[[404   0   2]
 [465   0   4]
 [232   0   0]]
F-Measure : 0.19664210798268122

-=-=-=-=-=-=-=-=-=-=-=-=-=-=-=-- Test iteration 49 on DEV -- LR :0.0003466666666666669 C-LOSS : 1.0932997465133667 AVG-LOSS :3.4314988255500793

Confusion Matrix : 
[[402   0   4]
 [464   0   5]
 [229   0   3]]
F-Measure : 0.20160427945188789

-=-=-=-=-=-=-=-=-=-=-=-=-=-=-=-- Test iteration 50 on DEV -- LR :0.00033359999999999987 C-LOSS : 1.0581892728805542 AVG-LOSS :3.3849633441251865

Confusion Matrix : 
[[401   0   5]
 [464   0   5]
 [226   0   6]]
F-Measure : 0.2066264611475673

-=-=-=-=-=-=-=-=-=-=-=-=-=-=-=-- Test iteration 51 on DEV -- LR :0.0003205333333333334 C-LOSS : 1.1142059564590454 AVG-LOSS :3.3412949328239145

Confusion Matrix : 
[[400   0   6]
 [464   0   5]
 [224   0   8]]
F-Measure : 0.209748680881032

-=-=-=-=-=-=-=-=-=-=-=-=-=-=-=-- Test iteration 52 on DEV -- LR :0.0003074666666666668 C-LOSS : 1.0667046308517456 AVG-LOSS :3.2983781346734964

Confusion Matrix : 
[[401   0   5]
 [464   0   5]
 [225   0   7]]
F-Measure : 0.2084004127558546

-=-=-=-=-=-=-=-=-=-=-=-=-=-=-=-- Test iteration 53 on DEV -- LR :0.0002944000000000003 C-LOSS : 1.0776034593582153 AVG-LOSS :3.2572526777232134

Confusion Matrix : 
[[401   0   5]
 [464   0   5]
 [225   0   7]]
F-Measure : 0.2084004127558546

-=-=-=-=-=-=-=-=-=-=-=-=-=-=-=-- Test iteration 54 on DEV -- LR :0.0002813333333333333 C-LOSS : 1.078476905822754 AVG-LOSS :3.2176385727795687

Confusion Matrix : 
[[401   0   5]
 [464   0   5]
 [227   0   5]]
F-Measure : 0.20483938440100785

-=-=-=-=-=-=-=-=-=-=-=-=-=-=-=-- Test iteration 55 on DEV -- LR :0.0002682666666666668 C-LOSS : 1.0814838409423828 AVG-LOSS :3.1794929525681903

Confusion Matrix : 
[[402   0   4]
 [464   0   5]
 [228   0   4]]
F-Measure : 0.20342503180133845

-=-=-=-=-=-=-=-=-=-=-=-=-=-=-=-- Test iteration 56 on DEV -- LR :0.00025520000000000024 C-LOSS : 1.0890928506851196 AVG-LOSS :3.1428192665702417

Confusion Matrix : 
[[402   0   4]
 [465   0   4]
 [231   0   1]]
F-Measure : 0.19779814385354355

-=-=-=-=-=-=-=-=-=-=-=-=-=-=-=-- Test iteration 57 on DEV -- LR :0.00024213333333333333 C-LOSS : 1.0685052871704102 AVG-LOSS :3.1070552324426584

Confusion Matrix : 
[[404   0   2]
 [465   0   4]
 [232   0   0]]
F-Measure : 0.19664210798268122

-=-=-=-=-=-=-=-=-=-=-=-=-=-=-=-- Test iteration 58 on DEV -- LR :0.00022906666666666674 C-LOSS : 1.07883882522583 AVG-LOSS :3.0726786831677972

Confusion Matrix : 
[[404   0   2]
 [465   0   4]
 [232   0   0]]
F-Measure : 0.19664210798268122

-=-=-=-=-=-=-=-=-=-=-=-=-=-=-=-- Test iteration 59 on DEV -- LR :0.00021600000000000026 C-LOSS : 1.0896027088165283 AVG-LOSS :3.0396274169286093

Confusion Matrix : 
[[403   0   3]
 [465   0   4]
 [232   0   0]]
F-Measure : 0.19628561934136388

-=-=-=-=-=-=-=-=-=-=-=-=-=-=-=-- Test iteration 60 on DEV -- LR :0.00020293333333333324 C-LOSS : 1.0376818180084229 AVG-LOSS :3.0068086366184423

Confusion Matrix : 
[[403   0   3]
 [465   0   4]
 [232   0   0]]
F-Measure : 0.19628561934136388

-=-=-=-=-=-=-=-=-=-=-=-=-=-=-=-- Test iteration 61 on DEV -- LR :0.00018986666666666676 C-LOSS : 1.0925992727279663 AVG-LOSS :2.9759342920395637

Confusion Matrix : 
[[402   0   4]
 [464   0   5]
 [230   0   2]]
F-Measure : 0.19976979379605314

-=-=-=-=-=-=-=-=-=-=-=-=-=-=-=-- Test iteration 62 on DEV -- LR :0.00017680000000000018 C-LOSS : 1.0686737298965454 AVG-LOSS :2.9456603148626903

Confusion Matrix : 
[[402   0   4]
 [464   0   5]
 [230   0   2]]
F-Measure : 0.19976979379605314

-=-=-=-=-=-=-=-=-=-=-=-=-=-=-=-- Test iteration 63 on DEV -- LR :0.00016373333333333327 C-LOSS : 1.064367413520813 AVG-LOSS :2.9162651132792234

Confusion Matrix : 
[[402   0   4]
 [464   0   5]
 [230   0   2]]
F-Measure : 0.19976979379605314

-=-=-=-=-=-=-=-=-=-=-=-=-=-=-=-- Test iteration 64 on DEV -- LR :0.00015066666666666668 C-LOSS : 1.0966790914535522 AVG-LOSS :2.888271482174213

Confusion Matrix : 
[[402   0   4]
 [464   0   5]
 [230   0   2]]
F-Measure : 0.19976979379605314

-=-=-=-=-=-=-=-=-=-=-=-=-=-=-=-- Test iteration 65 on DEV -- LR :0.0001376000000000002 C-LOSS : 1.066538691520691 AVG-LOSS :2.8606694701946145

Confusion Matrix : 
[[402   0   4]
 [464   0   5]
 [230   0   2]]
F-Measure : 0.19976979379605314

-=-=-=-=-=-=-=-=-=-=-=-=-=-=-=-- Test iteration 66 on DEV -- LR :0.00012453333333333318 C-LOSS : 1.0754050016403198 AVG-LOSS :2.834023731857983

Confusion Matrix : 
[[402   0   4]
 [464   0   5]
 [230   0   2]]
F-Measure : 0.19976979379605314

-=-=-=-=-=-=-=-=-=-=-=-=-=-=-=-- Test iteration 67 on DEV -- LR :0.0001114666666666667 C-LOSS : 1.0744011402130127 AVG-LOSS :2.8081469290396748

Confusion Matrix : 
[[402   0   4]
 [464   0   5]
 [230   0   2]]
F-Measure : 0.19976979379605314

-=-=-=-=-=-=-=-=-=-=-=-=-=-=-=-- Test iteration 68 on DEV -- LR :9.840000000000011e-05 C-LOSS : 1.0632131099700928 AVG-LOSS :2.78285803311113

Confusion Matrix : 
[[402   0   4]
 [464   0   5]
 [230   0   2]]
F-Measure : 0.19976979379605314

-=-=-=-=-=-=-=-=-=-=-=-=-=-=-=-- Test iteration 69 on DEV -- LR :8.53333333333332e-05 C-LOSS : 1.06015944480896 AVG-LOSS :2.758248053278242

Confusion Matrix : 
[[402   0   4]
 [464   0   5]
 [230   0   2]]
F-Measure : 0.19976979379605314

-=-=-=-=-=-=-=-=-=-=-=-=-=-=-=-- Test iteration 70 on DEV -- LR :7.226666666666662e-05 C-LOSS : 1.0641627311706543 AVG-LOSS :2.7343876966288394

Confusion Matrix : 
[[402   0   4]
 [464   0   5]
 [228   0   4]]
F-Measure : 0.20342503180133845

-=-=-=-=-=-=-=-=-=-=-=-=-=-=-=-- Test iteration 71 on DEV -- LR :5.920000000000014e-05 C-LOSS : 1.089281439781189 AVG-LOSS :2.7115389986170664

Confusion Matrix : 
[[402   0   4]
 [464   0   5]
 [227   0   5]]
F-Measure : 0.20523222079947653

-=-=-=-=-=-=-=-=-=-=-=-=-=-=-=-- Test iteration 72 on DEV -- LR :4.613333333333312e-05 C-LOSS : 1.0816532373428345 AVG-LOSS :2.68921179640783

Confusion Matrix : 
[[402   0   4]
 [464   0   5]
 [227   0   5]]
F-Measure : 0.20523222079947653

-=-=-=-=-=-=-=-=-=-=-=-=-=-=-=-- Test iteration 73 on DEV -- LR :3.306666666666664e-05 C-LOSS : 1.083595871925354 AVG-LOSS :2.667514283914824

Confusion Matrix : 
[[402   0   4]
 [464   0   5]
 [227   0   5]]
F-Measure : 0.20523222079947653

-=-=-=-=-=-=-=-=-=-=-=-=-=-=-=-- Test iteration 74 on DEV -- LR :2.0000000000000052e-05 C-LOSS : 1.0760235786437988 AVG-LOSS :2.6462944078445436

Confusion Matrix : 
[[402   0   4]
 [464   0   5]
 [227   0   5]]
F-Measure : 0.20523222079947653

-=-=-=-=-=-=-=-=-=-=-=-=-=-=-=-- Train epoch 1 --=-=-=-=-=-=-=-=-=-=-=-=-=-


-=-=-=-=-=-=-=-=-=-=-=-=-=-=-=-- Test iteration 75 on DEV -- LR :3.306666666666707e-05 C-LOSS : 1.1044642925262451 AVG-LOSS :2.626007169485092

Confusion Matrix : 
[[406   0   0]
 [469   0   0]
 [232   0   0]]
F-Measure : 0.19683191324092134

-=-=-=-=-=-=-=-=-=-=-=-=-=-=-=-- Test iteration 76 on DEV -- LR :4.613333333333312e-05 C-LOSS : 1.066677451133728 AVG-LOSS :2.605756134181828

Confusion Matrix : 
[[406   0   0]
 [469   0   0]
 [232   0   0]]
F-Measure : 0.19683191324092134

-=-=-=-=-=-=-=-=-=-=-=-=-=-=-=-- Test iteration 77 on DEV -- LR :5.920000000000014e-05 C-LOSS : 1.0800944566726685 AVG-LOSS :2.5861963690855565

Confusion Matrix : 
[[406   0   0]
 [469   0   0]
 [232   0   0]]
F-Measure : 0.19683191324092134

-=-=-=-=-=-=-=-=-=-=-=-=-=-=-=-- Test iteration 78 on DEV -- LR :7.226666666666662e-05 C-LOSS : 1.089019536972046 AVG-LOSS :2.5672447636157654

Confusion Matrix : 
[[406   0   0]
 [469   0   0]
 [232   0   0]]
F-Measure : 0.19683191324092134

-=-=-=-=-=-=-=-=-=-=-=-=-=-=-=-- Test iteration 79 on DEV -- LR :8.53333333333332e-05 C-LOSS : 1.0679333209991455 AVG-LOSS :2.5485033705830573

Confusion Matrix : 
[[406   0   0]
 [469   0   0]
 [232   0   0]]
F-Measure : 0.19683191324092134

-=-=-=-=-=-=-=-=-=-=-=-=-=-=-=-- Test iteration 80 on DEV -- LR :9.840000000000011e-05 C-LOSS : 1.0727001428604126 AVG-LOSS :2.53028357764821

Confusion Matrix : 
[[406   0   0]
 [469   0   0]
 [232   0   0]]
F-Measure : 0.19683191324092134

-=-=-=-=-=-=-=-=-=-=-=-=-=-=-=-- Test iteration 81 on DEV -- LR :0.0001114666666666667 C-LOSS : 1.0810624361038208 AVG-LOSS :2.5126101490927906

Confusion Matrix : 
[[406   0   0]
 [469   0   0]
 [232   0   0]]
F-Measure : 0.19683191324092134

-=-=-=-=-=-=-=-=-=-=-=-=-=-=-=-- Test iteration 82 on DEV -- LR :0.00012453333333333318 C-LOSS : 1.0786234140396118 AVG-LOSS :2.495333200477692

Confusion Matrix : 
[[406   0   0]
 [469   0   0]
 [232   0   0]]
F-Measure : 0.19683191324092134

-=-=-=-=-=-=-=-=-=-=-=-=-=-=-=-- Test iteration 83 on DEV -- LR :0.0001376000000000002 C-LOSS : 1.0334641933441162 AVG-LOSS :2.477929998011816

Confusion Matrix : 
[[406   0   0]
 [469   0   0]
 [232   0   0]]
F-Measure : 0.19683191324092134

-=-=-=-=-=-=-=-=-=-=-=-=-=-=-=-- Test iteration 84 on DEV -- LR :0.00015066666666666668 C-LOSS : 1.0942960977554321 AVG-LOSS :2.461651952126447

Confusion Matrix : 
[[406   0   0]
 [469   0   0]
 [232   0   0]]
F-Measure : 0.19683191324092134

-=-=-=-=-=-=-=-=-=-=-=-=-=-=-=-- Test iteration 85 on DEV -- LR :0.00016373333333333327 C-LOSS : 1.068782925605774 AVG-LOSS :2.4454558006552762

Confusion Matrix : 
[[406   0   0]
 [468   0   1]
 [232   0   0]]
F-Measure : 0.19696209307772092

-=-=-=-=-=-=-=-=-=-=-=-=-=-=-=-- Test iteration 86 on DEV -- LR :0.00017680000000000018 C-LOSS : 1.0671206712722778 AVG-LOSS :2.4296128681336326

Confusion Matrix : 
[[406   0   0]
 [468   0   1]
 [232   0   0]]
F-Measure : 0.19696209307772092

-=-=-=-=-=-=-=-=-=-=-=-=-=-=-=-- Test iteration 87 on DEV -- LR :0.00018986666666666676 C-LOSS : 1.060064435005188 AVG-LOSS :2.414049817757173

Confusion Matrix : 
[[406   0   0]
 [467   0   2]
 [232   0   0]]
F-Measure : 0.19709244522403307

-=-=-=-=-=-=-=-=-=-=-=-=-=-=-=-- Test iteration 88 on DEV -- LR :0.00020293333333333324 C-LOSS : 1.073638916015625 AVG-LOSS :2.3989890211083917

Confusion Matrix : 
[[405   0   1]
 [465   0   4]
 [232   0   0]]
F-Measure : 0.1969981238273921

-=-=-=-=-=-=-=-=-=-=-=-=-=-=-=-- Test iteration 89 on DEV -- LR :0.00021600000000000026 C-LOSS : 1.0651531219482422 AVG-LOSS :2.3841686222288345

Confusion Matrix : 
[[403   0   3]
 [465   0   4]
 [231   0   1]]
F-Measure : 0.19816250358886014

-=-=-=-=-=-=-=-=-=-=-=-=-=-=-=-- Test iteration 90 on DEV -- LR :0.00022906666666666674 C-LOSS : 1.0635148286819458 AVG-LOSS :2.3696559431788686

Confusion Matrix : 
[[403   0   3]
 [465   0   4]
 [231   0   1]]
F-Measure : 0.19816250358886014

-=-=-=-=-=-=-=-=-=-=-=-=-=-=-=-- Test iteration 91 on DEV -- LR :0.00024213333333333333 C-LOSS : 1.086771845817566 AVG-LOSS :2.355711550816246

Confusion Matrix : 
[[402   0   4]
 [465   0   4]
 [229   0   3]]
F-Measure : 0.2014946944469801

-=-=-=-=-=-=-=-=-=-=-=-=-=-=-=-- Test iteration 92 on DEV -- LR :0.00025520000000000024 C-LOSS : 1.068538784980774 AVG-LOSS :2.341870983441671

Confusion Matrix : 
[[402   0   4]
 [464   0   5]
 [228   0   4]]
F-Measure : 0.20342503180133845

-=-=-=-=-=-=-=-=-=-=-=-=-=-=-=-- Test iteration 93 on DEV -- LR :0.0002682666666666668 C-LOSS : 1.0676652193069458 AVG-LOSS :2.3283156029721526

Confusion Matrix : 
[[401   0   5]
 [462   0   7]
 [226   0   6]]
F-Measure : 0.20680819231826655

-=-=-=-=-=-=-=-=-=-=-=-=-=-=-=-- Test iteration 94 on DEV -- LR :0.0002813333333333333 C-LOSS : 1.03301203250885 AVG-LOSS :2.314680828546223

Confusion Matrix : 
[[401   0   5]
 [463   0   6]
 [227   0   5]]
F-Measure : 0.2049363367194413

-=-=-=-=-=-=-=-=-=-=-=-=-=-=-=-- Test iteration 95 on DEV -- LR :0.0002944000000000003 C-LOSS : 1.0800206661224365 AVG-LOSS :2.3018197851876416

Confusion Matrix : 
[[401   0   5]
 [463   0   6]
 [227   0   5]]
F-Measure : 0.2049363367194413

-=-=-=-=-=-=-=-=-=-=-=-=-=-=-=-- Test iteration 96 on DEV -- LR :0.00030746666666666637 C-LOSS : 1.0618512630462646 AVG-LOSS :2.289036604547009

Confusion Matrix : 
[[401   0   5]
 [465   0   4]
 [228   0   4]]
F-Measure : 0.20293602246680068

-=-=-=-=-=-=-=-=-=-=-=-=-=-=-=-- Test iteration 97 on DEV -- LR :0.0003205333333333334 C-LOSS : 1.071339726448059 AVG-LOSS :2.2766111261990605

Confusion Matrix : 
[[402   0   4]
 [465   0   4]
 [230   0   2]]
F-Measure : 0.19965343041585235

-=-=-=-=-=-=-=-=-=-=-=-=-=-=-=-- Test iteration 98 on DEV -- LR :0.0003336000000000003 C-LOSS : 1.0535387992858887 AVG-LOSS :2.2642568602706445

Confusion Matrix : 
[[402   0   4]
 [466   0   3]
 [232   0   0]]
F-Measure : 0.19579855825118675

-=-=-=-=-=-=-=-=-=-=-=-=-=-=-=-- Test iteration 99 on DEV -- LR :0.00034666666666666646 C-LOSS : 1.0629353523254395 AVG-LOSS :2.2522436451911925

Confusion Matrix : 
[[402   0   4]
 [466   0   3]
 [231   0   1]]
F-Measure : 0.19767511887005174

-=-=-=-=-=-=-=-=-=-=-=-=-=-=-=-- Test iteration 100 on DEV -- LR :0.00035973333333333337 C-LOSS : 1.1076209545135498 AVG-LOSS :2.2409107472636913

Confusion Matrix : 
[[401   0   5]
 [464   0   5]
 [226   0   6]]
F-Measure : 0.2066264611475673

-=-=-=-=-=-=-=-=-=-=-=-=-=-=-=-- Test iteration 101 on DEV -- LR :0.0003728000000000004 C-LOSS : 1.0696343183517456 AVG-LOSS :2.2294276450194563

Confusion Matrix : 
[[399   0   7]
 [460   0   9]
 [218   0  14]]
F-Measure : 0.2197487474798395

-=-=-=-=-=-=-=-=-=-=-=-=-=-=-=-- Test iteration 102 on DEV -- LR :0.00038586666666666643 C-LOSS : 1.0597999095916748 AVG-LOSS :2.218072035937633

Confusion Matrix : 
[[396   0  10]
 [459   0  10]
 [206   0  26]]
F-Measure : 0.23720493902648343

-=-=-=-=-=-=-=-=-=-=-=-=-=-=-=-- Test iteration 103 on DEV -- LR :0.00039893333333333345 C-LOSS : 1.069786548614502 AVG-LOSS :2.2070308293287573

Confusion Matrix : 
[[387   0  19]
 [457   0  12]
 [202   0  30]]
F-Measure : 0.2384191689489738

-=-=-=-=-=-=-=-=-=-=-=-=-=-=-=-- Test iteration 104 on DEV -- LR :0.00041199999999999993 C-LOSS : 1.08565092086792 AVG-LOSS :2.196351020676749

Confusion Matrix : 
[[383   0  23]
 [454   0  15]
 [200   0  32]]
F-Measure : 0.23910208349986523

-=-=-=-=-=-=-=-=-=-=-=-=-=-=-=-- Test iteration 105 on DEV -- LR :0.0004250666666666665 C-LOSS : 1.106845498085022 AVG-LOSS :2.1860726666900345

Confusion Matrix : 
[[388   0  18]
 [458   0  11]
 [203   0  29]]
F-Measure : 0.23751881963264077

-=-=-=-=-=-=-=-=-=-=-=-=-=-=-=-- Test iteration 106 on DEV -- LR :0.00043813333333333343 C-LOSS : 1.0724678039550781 AVG-LOSS :2.1756651446083994

Confusion Matrix : 
[[399   0   7]
 [460   0   9]
 [217   0  15]]
F-Measure : 0.22139048142943163

-=-=-=-=-=-=-=-=-=-=-=-=-=-=-=-- Test iteration 107 on DEV -- LR :0.0004512 C-LOSS : 1.0522353649139404 AVG-LOSS :2.165263017018636

Confusion Matrix : 
[[401   1   4]
 [462   2   5]
 [229   0   3]]
F-Measure : 0.20509844650883624

-=-=-=-=-=-=-=-=-=-=-=-=-=-=-=-- Test iteration 108 on DEV -- LR :0.0004642666666666665 C-LOSS : 1.052786111831665 AVG-LOSS :2.155056806879306

Confusion Matrix : 
[[402   3   1]
 [464   3   2]
 [232   0   0]]
F-Measure : 0.201410519032402

-=-=-=-=-=-=-=-=-=-=-=-=-=-=-=-- Test iteration 109 on DEV -- LR :0.0004773333333333335 C-LOSS : 1.0528935194015503 AVG-LOSS :2.1450371406295083

Confusion Matrix : 
[[402   3   1]
 [460   7   2]
 [231   1   0]]
F-Measure : 0.2090698652057309

-=-=-=-=-=-=-=-=-=-=-=-=-=-=-=-- Test iteration 110 on DEV -- LR :0.0004904 C-LOSS : 1.0301874876022339 AVG-LOSS :2.134993450061695

Confusion Matrix : 
[[402   4   0]
 [459   9   1]
 [230   2   0]]
F-Measure : 0.21273193583446012

-=-=-=-=-=-=-=-=-=-=-=-=-=-=-=-- Test iteration 111 on DEV -- LR :0.0005034666666666666 C-LOSS : 1.12031888961792 AVG-LOSS :2.1259338557720184

Confusion Matrix : 
[[395  11   0]
 [454  14   1]
 [229   3   0]]
F-Measure : 0.2191098560821732

-=-=-=-=-=-=-=-=-=-=-=-=-=-=-=-- Test iteration 112 on DEV -- LR :0.0005165333333333336 C-LOSS : 1.0469754934310913 AVG-LOSS :2.116385551680506

Confusion Matrix : 
[[394  12   0]
 [450  17   2]
 [228   4   0]]
F-Measure : 0.22423217834674092

-=-=-=-=-=-=-=-=-=-=-=-=-=-=-=-- Test iteration 113 on DEV -- LR :0.0005296000000000001 C-LOSS : 1.0886348485946655 AVG-LOSS :2.107370194635893

Confusion Matrix : 
[[397   7   2]
 [454  10   5]
 [228   3   1]]
F-Measure : 0.2151720615207295

-=-=-=-=-=-=-=-=-=-=-=-=-=-=-=-- Test iteration 114 on DEV -- LR :0.0005426666666666666 C-LOSS : 1.0727595090866089 AVG-LOSS :2.0983735799789427

Confusion Matrix : 
[[399   3   4]
 [458   4   7]
 [225   0   7]]
F-Measure : 0.21554491771356674

-=-=-=-=-=-=-=-=-=-=-=-=-=-=-=-- Test iteration 115 on DEV -- LR :0.0005557333333333336 C-LOSS : 1.0947024822235107 AVG-LOSS :2.0897212429293273

Confusion Matrix : 
[[395   1  10]
 [458   1  10]
 [211   0  21]]
F-Measure : 0.23114208790766191

-=-=-=-=-=-=-=-=-=-=-=-=-=-=-=-- Test iteration 116 on DEV -- LR :0.0005688000000000002 C-LOSS : 1.0574650764465332 AVG-LOSS :2.080898540651696

Confusion Matrix : 
[[388   1  17]
 [457   1  11]
 [206   0  26]]
F-Measure : 0.23523886828491616

-=-=-=-=-=-=-=-=-=-=-=-=-=-=-=-- Test iteration 117 on DEV -- LR :0.0005818666666666666 C-LOSS : 1.097011685371399 AVG-LOSS :2.0725605164544056

Confusion Matrix : 
[[373   1  32]
 [444   1  24]
 [198   0  34]]
F-Measure : 0.23859815121384895

-=-=-=-=-=-=-=-=-=-=-=-=-=-=-=-- Test iteration 118 on DEV -- LR :0.0005949333333333336 C-LOSS : 1.0658766031265259 AVG-LOSS :2.064100987770978

Confusion Matrix : 
[[377   1  28]
 [447   2  20]
 [197   0  35]]
F-Measure : 0.24395023204995467

-=-=-=-=-=-=-=-=-=-=-=-=-=-=-=-- Test iteration 119 on DEV -- LR :0.0006080000000000001 C-LOSS : 1.0861399173736572 AVG-LOSS :2.055951312184334

Confusion Matrix : 
[[386   3  17]
 [454   3  12]
 [206   0  26]]
F-Measure : 0.23832096900185978

-=-=-=-=-=-=-=-=-=-=-=-=-=-=-=-- Test iteration 120 on DEV -- LR :0.0006210666666666667 C-LOSS : 1.0658131837844849 AVG-LOSS :2.047768352445492

Confusion Matrix : 
[[395   1  10]
 [458   1  10]
 [209   0  23]]
F-Measure : 0.23422449736033343

-=-=-=-=-=-=-=-=-=-=-=-=-=-=-=-- Test iteration 121 on DEV -- LR :0.0006341333333333336 C-LOSS : 1.0469801425933838 AVG-LOSS :2.039565170397524

Confusion Matrix : 
[[394   0  12]
 [456   1  12]
 [208   0  24]]
F-Measure : 0.2351375139088423

-=-=-=-=-=-=-=-=-=-=-=-=-=-=-=-- Test iteration 122 on DEV -- LR :0.0006471999999999997 C-LOSS : 1.049519419670105 AVG-LOSS :2.0315160179525855

Confusion Matrix : 
[[391   0  15]
 [457   0  12]
 [205   0  27]]
F-Measure : 0.23614590538143254

-=-=-=-=-=-=-=-=-=-=-=-=-=-=-=-- Test iteration 123 on DEV -- LR :0.0006602666666666667 C-LOSS : 1.0645745992660522 AVG-LOSS :2.0237181032857587

Confusion Matrix : 
[[383   0  23]
 [452   0  17]
 [202   0  30]]
F-Measure : 0.23632625000201588

-=-=-=-=-=-=-=-=-=-=-=-=-=-=-=-- Test iteration 124 on DEV -- LR :0.0006733333333333337 C-LOSS : 1.0752894878387451 AVG-LOSS :2.0161306743621825

Confusion Matrix : 
[[391   0  15]
 [456   0  13]
 [204   0  28]]
F-Measure : 0.23759633361350513

-=-=-=-=-=-=-=-=-=-=-=-=-=-=-=-- Test iteration 125 on DEV -- LR :0.0006863999999999998 C-LOSS : 1.0347281694412231 AVG-LOSS :2.0083417655929687

Confusion Matrix : 
[[392   0  14]
 [457   0  12]
 [204   0  28]]
F-Measure : 0.23811421902329474

-=-=-=-=-=-=-=-=-=-=-=-=-=-=-=-- Test iteration 126 on DEV -- LR :0.0006994666666666667 C-LOSS : 1.0445468425750732 AVG-LOSS :2.000752829191253

Confusion Matrix : 
[[393   0  13]
 [457   1  11]
 [212   0  20]]
F-Measure : 0.22854598417009386

-=-=-=-=-=-=-=-=-=-=-=-=-=-=-=-- Test iteration 127 on DEV -- LR :0.0007125333333333337 C-LOSS : 1.0451008081436157 AVG-LOSS :1.9932867977768183

Confusion Matrix : 
[[398   2   6]
 [460   1   8]
 [217   0  15]]
F-Measure : 0.22300693277885245

-=-=-=-=-=-=-=-=-=-=-=-=-=-=-=-- Test iteration 128 on DEV -- LR :0.0007255999999999999 C-LOSS : 1.0568077564239502 AVG-LOSS :1.9860272703244704

Confusion Matrix : 
[[394   6   6]
 [456   5   8]
 [219   0  13]]
F-Measure : 0.2258001333387168

-=-=-=-=-=-=-=-=-=-=-=-=-=-=-=-- Test iteration 129 on DEV -- LR :0.0007386666666666668 C-LOSS : 1.0858561992645264 AVG-LOSS :1.9791028774701631

Confusion Matrix : 
[[396   6   4]
 [457   5   7]
 [222   0  10]]
F-Measure : 0.2215256708988762

-=-=-=-=-=-=-=-=-=-=-=-=-=-=-=-- Test iteration 130 on DEV -- LR :0.0007517333333333332 C-LOSS : 1.0095274448394775 AVG-LOSS :1.9717015382897762

Confusion Matrix : 
[[396   1   9]
 [459   1   9]
 [216   0  16]]
F-Measure : 0.22367429359036028

-=-=-=-=-=-=-=-=-=-=-=-=-=-=-=-- Test iteration 131 on DEV -- LR :0.0007647999999999998 C-LOSS : 1.0594059228897095 AVG-LOSS :1.9647902078700787

Confusion Matrix : 
[[393   1  12]
 [452   1  16]
 [211   0  21]]
F-Measure : 0.2302992428417753

-=-=-=-=-=-=-=-=-=-=-=-=-=-=-=-- Test iteration 132 on DEV -- LR :0.0007778666666666669 C-LOSS : 1.0359220504760742 AVG-LOSS :1.9578062367618532

Confusion Matrix : 
[[369   0  37]
 [421   0  48]
 [193   0  39]]
F-Measure : 0.24078262283824092

-=-=-=-=-=-=-=-=-=-=-=-=-=-=-=-- Test iteration 133 on DEV -- LR :0.0007909333333333333 C-LOSS : 1.0782264471054077 AVG-LOSS :1.951242208480835

Confusion Matrix : 
[[364   0  42]
 [416   0  53]
 [193   0  39]]
F-Measure : 0.23828152514140052

-=-=-=-=-=-=-=-=-=-=-=-=-=-=-=-- Test iteration 134 on DEV -- LR :0.0008039999999999998 C-LOSS : 1.0212546586990356 AVG-LOSS :1.9443534118157846

Confusion Matrix : 
[[326   0  80]
 [382   1  86]
 [162   0  70]]
F-Measure : 0.2518988252367714

-=-=-=-=-=-=-=-=-=-=-=-=-=-=-=-- Test iteration 135 on DEV -- LR :0.0008170666666666668 C-LOSS : 1.102491855621338 AVG-LOSS :1.938163253314355

Confusion Matrix : 
[[316   4  86]
 [381   2  86]
 [159   0  73]]
F-Measure : 0.2513836200844104

-=-=-=-=-=-=-=-=-=-=-=-=-=-=-=-- Test iteration 136 on DEV -- LR :0.0008301333333333334 C-LOSS : 1.0256342887878418 AVG-LOSS :1.9315024579528475

Confusion Matrix : 
[[315  17  74]
 [380  27  62]
 [165   6  61]]
F-Measure : 0.28618996615167547

-=-=-=-=-=-=-=-=-=-=-=-=-=-=-=-- Test iteration 137 on DEV -- LR :0.0008431999999999999 C-LOSS : 1.1604313850402832 AVG-LOSS :1.9259149864100027

Confusion Matrix : 
[[297  32  77]
 [353  50  66]
 [161   7  64]]
F-Measure : 0.31604112130832146
> Save best model exp/pytorch_resnet_block256_ecapatdnn_good/tdnn_sentiment/finalf12/finalf12_tdnn_sentiment_pid-2814.mat

-=-=-=-=-=-=-=-=-=-=-=-=-=-=-=-- Test iteration 138 on DEV -- LR :0.0008562666666666668 C-LOSS : 1.1296653747558594 AVG-LOSS :1.9201865719376707

Confusion Matrix : 
[[335  13  58]
 [395  21  53]
 [172   6  54]]
F-Measure : 0.27983660487014544

-=-=-=-=-=-=-=-=-=-=-=-=-=-=-=-- Test iteration 139 on DEV -- LR :0.0008693333333333334 C-LOSS : 1.0308715105056763 AVG-LOSS :1.913834321498871

Confusion Matrix : 
[[355   3  48]
 [425   2  42]
 [185   1  46]]
F-Measure : 0.24589409376249188

-=-=-=-=-=-=-=-=-=-=-=-=-=-=-=-- Test iteration 140 on DEV -- LR :0.0008823999999999999 C-LOSS : 1.0991790294647217 AVG-LOSS :1.9080566243922457

Confusion Matrix : 
[[367   0  39]
 [435   1  33]
 [193   0  39]]
F-Measure : 0.24160960057899086

-=-=-=-=-=-=-=-=-=-=-=-=-=-=-=-- Test iteration 141 on DEV -- LR :0.0008954666666666669 C-LOSS : 1.0198214054107666 AVG-LOSS :1.9018014467937845

Confusion Matrix : 
[[360   0  46]
 [428   1  40]
 [188   0  44]]
F-Measure : 0.24382391295315156

-=-=-=-=-=-=-=-=-=-=-=-=-=-=-=-- Test iteration 142 on DEV -- LR :0.0009085333333333334 C-LOSS : 1.015663743019104 AVG-LOSS :1.895604679634521

Confusion Matrix : 
[[362   0  44]
 [430   1  38]
 [188   0  44]]
F-Measure : 0.24490016777105061

-=-=-=-=-=-=-=-=-=-=-=-=-=-=-=-- Test iteration 143 on DEV -- LR :0.0009216 C-LOSS : 1.0977065563201904 AVG-LOSS :1.8900637204448383

Confusion Matrix : 
[[341   1  64]
 [414   1  54]
 [175   0  57]]
F-Measure : 0.2477224927116196

-=-=-=-=-=-=-=-=-=-=-=-=-=-=-=-- Test iteration 144 on DEV -- LR :0.000934666666666667 C-LOSS : 1.0526810884475708 AVG-LOSS :1.8842886678103743

Confusion Matrix : 
[[363   4  39]
 [436   2  31]
 [193   0  39]]
F-Measure : 0.24196759176269253

-=-=-=-=-=-=-=-=-=-=-=-=-=-=-=-- Test iteration 145 on DEV -- LR :0.0009477333333333335 C-LOSS : 1.0910332202911377 AVG-LOSS :1.8788554113205165

Confusion Matrix : 
[[390  11   5]
 [453   9   7]
 [215   4  13]]
F-Measure : 0.23207409646068647

-=-=-=-=-=-=-=-=-=-=-=-=-=-=-=-- Test iteration 146 on DEV -- LR :0.0009607999999999999 C-LOSS : 1.1036193370819092 AVG-LOSS :1.8735816965297776

Confusion Matrix : 
[[400   6   0]
 [463   6   0]
 [231   0   1]]
F-Measure : 0.20797233364315257

-=-=-=-=-=-=-=-=-=-=-=-=-=-=-=-- Test iteration 147 on DEV -- LR :0.000973866666666667 C-LOSS : 1.1282482147216797 AVG-LOSS :1.8685456594905339

Confusion Matrix : 
[[405   1   0]
 [468   1   0]
 [232   0   0]]
F-Measure : 0.1984060088876919

-=-=-=-=-=-=-=-=-=-=-=-=-=-=-=-- Test iteration 148 on DEV -- LR :0.0009869333333333331 C-LOSS : 1.0437161922454834 AVG-LOSS :1.8630098912539899

Confusion Matrix : 
[[406   0   0]
 [467   0   2]
 [230   0   2]]
F-Measure : 0.20090579373218936

-=-=-=-=-=-=-=-=-=-=-=-=-=-=-=-- Test iteration 149 on DEV -- LR :0.001 C-LOSS : 1.088187336921692 AVG-LOSS :1.8578444075584413

Confusion Matrix : 
[[403   0   3]
 [462   0   7]
 [223   0   9]]
F-Measure : 0.2128915243011247

-=-=-=-=-=-=-=-=-=-=-=-=-=-=-=-- Train epoch 2 --=-=-=-=-=-=-=-=-=-=-=-=-=-


-=-=-=-=-=-=-=-=-=-=-=-=-=-=-=-- Test iteration 150 on DEV -- LR :0.0009869333333333331 C-LOSS : 1.2264673709869385 AVG-LOSS :1.8536631026804842

Confusion Matrix : 
[[377   1  28]
 [447   0  22]
 [203   0  29]]
F-Measure : 0.23206092581842597

-=-=-=-=-=-=-=-=-=-=-=-=-=-=-=-- Test iteration 151 on DEV -- LR :0.0009738666666666661 C-LOSS : 1.0503160953521729 AVG-LOSS :1.8483779250006926

Confusion Matrix : 
[[347   1  58]
 [426   1  42]
 [187   0  45]]
F-Measure : 0.23816217030062103

-=-=-=-=-=-=-=-=-=-=-=-=-=-=-=-- Test iteration 152 on DEV -- LR :0.0009607999999999999 C-LOSS : 1.0954945087432861 AVG-LOSS :1.8434571183584874

Confusion Matrix : 
[[351   0  55]
 [430   0  39]
 [186   1  45]]
F-Measure : 0.23835927504770674

-=-=-=-=-=-=-=-=-=-=-=-=-=-=-=-- Test iteration 153 on DEV -- LR :0.0009477333333333339 C-LOSS : 1.0751163959503174 AVG-LOSS :1.8384678928883045

Confusion Matrix : 
[[394   0  12]
 [455   0  14]
 [216   2  14]]
F-Measure : 0.21804200153676934

-=-=-=-=-=-=-=-=-=-=-=-=-=-=-=-- Test iteration 154 on DEV -- LR :0.000934666666666667 C-LOSS : 1.0202741622924805 AVG-LOSS :1.833189223658654

Confusion Matrix : 
[[405   0   1]
 [467   0   2]
 [232   0   0]]
F-Measure : 0.1967371991600711

-=-=-=-=-=-=-=-=-=-=-=-=-=-=-=-- Test iteration 155 on DEV -- LR :0.0009216 C-LOSS : 1.0831239223480225 AVG-LOSS :1.8283811127528167

Confusion Matrix : 
[[406   0   0]
 [469   0   0]
 [232   0   0]]
F-Measure : 0.19683191324092134

-=-=-=-=-=-=-=-=-=-=-=-=-=-=-=-- Test iteration 156 on DEV -- LR :0.0009085333333333329 C-LOSS : 1.066054105758667 AVG-LOSS :1.8235255267210067

Confusion Matrix : 
[[406   0   0]
 [469   0   0]
 [232   0   0]]
F-Measure : 0.19683191324092134

-=-=-=-=-=-=-=-=-=-=-=-=-=-=-=-- Test iteration 157 on DEV -- LR :0.0008954666666666669 C-LOSS : 1.1013545989990234 AVG-LOSS :1.818954824646817

Confusion Matrix : 
[[405   0   1]
 [465   0   4]
 [230   0   2]]
F-Measure : 0.20076728008385394

-=-=-=-=-=-=-=-=-=-=-=-=-=-=-=-- Test iteration 158 on DEV -- LR :0.0008823999999999999 C-LOSS : 1.0751889944076538 AVG-LOSS :1.8142770521295895

Confusion Matrix : 
[[405   0   1]
 [464   1   4]
 [230   0   2]]
F-Measure : 0.20270119040299214

-=-=-=-=-=-=-=-=-=-=-=-=-=-=-=-- Test iteration 159 on DEV -- LR :0.0008693333333333338 C-LOSS : 1.0599215030670166 AVG-LOSS :1.8095623299479484

Confusion Matrix : 
[[404   1   1]
 [465   2   2]
 [231   0   1]]
F-Measure : 0.2021391465255804

-=-=-=-=-=-=-=-=-=-=-=-=-=-=-=-- Test iteration 160 on DEV -- LR :0.0008562666666666668 C-LOSS : 1.0328342914581299 AVG-LOSS :1.8047379321933532

Confusion Matrix : 
[[401   4   1]
 [463   4   2]
 [231   0   1]]
F-Measure : 0.20484370047220843

-=-=-=-=-=-=-=-=-=-=-=-=-=-=-=-- Test iteration 161 on DEV -- LR :0.0008431999999999999 C-LOSS : 1.0758625268936157 AVG-LOSS :1.8002387012964414

Confusion Matrix : 
[[401   4   1]
 [464   4   1]
 [231   0   1]]
F-Measure : 0.20472079074235197

-=-=-=-=-=-=-=-=-=-=-=-=-=-=-=-- Test iteration 162 on DEV -- LR :0.000830133333333333 C-LOSS : 1.0249305963516235 AVG-LOSS :1.795482209855062

Confusion Matrix : 
[[397   9   0]
 [455  14   0]
 [231   1   0]]
F-Measure : 0.2196331478529129

-=-=-=-=-=-=-=-=-=-=-=-=-=-=-=-- Test iteration 163 on DEV -- LR :0.0008170666666666668 C-LOSS : 1.036081075668335 AVG-LOSS :1.7908517151344112

Confusion Matrix : 
[[362  43   1]
 [391  78   0]
 [212  20   0]]
F-Measure : 0.30202542966388557

-=-=-=-=-=-=-=-=-=-=-=-=-=-=-=-- Test iteration 164 on DEV -- LR :0.0008039999999999998 C-LOSS : 1.0641233921051025 AVG-LOSS :1.7864473010554458

Confusion Matrix : 
[[372  31   3]
 [404  62   3]
 [213  17   2]]
F-Measure : 0.2898302995695472

-=-=-=-=-=-=-=-=-=-=-=-=-=-=-=-- Test iteration 165 on DEV -- LR :0.0007909333333333338 C-LOSS : 1.082883358001709 AVG-LOSS :1.782208964049098

Confusion Matrix : 
[[387  16   3]
 [443  23   3]
 [220   8   4]]
F-Measure : 0.2396625312411077

-=-=-=-=-=-=-=-=-=-=-=-=-=-=-=-- Test iteration 166 on DEV -- LR :0.0007778666666666669 C-LOSS : 1.0864380598068237 AVG-LOSS :1.7780426712093238

Confusion Matrix : 
[[398   6   2]
 [458   8   3]
 [227   2   3]]
F-Measure : 0.21527956208112575

-=-=-=-=-=-=-=-=-=-=-=-=-=-=-=-- Test iteration 167 on DEV -- LR :0.0007647999999999998 C-LOSS : 1.0167871713638306 AVG-LOSS :1.7735113884721483

Confusion Matrix : 
[[394   6   6]
 [457   8   4]
 [224   4   4]]
F-Measure : 0.21587619394707874

-=-=-=-=-=-=-=-=-=-=-=-=-=-=-=-- Test iteration 168 on DEV -- LR :0.0007517333333333328 C-LOSS : 1.0896213054656982 AVG-LOSS :1.7694647015904534

Confusion Matrix : 
[[383  16   7]
 [437  27   5]
 [218   7   7]]
F-Measure : 0.2503244065409489

-=-=-=-=-=-=-=-=-=-=-=-=-=-=-=-- Test iteration 169 on DEV -- LR :0.0007386666666666668 C-LOSS : 1.0178909301757812 AVG-LOSS :1.7650436794056612

Confusion Matrix : 
[[358  21  27]
 [425  31  13]
 [195   9  28]]
F-Measure : 0.2784203071705588

-=-=-=-=-=-=-=-=-=-=-=-=-=-=-=-- Test iteration 170 on DEV -- LR :0.0007256000000000007 C-LOSS : 1.0416076183319092 AVG-LOSS :1.7608130591654638

Confusion Matrix : 
[[283  13 110]
 [382  19  68]
 [154   6  72]]
F-Measure : 0.26382262738512363

-=-=-=-=-=-=-=-=-=-=-=-=-=-=-=-- Test iteration 171 on DEV -- LR :0.0007125333333333337 C-LOSS : 1.0297647714614868 AVG-LOSS :1.756562778422999

Confusion Matrix : 
[[230   8 168]
 [306  11 152]
 [118   2 112]]
F-Measure : 0.24888065252338729

-=-=-=-=-=-=-=-=-=-=-=-=-=-=-=-- Test iteration 172 on DEV -- LR :0.0006994666666666667 C-LOSS : 1.0609856843948364 AVG-LOSS :1.7525421015789053

Confusion Matrix : 
[[269   8 129]
 [352   9 108]
 [142   3  87]]
F-Measure : 0.2499714721128652

-=-=-=-=-=-=-=-=-=-=-=-=-=-=-=-- Test iteration 173 on DEV -- LR :0.0006863999999999998 C-LOSS : 1.0304330587387085 AVG-LOSS :1.7483920496085594

Confusion Matrix : 
[[336  10  60]
 [423  14  32]
 [175   6  51]]
F-Measure : 0.26470334545238194

-=-=-=-=-=-=-=-=-=-=-=-=-=-=-=-- Test iteration 174 on DEV -- LR :0.0006733333333333329 C-LOSS : 1.0226707458496094 AVG-LOSS :1.7442450707299368

Confusion Matrix : 
[[365   8  33]
 [440  11  18]
 [195   3  34]]
F-Measure : 0.2543607987290733

-=-=-=-=-=-=-=-=-=-=-=-=-=-=-=-- Test iteration 175 on DEV -- LR :0.0006602666666666667 C-LOSS : 1.140001893043518 AVG-LOSS :1.7408118708567186

Confusion Matrix : 
[[383   6  17]
 [449   9  11]
 [212   1  19]]
F-Measure : 0.2380169393633731

-=-=-=-=-=-=-=-=-=-=-=-=-=-=-=-- Test iteration 176 on DEV -- LR :0.0006472000000000006 C-LOSS : 1.0709408521652222 AVG-LOSS :1.737027288830213

Confusion Matrix : 
[[379   7  20]
 [443  13  13]
 [202   4  26]]
F-Measure : 0.2542002856375748

-=-=-=-=-=-=-=-=-=-=-=-=-=-=-=-- Test iteration 177 on DEV -- LR :0.0006341333333333336 C-LOSS : 1.0770623683929443 AVG-LOSS :1.7333196207378687

Confusion Matrix : 
[[360  16  30]
 [419  33  17]
 [186  16  30]]
F-Measure : 0.28566528095852617

-=-=-=-=-=-=-=-=-=-=-=-=-=-=-=-- Test iteration 178 on DEV -- LR :0.0006210666666666667 C-LOSS : 1.056739330291748 AVG-LOSS :1.7295398425789519

Confusion Matrix : 
[[344  32  30]
 [392  59  18]
 [181  23  28]]
F-Measure : 0.31458025011910234

-=-=-=-=-=-=-=-=-=-=-=-=-=-=-=-- Test iteration 179 on DEV -- LR :0.0006079999999999997 C-LOSS : 1.0446709394454956 AVG-LOSS :1.7257350153393216

Confusion Matrix : 
[[344  40  22]
 [376  80  13]
 [176  33  23]]
F-Measure : 0.3360259450996589
> Save best model exp/pytorch_resnet_block256_ecapatdnn_good/tdnn_sentiment/finalf12/finalf12_tdnn_sentiment_pid-2814.mat

-=-=-=-=-=-=-=-=-=-=-=-=-=-=-=-- Test iteration 180 on DEV -- LR :0.0005949333333333327 C-LOSS : 1.0691554546356201 AVG-LOSS :1.7221075039542182

Confusion Matrix : 
[[356  44   6]
 [369  95   5]
 [193  33   6]]
F-Measure : 0.3329089519981767

-=-=-=-=-=-=-=-=-=-=-=-=-=-=-=-- Test iteration 181 on DEV -- LR :0.0005818666666666666 C-LOSS : 1.0303634405136108 AVG-LOSS :1.7183067123968523

Confusion Matrix : 
[[362  44   0]
 [375  91   3]
 [199  31   2]]
F-Measure : 0.3228292107106162

-=-=-=-=-=-=-=-=-=-=-=-=-=-=-=-- Test iteration 182 on DEV -- LR :0.0005688000000000006 C-LOSS : 1.0733363628387451 AVG-LOSS :1.7147822842571905

Confusion Matrix : 
[[349  57   0]
 [345 123   1]
 [191  39   2]]
F-Measure : 0.35334612522325476
> Save best model exp/pytorch_resnet_block256_ecapatdnn_good/tdnn_sentiment/finalf12/finalf12_tdnn_sentiment_pid-2814.mat

-=-=-=-=-=-=-=-=-=-=-=-=-=-=-=-- Test iteration 183 on DEV -- LR :0.0005557333333333336 C-LOSS : 1.1787865161895752 AVG-LOSS :1.7118692637785622

Confusion Matrix : 
[[325  81   0]
 [311 158   0]
 [179  51   2]]
F-Measure : 0.37521437686395853
> Save best model exp/pytorch_resnet_block256_ecapatdnn_good/tdnn_sentiment/finalf12/finalf12_tdnn_sentiment_pid-2814.mat

-=-=-=-=-=-=-=-=-=-=-=-=-=-=-=-- Test iteration 184 on DEV -- LR :0.0005426666666666666 C-LOSS : 1.0824358463287354 AVG-LOSS :1.708466920981536

Confusion Matrix : 
[[367  37   2]
 [382  84   3]
 [201  29   2]]
F-Measure : 0.3170180514278866

-=-=-=-=-=-=-=-=-=-=-=-=-=-=-=-- Test iteration 185 on DEV -- LR :0.0005295999999999996 C-LOSS : 1.0704108476638794 AVG-LOSS :1.7050365119852045

Confusion Matrix : 
[[372  21  13]
 [418  40  11]
 [206  16  10]]
F-Measure : 0.2724604958152363

-=-=-=-=-=-=-=-=-=-=-=-=-=-=-=-- Test iteration 186 on DEV -- LR :0.0005165333333333336 C-LOSS : 1.1213260889053345 AVG-LOSS :1.701915065872478

Confusion Matrix : 
[[367  15  24]
 [422  30  17]
 [202  13  17]]
F-Measure : 0.2655046906314267

-=-=-=-=-=-=-=-=-=-=-=-=-=-=-=-- Test iteration 187 on DEV -- LR :0.0005034666666666666 C-LOSS : 1.058955192565918 AVG-LOSS :1.6984950665463792

Confusion Matrix : 
[[371  10  25]
 [427  20  22]
 [205   8  19]]
F-Measure : 0.2532894316576869

-=-=-=-=-=-=-=-=-=-=-=-=-=-=-=-- Test iteration 188 on DEV -- LR :0.0004904000000000004 C-LOSS : 1.0594747066497803 AVG-LOSS :1.6951140064411063

Confusion Matrix : 
[[380   7  19]
 [444  10  15]
 [215   5  12]]
F-Measure : 0.22824659332621128

-=-=-=-=-=-=-=-=-=-=-=-=-=-=-=-- Test iteration 189 on DEV -- LR :0.0004773333333333335 C-LOSS : 1.0160108804702759 AVG-LOSS :1.6915397794623124

Confusion Matrix : 
[[391   4  11]
 [451   6  12]
 [218   5   9]]
F-Measure : 0.22043047895254453

-=-=-=-=-=-=-=-=-=-=-=-=-=-=-=-- Test iteration 190 on DEV -- LR :0.0004642666666666665 C-LOSS : 1.0542373657226562 AVG-LOSS :1.6882031176102723

Confusion Matrix : 
[[401   3   2]
 [461   3   5]
 [225   3   4]]
F-Measure : 0.2092297386786722

-=-=-=-=-=-=-=-=-=-=-=-=-=-=-=-- Test iteration 191 on DEV -- LR :0.0004511999999999996 C-LOSS : 1.0308284759521484 AVG-LOSS :1.6847792913516362

Confusion Matrix : 
[[400   6   0]
 [454  14   1]
 [225   5   2]]
F-Measure : 0.22516031693059485

-=-=-=-=-=-=-=-=-=-=-=-=-=-=-=-- Test iteration 192 on DEV -- LR :0.00043813333333333343 C-LOSS : 1.0029412508010864 AVG-LOSS :1.6812464517632915

Confusion Matrix : 
[[394  12   0]
 [447  22   0]
 [223   7   2]]
F-Measure : 0.23673590993852425

-=-=-=-=-=-=-=-=-=-=-=-=-=-=-=-- Test iteration 193 on DEV -- LR :0.0004250666666666674 C-LOSS : 1.0537604093551636 AVG-LOSS :1.678011987627167

Confusion Matrix : 
[[390  15   1]
 [435  33   1]
 [219  11   2]]
F-Measure : 0.2538005450675976

-=-=-=-=-=-=-=-=-=-=-=-=-=-=-=-- Test iteration 194 on DEV -- LR :0.00041200000000000037 C-LOSS : 0.9871405363082886 AVG-LOSS :1.674469057107583

Confusion Matrix : 
[[383  19   4]
 [429  37   3]
 [214  14   4]]
F-Measure : 0.2612497273040164

-=-=-=-=-=-=-=-=-=-=-=-=-=-=-=-- Test iteration 195 on DEV -- LR :0.00039893333333333345 C-LOSS : 1.0240013599395752 AVG-LOSS :1.67115034436693

Confusion Matrix : 
[[383  17   6]
 [429  36   4]
 [215  13   4]]
F-Measure : 0.2598797621871885

-=-=-=-=-=-=-=-=-=-=-=-=-=-=-=-- Test iteration 196 on DEV -- LR :0.00038586666666666643 C-LOSS : 1.0667874813079834 AVG-LOSS :1.6680825125747525

Confusion Matrix : 
[[379  19   8]
 [425  39   5]
 [211  13   8]]
F-Measure : 0.27008835571342926

-=-=-=-=-=-=-=-=-=-=-=-=-=-=-=-- Test iteration 197 on DEV -- LR :0.0003727999999999995 C-LOSS : 1.0178697109222412 AVG-LOSS :1.6647986095361036

Confusion Matrix : 
[[373  24   9]
 [407  53   9]
 [202  19  11]]
F-Measure : 0.29426857337515666

-=-=-=-=-=-=-=-=-=-=-=-=-=-=-=-- Test iteration 198 on DEV -- LR :0.00035973333333333337 C-LOSS : 1.0746345520019531 AVG-LOSS :1.6618329610057812

Confusion Matrix : 
[[356  40  10]
 [376  84   9]
 [194  23  15]]
F-Measure : 0.33522631026553434

-=-=-=-=-=-=-=-=-=-=-=-=-=-=-=-- Test iteration 199 on DEV -- LR :0.0003466666666666673 C-LOSS : 1.0568486452102661 AVG-LOSS :1.6588080394268037

Confusion Matrix : 
[[350  45  11]
 [367  91  11]
 [191  27  14]]
F-Measure : 0.33928191663531093

-=-=-=-=-=-=-=-=-=-=-=-=-=-=-=-- Test iteration 200 on DEV -- LR :0.0003336000000000003 C-LOSS : 1.0155314207077026 AVG-LOSS :1.6556076582391464

Confusion Matrix : 
[[361  33  12]
 [382  75  12]
 [197  19  16]]
F-Measure : 0.3280136581316917

-=-=-=-=-=-=-=-=-=-=-=-=-=-=-=-- Test iteration 201 on DEV -- LR :0.0003205333333333334 C-LOSS : 1.0085512399673462 AVG-LOSS :1.6524044086437415

Confusion Matrix : 
[[370  21  15]
 [414  40  15]
 [199  13  20]]
F-Measure : 0.28753830474430214

-=-=-=-=-=-=-=-=-=-=-=-=-=-=-=-- Test iteration 202 on DEV -- LR :0.00030746666666666637 C-LOSS : 1.0544345378875732 AVG-LOSS :1.64945874425578

Confusion Matrix : 
[[370  12  24]
 [432  21  16]
 [198   8  26]]
F-Measure : 0.26449048004931397

-=-=-=-=-=-=-=-=-=-=-=-=-=-=-=-- Test iteration 203 on DEV -- LR :0.00029439999999999946 C-LOSS : 1.0519006252288818 AVG-LOSS :1.6465295377899618

Confusion Matrix : 
[[369   7  30]
 [429  14  26]
 [199   5  28]]
F-Measure : 0.2540249171975885

-=-=-=-=-=-=-=-=-=-=-=-=-=-=-=-- Test iteration 204 on DEV -- LR :0.0002813333333333333 C-LOSS : 0.9958707690238953 AVG-LOSS :1.643355592576469

Confusion Matrix : 
[[359   6  41]
 [422  10  37]
 [194   3  35]]
F-Measure : 0.2505677474797069

-=-=-=-=-=-=-=-=-=-=-=-=-=-=-=-- Test iteration 205 on DEV -- LR :0.00026826666666666726 C-LOSS : 0.9945282936096191 AVG-LOSS :1.6402059454941056

Confusion Matrix : 
[[345   7  54]
 [418  10  41]
 [186   3  43]]
F-Measure : 0.25280191135336805

-=-=-=-=-=-=-=-=-=-=-=-=-=-=-=-- Test iteration 206 on DEV -- LR :0.00025520000000000024 C-LOSS : 0.9971352219581604 AVG-LOSS :1.637099323641275

Confusion Matrix : 
[[338  10  58]
 [411  15  43]
 [181   5  46]]
F-Measure : 0.2619188375803206

-=-=-=-=-=-=-=-=-=-=-=-=-=-=-=-- Test iteration 207 on DEV -- LR :0.00024213333333333333 C-LOSS : 1.096069574356079 AVG-LOSS :1.6344982190774038

Confusion Matrix : 
[[330  12  64]
 [401  22  46]
 [172   8  52]]
F-Measure : 0.27671908100901516

-=-=-=-=-=-=-=-=-=-=-=-=-=-=-=-- Test iteration 208 on DEV -- LR :0.0002290666666666663 C-LOSS : 1.0538530349731445 AVG-LOSS :1.6317200124548954

Confusion Matrix : 
[[331  16  59]
 [398  30  41]
 [170  11  51]]
F-Measure : 0.290189300088673

-=-=-=-=-=-=-=-=-=-=-=-=-=-=-=-- Test iteration 209 on DEV -- LR :0.00021600000000000026 C-LOSS : 1.0537745952606201 AVG-LOSS :1.628967891420637

Confusion Matrix : 
[[336  19  51]
 [395  40  34]
 [179  13  40]]
F-Measure : 0.29689340050763874

-=-=-=-=-=-=-=-=-=-=-=-=-=-=-=-- Test iteration 210 on DEV -- LR :0.00020293333333333324 C-LOSS : 1.1225167512893677 AVG-LOSS :1.6265676490503465

Confusion Matrix : 
[[351  19  36]
 [399  40  30]
 [183  14  35]]
F-Measure : 0.29886922308196034

-=-=-=-=-=-=-=-=-=-=-=-=-=-=-=-- Test iteration 211 on DEV -- LR :0.0001898666666666672 C-LOSS : 1.0159320831298828 AVG-LOSS :1.6236872926073254

Confusion Matrix : 
[[355  18  33]
 [407  38  24]
 [187  12  33]]
F-Measure : 0.29509211046476985

-=-=-=-=-=-=-=-=-=-=-=-=-=-=-=-- Test iteration 212 on DEV -- LR :0.00017680000000000018 C-LOSS : 1.0148367881774902 AVG-LOSS :1.6208288395348849

Confusion Matrix : 
[[371  15  20]
 [421  30  18]
 [195  10  27]]
F-Measure : 0.28197417776948275

-=-=-=-=-=-=-=-=-=-=-=-=-=-=-=-- Test iteration 213 on DEV -- LR :0.00016373333333333327 C-LOSS : 1.0431122779846191 AVG-LOSS :1.6181292294341827

Confusion Matrix : 
[[375  14  17]
 [435  22  12]
 [206   5  21]]
F-Measure : 0.2612023104647221

-=-=-=-=-=-=-=-=-=-=-=-=-=-=-=-- Test iteration 214 on DEV -- LR :0.00015066666666666625 C-LOSS : 0.9713637828826904 AVG-LOSS :1.6151210180548734

Confusion Matrix : 
[[381  11  14]
 [439  19  11]
 [206   5  21]]
F-Measure : 0.25876546546041745

-=-=-=-=-=-=-=-=-=-=-=-=-=-=-=-- Test iteration 215 on DEV -- LR :0.0001376000000000002 C-LOSS : 0.982312023639679 AVG-LOSS :1.6121913467844327

Confusion Matrix : 
[[385   7  14]
 [445  13  11]
 [209   4  19]]
F-Measure : 0.2466326374576486

-=-=-=-=-=-=-=-=-=-=-=-=-=-=-=-- Test iteration 216 on DEV -- LR :0.00012453333333333318 C-LOSS : 1.0370559692382812 AVG-LOSS :1.6095409533395195

Confusion Matrix : 
[[385   7  14]
 [447  11  11]
 [211   4  17]]
F-Measure : 0.23988380312335972

-=-=-=-=-=-=-=-=-=-=-=-=-=-=-=-- Test iteration 217 on DEV -- LR :0.00011146666666666714 C-LOSS : 1.0876637697219849 AVG-LOSS :1.6071470213045769

Confusion Matrix : 
[[386   7  13]
 [447  11  11]
 [213   4  15]]
F-Measure : 0.23718082420856454

-=-=-=-=-=-=-=-=-=-=-=-=-=-=-=-- Test iteration 218 on DEV -- LR :9.840000000000011e-05 C-LOSS : 1.026652216911316 AVG-LOSS :1.6044963600973017

Confusion Matrix : 
[[385   7  14]
 [447  11  11]
 [212   4  16]]
F-Measure : 0.2383093006443395

-=-=-=-=-=-=-=-=-=-=-=-=-=-=-=-- Test iteration 219 on DEV -- LR :8.53333333333332e-05 C-LOSS : 1.0097705125808716 AVG-LOSS :1.6017930607904087

Confusion Matrix : 
[[385   7  14]
 [446  12  11]
 [210   4  18]]
F-Measure : 0.24326644232306402

-=-=-=-=-=-=-=-=-=-=-=-=-=-=-=-- Test iteration 220 on DEV -- LR :7.226666666666618e-05 C-LOSS : 1.061448097229004 AVG-LOSS :1.5993480609552893

Confusion Matrix : 
[[382   9  15]
 [442  13  14]
 [205   4  23]]
F-Measure : 0.2514615228401549

-=-=-=-=-=-=-=-=-=-=-=-=-=-=-=-- Test iteration 221 on DEV -- LR :5.920000000000014e-05 C-LOSS : 0.9863342046737671 AVG-LOSS :1.5965867372783455

Confusion Matrix : 
[[381  11  14]
 [438  17  14]
 [204   5  23]]
F-Measure : 0.25832939381522835

-=-=-=-=-=-=-=-=-=-=-=-=-=-=-=-- Test iteration 222 on DEV -- LR :4.6133333333333985e-05 C-LOSS : 1.004531741142273 AVG-LOSS :1.5939317821387218

Confusion Matrix : 
[[380  12  14]
 [435  20  14]
 [205   5  22]]
F-Measure : 0.26165778414682

-=-=-=-=-=-=-=-=-=-=-=-=-=-=-=-- Test iteration 223 on DEV -- LR :3.306666666666707e-05 C-LOSS : 0.9692163467407227 AVG-LOSS :1.5911428739449807

Confusion Matrix : 
[[378  14  14]
 [435  21  13]
 [204   6  22]]
F-Measure : 0.2625540628450621

-=-=-=-=-=-=-=-=-=-=-=-=-=-=-=-- Test iteration 224 on DEV -- LR :2.0000000000000052e-05 C-LOSS : 1.009073257446289 AVG-LOSS :1.5885558978716532

Confusion Matrix : 
[[378  14  14]
 [433  25  11]
 [203   8  21]]
F-Measure : 0.2679748950518474

-=-=-=-=-=-=-=-=-=-=-=-=-=-=-=-- Train epoch 3 --=-=-=-=-=-=-=-=-=-=-=-=-=-


-=-=-=-=-=-=-=-=-=-=-=-=-=-=-=-- Test iteration 225 on DEV -- LR :3.306666666666707e-05 C-LOSS : 1.927001714706421 AVG-LOSS :1.590053445733754

Confusion Matrix : 
[[382  23   1]
 [422  44   3]
 [212  17   3]]
F-Measure : 0.26972844384133376

-=-=-=-=-=-=-=-=-=-=-=-=-=-=-=-- Test iteration 226 on DEV -- LR :4.6133333333333985e-05 C-LOSS : 1.0611112117767334 AVG-LOSS :1.5877233037339433

Confusion Matrix : 
[[381  24   1]
 [422  44   3]
 [211  18   3]]
F-Measure : 0.26924646556476384

-=-=-=-=-=-=-=-=-=-=-=-=-=-=-=-- Test iteration 227 on DEV -- LR :5.920000000000014e-05 C-LOSS : 0.9598571062088013 AVG-LOSS :1.584969504621991

Confusion Matrix : 
[[382  23   1]
 [423  43   3]
 [213  15   4]]
F-Measure : 0.27000336177462336

-=-=-=-=-=-=-=-=-=-=-=-=-=-=-=-- Test iteration 228 on DEV -- LR :7.226666666666618e-05 C-LOSS : 1.0143910646438599 AVG-LOSS :1.5824778957137895

Confusion Matrix : 
[[386  19   1]
 [429  37   3]
 [215  13   4]]
F-Measure : 0.2624300239244651

-=-=-=-=-=-=-=-=-=-=-=-=-=-=-=-- Test iteration 229 on DEV -- LR :8.53333333333332e-05 C-LOSS : 1.1032702922821045 AVG-LOSS :1.5803943843945214

Confusion Matrix : 
[[388  17   1]
 [436  29   4]
 [217  11   4]]
F-Measure : 0.2503582209207487

-=-=-=-=-=-=-=-=-=-=-=-=-=-=-=-- Test iteration 230 on DEV -- LR :9.840000000000011e-05 C-LOSS : 1.0009225606918335 AVG-LOSS :1.5778858483611764

Confusion Matrix : 
[[389  15   2]
 [443  22   4]
 [220   8   4]]
F-Measure : 0.2388997291803516

-=-=-=-=-=-=-=-=-=-=-=-=-=-=-=-- Test iteration 231 on DEV -- LR :0.00011146666666666714 C-LOSS : 1.0073306560516357 AVG-LOSS :1.5754265587391525

Confusion Matrix : 
[[392  12   2]
 [449  16   4]
 [221   6   5]]
F-Measure : 0.23144773361224286

-=-=-=-=-=-=-=-=-=-=-=-=-=-=-=-- Test iteration 232 on DEV -- LR :0.00012453333333333318 C-LOSS : 1.0936566591262817 AVG-LOSS :1.573358876766565

Confusion Matrix : 
[[394   8   4]
 [451  13   5]
 [221   5   6]]
F-Measure : 0.22876963848186088

-=-=-=-=-=-=-=-=-=-=-=-=-=-=-=-- Test iteration 233 on DEV -- LR :0.0001376000000000002 C-LOSS : 1.0199666023254395 AVG-LOSS :1.5709939525168166

Confusion Matrix : 
[[395   5   6]
 [454   9   6]
 [222   3   7]]
F-Measure : 0.22354743226599866

-=-=-=-=-=-=-=-=-=-=-=-=-=-=-=-- Test iteration 234 on DEV -- LR :0.00015066666666666625 C-LOSS : 1.004021406173706 AVG-LOSS :1.5685813033834417

Confusion Matrix : 
[[394   5   7]
 [452   9   7]
 [221   2  10]]
F-Measure : 0.2283036087255404

-=-=-=-=-=-=-=-=-=-=-=-=-=-=-=-- Test iteration 235 on DEV -- LR :0.00016373333333333327 C-LOSS : 1.0067554712295532 AVG-LOSS :1.5662006854505863

Confusion Matrix : 
[[395   4   7]
 [456   5   7]
 [221   2  10]]
F-Measure : 0.22123949673505797

-=-=-=-=-=-=-=-=-=-=-=-=-=-=-=-- Test iteration 236 on DEV -- LR :0.00017680000000000018 C-LOSS : 1.0423210859298706 AVG-LOSS :1.563990223005351

Confusion Matrix : 
[[393   4   9]
 [457   4   7]
 [220   2  11]]
F-Measure : 0.22019085151867077

-=-=-=-=-=-=-=-=-=-=-=-=-=-=-=-- Test iteration 237 on DEV -- LR :0.0001898666666666672 C-LOSS : 1.007494330406189 AVG-LOSS :1.5616520049692202

Confusion Matrix : 
[[392   4  10]
 [457   4   7]
 [220   2  11]]
F-Measure : 0.21975772787755815

-=-=-=-=-=-=-=-=-=-=-=-=-=-=-=-- Test iteration 238 on DEV -- LR :0.00020293333333333324 C-LOSS : 1.0467299222946167 AVG-LOSS :1.5594975192676528

Confusion Matrix : 
[[392   4  10]
 [455   5   8]
 [216   3  14]]
F-Measure : 0.22678374265450574

-=-=-=-=-=-=-=-=-=-=-=-=-=-=-=-- Test iteration 239 on DEV -- LR :0.00021600000000000026 C-LOSS : 0.9781511425971985 AVG-LOSS :1.5570752426981926

Confusion Matrix : 
[[389   5  12]
 [451   6  11]
 [211   2  20]]
F-Measure : 0.23688997537167283

-=-=-=-=-=-=-=-=-=-=-=-=-=-=-=-- Test iteration 240 on DEV -- LR :0.0002290666666666663 C-LOSS : 1.025849461555481 AVG-LOSS :1.5548709863449033

Confusion Matrix : 
[[385   6  15]
 [444  11  13]
 [207   3  23]]
F-Measure : 0.2489917920328007

-=-=-=-=-=-=-=-=-=-=-=-=-=-=-=-- Test iteration 241 on DEV -- LR :0.00024213333333333333 C-LOSS : 1.0218355655670166 AVG-LOSS :1.5526683606392095

Confusion Matrix : 
[[373   7  26]
 [437  13  18]
 [198   4  31]]
F-Measure : 0.2582044485290432

-=-=-=-=-=-=-=-=-=-=-=-=-=-=-=-- Test iteration 242 on DEV -- LR :0.00025520000000000024 C-LOSS : 1.0066790580749512 AVG-LOSS :1.550421491081332

Confusion Matrix : 
[[353   7  46]
 [431  13  24]
 [191   4  38]]
F-Measure : 0.25674631341724385

-=-=-=-=-=-=-=-=-=-=-=-=-=-=-=-- Test iteration 243 on DEV -- LR :0.00026826666666666726 C-LOSS : 1.0567905902862549 AVG-LOSS :1.5483984136190572

Confusion Matrix : 
[[344   7  55]
 [422  11  35]
 [185   3  45]]
F-Measure : 0.25644192372672864

-=-=-=-=-=-=-=-=-=-=-=-=-=-=-=-- Test iteration 244 on DEV -- LR :0.0002813333333333333 C-LOSS : 1.0053932666778564 AVG-LOSS :1.5461820660805217

Confusion Matrix : 
[[335   5  66]
 [420   5  43]
 [180   2  51]]
F-Measure : 0.2466774190381763

-=-=-=-=-=-=-=-=-=-=-=-=-=-=-=-- Test iteration 245 on DEV -- LR :0.00029439999999999946 C-LOSS : 0.9979066848754883 AVG-LOSS :1.543953304368306

Confusion Matrix : 
[[333   4  69]
 [415   4  49]
 [173   1  59]]
F-Measure : 0.2517366543670429

-=-=-=-=-=-=-=-=-=-=-=-=-=-=-=-- Test iteration 246 on DEV -- LR :0.00030746666666666637 C-LOSS : 1.0386064052581787 AVG-LOSS :1.541907365505512

Confusion Matrix : 
[[325   4  77]
 [403   5  60]
 [167   1  65]]
F-Measure : 0.25498369021408046

-=-=-=-=-=-=-=-=-=-=-=-=-=-=-=-- Test iteration 247 on DEV -- LR :0.0003205333333333334 C-LOSS : 1.031703233718872 AVG-LOSS :1.539850090780566

Confusion Matrix : 
[[316   7  83]
 [395   8  65]
 [166   1  66]]
F-Measure : 0.25679332260331306

-=-=-=-=-=-=-=-=-=-=-=-=-=-=-=-- Test iteration 248 on DEV -- LR :0.0003336000000000003 C-LOSS : 1.0699412822723389 AVG-LOSS :1.5379629068106533

Confusion Matrix : 
[[323   9  74]
 [407  12  49]
 [169   4  60]]
F-Measure : 0.26284758599797875

-=-=-=-=-=-=-=-=-=-=-=-=-=-=-=-- Test iteration 249 on DEV -- LR :0.0003466666666666673 C-LOSS : 1.051336646080017 AVG-LOSS :1.5360164017677307

Confusion Matrix : 
[[328  14  64]
 [414  17  37]
 [174   7  52]]
F-Measure : 0.26710775988717106

-=-=-=-=-=-=-=-=-=-=-=-=-=-=-=-- Test iteration 250 on DEV -- LR :0.00035973333333333337 C-LOSS : 1.0021822452545166 AVG-LOSS :1.5338895724589132

Confusion Matrix : 
[[344  24  38]
 [399  45  24]
 [186  11  36]]
F-Measure : 0.3042263326591197

-=-=-=-=-=-=-=-=-=-=-=-=-=-=-=-- Test iteration 251 on DEV -- LR :0.0003727999999999995 C-LOSS : 1.0764940977096558 AVG-LOSS :1.532074511051178

Confusion Matrix : 
[[354  36  16]
 [384  71  13]
 [189  24  20]]
F-Measure : 0.3248730474687134

-=-=-=-=-=-=-=-=-=-=-=-=-=-=-=-- Test iteration 252 on DEV -- LR :0.00038586666666666643 C-LOSS : 0.9956328868865967 AVG-LOSS :1.5299541884260215

Confusion Matrix : 
[[358  35  13]
 [390  66  12]
 [193  27  13]]
F-Measure : 0.3087761502136495

-=-=-=-=-=-=-=-=-=-=-=-=-=-=-=-- Test iteration 253 on DEV -- LR :0.00039893333333333345 C-LOSS : 1.0149288177490234 AVG-LOSS :1.5279265294863482

Confusion Matrix : 
[[365  27  14]
 [401  54  13]
 [203  17  13]]
F-Measure : 0.29542901576915764

-=-=-=-=-=-=-=-=-=-=-=-=-=-=-=-- Test iteration 254 on DEV -- LR :0.00041200000000000037 C-LOSS : 1.0251283645629883 AVG-LOSS :1.525954771976845

Confusion Matrix : 
[[372  19  15]
 [419  36  13]
 [204  10  19]]
F-Measure : 0.28043987035582224

-=-=-=-=-=-=-=-=-=-=-=-=-=-=-=-- Test iteration 255 on DEV -- LR :0.0004250666666666674 C-LOSS : 1.011548638343811 AVG-LOSS :1.523945373017341

Confusion Matrix : 
[[375  12  19]
 [428  26  14]
 [201  10  22]]
F-Measure : 0.26984413706269855

-=-=-=-=-=-=-=-=-=-=-=-=-=-=-=-- Test iteration 256 on DEV -- LR :0.00043813333333333343 C-LOSS : 1.057546615600586 AVG-LOSS :1.5221305918600772

Confusion Matrix : 
[[376  10  20]
 [428  26  14]
 [201  10  22]]
F-Measure : 0.2702802388218177

-=-=-=-=-=-=-=-=-=-=-=-=-=-=-=-- Test iteration 257 on DEV -- LR :0.0004511999999999996 C-LOSS : 1.0764715671539307 AVG-LOSS :1.5204032312992006

Confusion Matrix : 
[[372  16  18]
 [413  41  14]
 [197  17  19]]
F-Measure : 0.28871350010194774

-=-=-=-=-=-=-=-=-=-=-=-=-=-=-=-- Test iteration 258 on DEV -- LR :0.0004642666666666665 C-LOSS : 1.0035265684127808 AVG-LOSS :1.5184075685081335

Confusion Matrix : 
[[370  24  12]
 [397  60  11]
 [189  29  15]]
F-Measure : 0.30988406402716784

-=-=-=-=-=-=-=-=-=-=-=-=-=-=-=-- Test iteration 259 on DEV -- LR :0.0004773333333333335 C-LOSS : 0.9971657991409302 AVG-LOSS :1.5164027924721057

Confusion Matrix : 
[[360  40   6]
 [371  91   6]
 [184  42   7]]
F-Measure : 0.3316271214996963

-=-=-=-=-=-=-=-=-=-=-=-=-=-=-=-- Test iteration 260 on DEV -- LR :0.0004904000000000004 C-LOSS : 1.065011739730835 AVG-LOSS :1.5146733248370818

Confusion Matrix : 
[[367  38   1]
 [379  86   3]
 [192  37   4]]
F-Measure : 0.32288904182365297

-=-=-=-=-=-=-=-=-=-=-=-=-=-=-=-- Test iteration 261 on DEV -- LR :0.0005034666666666666 C-LOSS : 1.019241452217102 AVG-LOSS :1.5127823634912039

Confusion Matrix : 
[[388  17   1]
 [416  49   3]
 [209  20   4]]
F-Measure : 0.28233805136970325

-=-=-=-=-=-=-=-=-=-=-=-=-=-=-=-- Test iteration 262 on DEV -- LR :0.0005165333333333336 C-LOSS : 1.0444532632827759 AVG-LOSS :1.5110016444790046

Confusion Matrix : 
[[390  12   4]
 [424  40   4]
 [207  19   7]]
F-Measure : 0.2750996427593595

-=-=-=-=-=-=-=-=-=-=-=-=-=-=-=-- Test iteration 263 on DEV -- LR :0.0005295999999999996 C-LOSS : 1.0007497072219849 AVG-LOSS :1.5090688719893948

Confusion Matrix : 
[[387   8  11]
 [429  25  14]
 [205  14  14]]
F-Measure : 0.26163976662990257

-=-=-=-=-=-=-=-=-=-=-=-=-=-=-=-- Test iteration 264 on DEV -- LR :0.0005426666666666666 C-LOSS : 1.023592472076416 AVG-LOSS :1.5072368855746288

Confusion Matrix : 
[[385   7  14]
 [437  14  17]
 [207  10  16]]
F-Measure : 0.24457339747718249

-=-=-=-=-=-=-=-=-=-=-=-=-=-=-=-- Test iteration 265 on DEV -- LR :0.0005557333333333336 C-LOSS : 0.9569994807243347 AVG-LOSS :1.5051683239022593

Confusion Matrix : 
[[381   7  18]
 [432  13  23]
 [206   9  18]]
F-Measure : 0.24418435652782564

-=-=-=-=-=-=-=-=-=-=-=-=-=-=-=-- Test iteration 266 on DEV -- LR :0.0005688000000000006 C-LOSS : 0.9953551292419434 AVG-LOSS :1.5032589111881756

Confusion Matrix : 
[[379   7  20]
 [419  14  35]
 [203   7  23]]
F-Measure : 0.2525824259313028

-=-=-=-=-=-=-=-=-=-=-=-=-=-=-=-- Test iteration 267 on DEV -- LR :0.0005818666666666666 C-LOSS : 0.9931567311286926 AVG-LOSS :1.50135554484467

Confusion Matrix : 
[[378   8  20]
 [419  21  28]
 [205  10  18]]
F-Measure : 0.2572873176664269

-=-=-=-=-=-=-=-=-=-=-=-=-=-=-=-- Test iteration 268 on DEV -- LR :0.0005949333333333327 C-LOSS : 1.0161186456680298 AVG-LOSS :1.4995516902008907

Confusion Matrix : 
[[385   7  14]
 [431  23  14]
 [209  10  14]]
F-Measure : 0.2570589003401039

-=-=-=-=-=-=-=-=-=-=-=-=-=-=-=-- Test iteration 269 on DEV -- LR :0.0006079999999999997 C-LOSS : 1.0278903245925903 AVG-LOSS :1.4978047962541934

Confusion Matrix : 
[[380  14  12]
 [418  36  14]
 [203  15  15]]
F-Measure : 0.27826011173197485

-=-=-=-=-=-=-=-=-=-=-=-=-=-=-=-- Test iteration 270 on DEV -- LR :0.0006210666666666667 C-LOSS : 1.02316415309906 AVG-LOSS :1.496053354766536

Confusion Matrix : 
[[383  12  11]
 [420  34  14]
 [203  12  18]]
F-Measure : 0.28107075892899985

-=-=-=-=-=-=-=-=-=-=-=-=-=-=-=-- Test iteration 271 on DEV -- LR :0.0006341333333333336 C-LOSS : 1.0050032138824463 AVG-LOSS :1.494248023366227

Confusion Matrix : 
[[377  11  18]
 [424  25  19]
 [199  11  23]]
F-Measure : 0.27077143880899446

-=-=-=-=-=-=-=-=-=-=-=-=-=-=-=-- Test iteration 272 on DEV -- LR :0.0006472000000000006 C-LOSS : 0.9953590631484985 AVG-LOSS :1.4924205912775173

Confusion Matrix : 
[[368  14  24]
 [406  31  31]
 [191  11  31]]
F-Measure : 0.287817605956507

-=-=-=-=-=-=-=-=-=-=-=-=-=-=-=-- Test iteration 273 on DEV -- LR :0.0006602666666666667 C-LOSS : 1.0516064167022705 AVG-LOSS :1.4908117804214032

Confusion Matrix : 
[[368  14  24]
 [411  33  24]
 [192  12  29]]
F-Measure : 0.28835558951633594

-=-=-=-=-=-=-=-=-=-=-=-=-=-=-=-- Test iteration 274 on DEV -- LR :0.0006733333333333329 C-LOSS : 1.0290223360061646 AVG-LOSS :1.489132546078075

Confusion Matrix : 
[[370  12  24]
 [414  28  26]
 [195  10  28]]
F-Measure : 0.279560764447205

-=-=-=-=-=-=-=-=-=-=-=-=-=-=-=-- Test iteration 275 on DEV -- LR :0.0006863999999999998 C-LOSS : 0.9804133772850037 AVG-LOSS :1.4872893606838973

Confusion Matrix : 
[[348  13  45]
 [395  26  47]
 [171   9  53]]
F-Measure : 0.2950082586350732

-=-=-=-=-=-=-=-=-=-=-=-=-=-=-=-- Test iteration 276 on DEV -- LR :0.0006994666666666667 C-LOSS : 1.0658445358276367 AVG-LOSS :1.4857678992223222

Confusion Matrix : 
[[340  18  48]
 [388  38  42]
 [172  11  50]]
F-Measure : 0.30744561795241626

-=-=-=-=-=-=-=-=-=-=-=-=-=-=-=-- Test iteration 277 on DEV -- LR :0.0007125333333333337 C-LOSS : 1.004334807395935 AVG-LOSS :1.4840361255107166

Confusion Matrix : 
[[357  22  27]
 [392  46  30]
 [185  13  35]]
F-Measure : 0.3116008926616027

-=-=-=-=-=-=-=-=-=-=-=-=-=-=-=-- Test iteration 278 on DEV -- LR :0.0007256000000000007 C-LOSS : 0.993833601474762 AVG-LOSS :1.4822791272166809

Confusion Matrix : 
[[368  19  19]
 [400  42  26]
 [193  15  25]]
F-Measure : 0.2974761419802244

-=-=-=-=-=-=-=-=-=-=-=-=-=-=-=-- Test iteration 279 on DEV -- LR :0.0007386666666666668 C-LOSS : 0.9818117022514343 AVG-LOSS :1.4804917435560907

Confusion Matrix : 
[[376  14  16]
 [405  36  27]
 [194  14  25]]
F-Measure : 0.2918907329180477

-=-=-=-=-=-=-=-=-=-=-=-=-=-=-=-- Test iteration 280 on DEV -- LR :0.0007517333333333328 C-LOSS : 1.0138623714447021 AVG-LOSS :1.4788311408083634

Confusion Matrix : 
[[372  12  22]
 [409  26  33]
 [186   9  38]]
F-Measure : 0.29049349653606554

-=-=-=-=-=-=-=-=-=-=-=-=-=-=-=-- Test iteration 281 on DEV -- LR :0.0007647999999999998 C-LOSS : 0.9952152967453003 AVG-LOSS :1.4771161910067214

Confusion Matrix : 
[[379   8  19]
 [416  18  34]
 [192  11  30]]
F-Measure : 0.26967254352512704

-=-=-=-=-=-=-=-=-=-=-=-=-=-=-=-- Test iteration 282 on DEV -- LR :0.0007778666666666669 C-LOSS : 1.098288893699646 AVG-LOSS :1.4757775786487457

Confusion Matrix : 
[[360  11  35]
 [397  24  47]
 [177  11  45]]
F-Measure : 0.2891630839087491

-=-=-=-=-=-=-=-=-=-=-=-=-=-=-=-- Test iteration 283 on DEV -- LR :0.0007909333333333338 C-LOSS : 1.0182856321334839 AVG-LOSS :1.4741666915131286

Confusion Matrix : 
[[350  22  34]
 [372  55  41]
 [175  14  44]]
F-Measure : 0.3328410771212604

-=-=-=-=-=-=-=-=-=-=-=-=-=-=-=-- Test iteration 284 on DEV -- LR :0.0008039999999999998 C-LOSS : 1.0139896869659424 AVG-LOSS :1.4725520353568227

Confusion Matrix : 
[[350  19  37]
 [389  37  42]
 [177  13  43]]
F-Measure : 0.30344534565917414

-=-=-=-=-=-=-=-=-=-=-=-=-=-=-=-- Test iteration 285 on DEV -- LR :0.0008170666666666668 C-LOSS : 1.05569326877594 AVG-LOSS :1.4710944872219245

Confusion Matrix : 
[[361   9  36]
 [399  26  43]
 [178  11  44]]
F-Measure : 0.29182111633838276

-=-=-=-=-=-=-=-=-=-=-=-=-=-=-=-- Test iteration 286 on DEV -- LR :0.000830133333333333 C-LOSS : 1.035563349723816 AVG-LOSS :1.4695769571261124

Confusion Matrix : 
[[327  24  55]
 [369  52  47]
 [167  15  51]]
F-Measure : 0.323286798838273

-=-=-=-=-=-=-=-=-=-=-=-=-=-=-=-- Test iteration 287 on DEV -- LR :0.0008431999999999999 C-LOSS : 1.033061146736145 AVG-LOSS :1.468061277228925

Confusion Matrix : 
[[246  67  93]
 [231 169  68]
 [126  37  70]]
F-Measure : 0.4351812790787103
> Save best model exp/pytorch_resnet_block256_ecapatdnn_good/tdnn_sentiment/finalf12/finalf12_tdnn_sentiment_pid-2814.mat

-=-=-=-=-=-=-=-=-=-=-=-=-=-=-=-- Test iteration 288 on DEV -- LR :0.0008562666666666668 C-LOSS : 1.0189971923828125 AVG-LOSS :1.4665074222640595

Confusion Matrix : 
[[286  52  68]
 [282 140  46]
 [148  29  56]]
F-Measure : 0.41727498991319556

-=-=-=-=-=-=-=-=-=-=-=-=-=-=-=-- Test iteration 289 on DEV -- LR :0.0008693333333333338 C-LOSS : 0.9983484148979187 AVG-LOSS :1.4648930808593488

Confusion Matrix : 
[[357  21  28]
 [394  45  29]
 [185  13  35]]
F-Measure : 0.3100229317217476

-=-=-=-=-=-=-=-=-=-=-=-=-=-=-=-- Test iteration 290 on DEV -- LR :0.0008823999999999999 C-LOSS : 1.0598758459091187 AVG-LOSS :1.463501269055396

Confusion Matrix : 
[[378   7  21]
 [427  17  24]
 [202   2  29]]
F-Measure : 0.2650885277561306

-=-=-=-=-=-=-=-=-=-=-=-=-=-=-=-- Test iteration 291 on DEV -- LR :0.0008954666666666669 C-LOSS : 0.9712865352630615 AVG-LOSS :1.4618156021588469

Confusion Matrix : 
[[344   7  55]
 [413  17  38]
 [182   3  48]]
F-Measure : 0.27067005563269425

-=-=-=-=-=-=-=-=-=-=-=-=-=-=-=-- Test iteration 292 on DEV -- LR :0.0009085333333333329 C-LOSS : 1.025899887084961 AVG-LOSS :1.4603278352132023

Confusion Matrix : 
[[277   8 121]
 [360  12  96]
 [139   2  92]]
F-Measure : 0.26405881854092317

-=-=-=-=-=-=-=-=-=-=-=-=-=-=-=-- Test iteration 293 on DEV -- LR :0.0009216 C-LOSS : 0.9760599136352539 AVG-LOSS :1.4586806654119167

Confusion Matrix : 
[[244   7 155]
 [310  15 143]
 [118   2 113]]
F-Measure : 0.2656692627853686

-=-=-=-=-=-=-=-=-=-=-=-=-=-=-=-- Test iteration 294 on DEV -- LR :0.000934666666666667 C-LOSS : 1.057698369026184 AVG-LOSS :1.4573214033902702

Confusion Matrix : 
[[294   6 106]
 [379   9  80]
 [153   1  79]]
F-Measure : 0.2575441560339022

-=-=-=-=-=-=-=-=-=-=-=-=-=-=-=-- Test iteration 295 on DEV -- LR :0.0009477333333333339 C-LOSS : 1.0268441438674927 AVG-LOSS :1.4558670883243148

Confusion Matrix : 
[[343   7  56]
 [419  11  38]
 [177   4  52]]
F-Measure : 0.2637976633211414

-=-=-=-=-=-=-=-=-=-=-=-=-=-=-=-- Test iteration 296 on DEV -- LR :0.0009607999999999999 C-LOSS : 1.0532864332199097 AVG-LOSS :1.4545115979030878

Confusion Matrix : 
[[367   8  31]
 [425  23  20]
 [184   7  42]]
F-Measure : 0.2874568032056642

-=-=-=-=-=-=-=-=-=-=-=-=-=-=-=-- Test iteration 297 on DEV -- LR :0.0009738666666666661 C-LOSS : 1.0304360389709473 AVG-LOSS :1.453088525557678

Confusion Matrix : 
[[358  14  34]
 [404  45  19]
 [177  14  42]]
F-Measure : 0.3194737211171962

-=-=-=-=-=-=-=-=-=-=-=-=-=-=-=-- Test iteration 298 on DEV -- LR :0.0009869333333333331 C-LOSS : 1.0159506797790527 AVG-LOSS :1.4516265260734686

Confusion Matrix : 
[[345  18  43]
 [387  53  28]
 [171  15  47]]
F-Measure : 0.33058236850931955

-=-=-=-=-=-=-=-=-=-=-=-=-=-=-=-- Test iteration 299 on DEV -- LR :0.001 C-LOSS : 1.0005221366882324 AVG-LOSS :1.4501228447755177

Confusion Matrix : 
[[352  20  34]
 [392  56  20]
 [176  15  42]]
F-Measure : 0.33316201269856716

-=-=-=-=-=-=-=-=-=-=-=-=-=-=-=-- Train epoch 4 --=-=-=-=-=-=-=-=-=-=-=-=-=-


-=-=-=-=-=-=-=-=-=-=-=-=-=-=-=-- Test iteration 300 on DEV -- LR :0.0009869333333333331 C-LOSS : 1.6682549715042114 AVG-LOSS :1.4508475362264437

Confusion Matrix : 
[[376  12  18]
 [409  44  15]
 [188  15  30]]
F-Measure : 0.31168826397783406

-=-=-=-=-=-=-=-=-=-=-=-=-=-=-=-- Test iteration 301 on DEV -- LR :0.000973866666666667 C-LOSS : 0.9805814623832703 AVG-LOSS :1.4492903637964993

Confusion Matrix : 
[[379  16  11]
 [404  53  11]
 [186  23  24]]
F-Measure : 0.3184177624786069

-=-=-=-=-=-=-=-=-=-=-=-=-=-=-=-- Test iteration 302 on DEV -- LR :0.0009607999999999999 C-LOSS : 1.1192570924758911 AVG-LOSS :1.4482011450792696

Confusion Matrix : 
[[386  18   2]
 [426  40   2]
 [213  18   2]]
F-Measure : 0.2635529899896696

-=-=-=-=-=-=-=-=-=-=-=-=-=-=-=-- Test iteration 303 on DEV -- LR :0.000947733333333333 C-LOSS : 1.0194921493530273 AVG-LOSS :1.4467909181196439

Confusion Matrix : 
[[349  55   2]
 [317 147   4]
 [174  57   2]]
F-Measure : 0.37991453898273453

-=-=-=-=-=-=-=-=-=-=-=-=-=-=-=-- Test iteration 304 on DEV -- LR :0.000934666666666667 C-LOSS : 0.9836656451225281 AVG-LOSS :1.4452724746016206

Confusion Matrix : 
[[352  52   2]
 [339 127   2]
 [176  55   2]]
F-Measure : 0.35931418410539656

-=-=-=-=-=-=-=-=-=-=-=-=-=-=-=-- Test iteration 305 on DEV -- LR :0.0009216 C-LOSS : 1.0797817707061768 AVG-LOSS :1.4440780605366028

Confusion Matrix : 
[[378  24   4]
 [379  83   6]
 [185  40   8]]
F-Measure : 0.33321758829069653

-=-=-=-=-=-=-=-=-=-=-=-=-=-=-=-- Test iteration 306 on DEV -- LR :0.0009085333333333329 C-LOSS : 0.9704810380935669 AVG-LOSS :1.4425353992257133

Confusion Matrix : 
[[383  17   6]
 [407  55   6]
 [189  28  16]]
F-Measure : 0.3105209584469573

-=-=-=-=-=-=-=-=-=-=-=-=-=-=-=-- Test iteration 307 on DEV -- LR :0.0008954666666666669 C-LOSS : 1.068917989730835 AVG-LOSS :1.4413223556883923

Confusion Matrix : 
[[388  10   8]
 [426  33   9]
 [195  17  21]]
F-Measure : 0.2865990226451146

-=-=-=-=-=-=-=-=-=-=-=-=-=-=-=-- Test iteration 308 on DEV -- LR :0.0008823999999999999 C-LOSS : 1.0385476350784302 AVG-LOSS :1.440018877628166

Confusion Matrix : 
[[371  14  21]
 [396  46  26]
 [182  22  29]]
F-Measure : 0.3110609425992269

-=-=-=-=-=-=-=-=-=-=-=-=-=-=-=-- Test iteration 309 on DEV -- LR :0.000869333333333333 C-LOSS : 1.0175296068191528 AVG-LOSS :1.438656009012653

Confusion Matrix : 
[[374  12  20]
 [391  47  30]
 [183  20  30]]
F-Measure : 0.31560811284883666

-=-=-=-=-=-=-=-=-=-=-=-=-=-=-=-- Test iteration 310 on DEV -- LR :0.0008562666666666668 C-LOSS : 0.988958477973938 AVG-LOSS :1.4372100362440396

Confusion Matrix : 
[[357  17  32]
 [379  53  36]
 [176  24  33]]
F-Measure : 0.32001329329283484

-=-=-=-=-=-=-=-=-=-=-=-=-=-=-=-- Test iteration 311 on DEV -- LR :0.0008431999999999999 C-LOSS : 0.9973543882369995 AVG-LOSS :1.4358002425004275

Confusion Matrix : 
[[389  11   6]
 [416  42  10]
 [206  21   6]]
F-Measure : 0.27679247343347274

-=-=-=-=-=-=-=-=-=-=-=-=-=-=-=-- Test iteration 312 on DEV -- LR :0.0008301333333333339 C-LOSS : 1.0925414562225342 AVG-LOSS :1.43470356906184

Confusion Matrix : 
[[372  31   3]
 [380  85   3]
 [200  29   4]]
F-Measure : 0.3251054198785777

-=-=-=-=-=-=-=-=-=-=-=-=-=-=-=-- Test iteration 313 on DEV -- LR :0.0008170666666666668 C-LOSS : 1.0552082061767578 AVG-LOSS :1.4334949851036072

Confusion Matrix : 
[[365  38   3]
 [371  92   5]
 [199  27   7]]
F-Measure : 0.33599511683595185

-=-=-=-=-=-=-=-=-=-=-=-=-=-=-=-- Test iteration 314 on DEV -- LR :0.0008039999999999998 C-LOSS : 1.0332324504852295 AVG-LOSS :1.432224310390533

Confusion Matrix : 
[[372  32   2]
 [384  79   5]
 [203  23   7]]
F-Measure : 0.3227907409296788

-=-=-=-=-=-=-=-=-=-=-=-=-=-=-=-- Test iteration 315 on DEV -- LR :0.0007909333333333338 C-LOSS : 1.0609862804412842 AVG-LOSS :1.4310495064982884

Confusion Matrix : 
[[387  15   4]
 [428  34   6]
 [212   9  12]]
F-Measure : 0.2725585463521953

-=-=-=-=-=-=-=-=-=-=-=-=-=-=-=-- Test iteration 316 on DEV -- LR :0.0007778666666666669 C-LOSS : 0.9924034476280212 AVG-LOSS :1.4296657649876567

Confusion Matrix : 
[[372  24  10]
 [403  56   9]
 [200  17  16]]
F-Measure : 0.3065230664658618

-=-=-=-=-=-=-=-=-=-=-=-=-=-=-=-- Test iteration 317 on DEV -- LR :0.0007647999999999998 C-LOSS : 1.2354698181152344 AVG-LOSS :1.4290550859094415

Confusion Matrix : 
[[294  37  75]
 [322  85  61]
 [146  24  63]]
F-Measure : 0.363076144104343

-=-=-=-=-=-=-=-=-=-=-=-=-=-=-=-- Test iteration 318 on DEV -- LR :0.0007517333333333337 C-LOSS : 1.0566953420639038 AVG-LOSS :1.427887813985161

Confusion Matrix : 
[[293   9 104]
 [321  31 116]
 [140  11  82]]
F-Measure : 0.3002997412071252

-=-=-=-=-=-=-=-=-=-=-=-=-=-=-=-- Test iteration 319 on DEV -- LR :0.0007386666666666668 C-LOSS : 1.0669846534729004 AVG-LOSS :1.42675999160856

Confusion Matrix : 
[[350   8  48]
 [394  15  59]
 [181   7  45]]
F-Measure : 0.26755552842646635

-=-=-=-=-=-=-=-=-=-=-=-=-=-=-=-- Test iteration 320 on DEV -- LR :0.0007255999999999999 C-LOSS : 0.9937360882759094 AVG-LOSS :1.4254110074860284

Confusion Matrix : 
[[362  16  28]
 [396  42  30]
 [187  13  33]]
F-Measure : 0.3053054719346944

-=-=-=-=-=-=-=-=-=-=-=-=-=-=-=-- Test iteration 321 on DEV -- LR :0.0007125333333333337 C-LOSS : 1.0471683740615845 AVG-LOSS :1.4242363409225984

Confusion Matrix : 
[[351  31  24]
 [382  66  20]
 [193  22  18]]
F-Measure : 0.3140443321656362

-=-=-=-=-=-=-=-=-=-=-=-=-=-=-=-- Test iteration 322 on DEV -- LR :0.0006994666666666667 C-LOSS : 1.0561656951904297 AVG-LOSS :1.4230968033197124

Confusion Matrix : 
[[331  25  50]
 [363  54  51]
 [165  21  47]]
F-Measure : 0.32424522492063507

-=-=-=-=-=-=-=-=-=-=-=-=-=-=-=-- Test iteration 323 on DEV -- LR :0.0006863999999999998 C-LOSS : 1.0589430332183838 AVG-LOSS :1.421972871930511

Confusion Matrix : 
[[314  20  72]
 [358  44  66]
 [161  16  56]]
F-Measure : 0.30899128229842526

-=-=-=-=-=-=-=-=-=-=-=-=-=-=-=-- Test iteration 324 on DEV -- LR :0.0006733333333333337 C-LOSS : 1.0566868782043457 AVG-LOSS :1.420848915026738

Confusion Matrix : 
[[347  16  43]
 [398  34  36]
 [182  14  37]]
F-Measure : 0.2896110246562681

-=-=-=-=-=-=-=-=-=-=-=-=-=-=-=-- Test iteration 325 on DEV -- LR :0.0006602666666666667 C-LOSS : 0.9736987948417664 AVG-LOSS :1.4194772888912013

Confusion Matrix : 
[[356  23  27]
 [400  53  15]
 [186  20  27]]
F-Measure : 0.31080831284707006

-=-=-=-=-=-=-=-=-=-=-=-=-=-=-=-- Test iteration 326 on DEV -- LR :0.0006471999999999997 C-LOSS : 1.0888203382492065 AVG-LOSS :1.4184661055559047

Confusion Matrix : 
[[340  45  21]
 [354 102  12]
 [179  34  20]]
F-Measure : 0.357316953573912

-=-=-=-=-=-=-=-=-=-=-=-=-=-=-=-- Test iteration 327 on DEV -- LR :0.0006341333333333336 C-LOSS : 1.1127302646636963 AVG-LOSS :1.41753398408977

Confusion Matrix : 
[[351  31  24]
 [380  75  13]
 [181  26  26]]
F-Measure : 0.33801107447430406

-=-=-=-=-=-=-=-=-=-=-=-=-=-=-=-- Test iteration 328 on DEV -- LR :0.0006210666666666667 C-LOSS : 0.9696869254112244 AVG-LOSS :1.4161727468293488

Confusion Matrix : 
[[355  12  39]
 [411  28  29]
 [177  15  41]]
F-Measure : 0.2887629686214156

-=-=-=-=-=-=-=-=-=-=-=-=-=-=-=-- Test iteration 329 on DEV -- LR :0.0006079999999999997 C-LOSS : 1.1195653676986694 AVG-LOSS :1.415273936589559

Confusion Matrix : 
[[326   8  72]
 [385  25  58]
 [154  12  67]]
F-Measure : 0.2949358540581858

-=-=-=-=-=-=-=-=-=-=-=-=-=-=-=-- Test iteration 330 on DEV -- LR :0.0005949333333333336 C-LOSS : 1.039595365524292 AVG-LOSS :1.4141389560123225

Confusion Matrix : 
[[325  10  71]
 [371  34  63]
 [155  12  66]]
F-Measure : 0.3086785540883369

-=-=-=-=-=-=-=-=-=-=-=-=-=-=-=-- Test iteration 331 on DEV -- LR :0.0005818666666666666 C-LOSS : 1.0107710361480713 AVG-LOSS :1.4129239923982735

Confusion Matrix : 
[[338  23  45]
 [384  50  34]
 [169  21  43]]
F-Measure : 0.3173689418998176

-=-=-=-=-=-=-=-=-=-=-=-=-=-=-=-- Test iteration 332 on DEV -- LR :0.0005687999999999997 C-LOSS : 0.9274276494979858 AVG-LOSS :1.411466045422597

Confusion Matrix : 
[[335  40  31]
 [358  88  22]
 [165  36  32]]
F-Measure : 0.3544967406391947

-=-=-=-=-=-=-=-=-=-=-=-=-=-=-=-- Test iteration 333 on DEV -- LR :0.0005557333333333336 C-LOSS : 1.0012874603271484 AVG-LOSS :1.4102379658265027

Confusion Matrix : 
[[313  63  30]
 [317 131  20]
 [162  44  27]]
F-Measure : 0.3851981942329886

-=-=-=-=-=-=-=-=-=-=-=-=-=-=-=-- Test iteration 334 on DEV -- LR :0.0005426666666666666 C-LOSS : 1.0022590160369873 AVG-LOSS :1.409020118215191

Confusion Matrix : 
[[320  46  40]
 [324 113  31]
 [153  42  38]]
F-Measure : 0.3847062172039162

-=-=-=-=-=-=-=-=-=-=-=-=-=-=-=-- Test iteration 335 on DEV -- LR :0.0005295999999999996 C-LOSS : 1.030231237411499 AVG-LOSS :1.407892770355656

Confusion Matrix : 
[[318  29  59]
 [344  73  51]
 [151  30  52]]
F-Measure : 0.3496413029806321

-=-=-=-=-=-=-=-=-=-=-=-=-=-=-=-- Test iteration 336 on DEV -- LR :0.0005165333333333336 C-LOSS : 0.9872708320617676 AVG-LOSS :1.4066446340402439

Confusion Matrix : 
[[329  17  60]
 [375  38  55]
 [163  16  54]]
F-Measure : 0.305729822796972

-=-=-=-=-=-=-=-=-=-=-=-=-=-=-=-- Test iteration 337 on DEV -- LR :0.0005034666666666666 C-LOSS : 1.0178046226501465 AVG-LOSS :1.405494219805362

Confusion Matrix : 
[[368   8  30]
 [409  27  32]
 [183  13  37]]
F-Measure : 0.28876516833900756

-=-=-=-=-=-=-=-=-=-=-=-=-=-=-=-- Test iteration 338 on DEV -- LR :0.0004904000000000004 C-LOSS : 1.0867186784744263 AVG-LOSS :1.4045538789754772

Confusion Matrix : 
[[381   8  17]
 [421  25  22]
 [200  13  20]]
F-Measure : 0.26844402155930774

-=-=-=-=-=-=-=-=-=-=-=-=-=-=-=-- Test iteration 339 on DEV -- LR :0.0004773333333333335 C-LOSS : 0.9316409230232239 AVG-LOSS :1.4031629585167942

Confusion Matrix : 
[[374  13  19]
 [400  40  28]
 [185  22  26]]
F-Measure : 0.2990308028608629

-=-=-=-=-=-=-=-=-=-=-=-=-=-=-=-- Test iteration 340 on DEV -- LR :0.0004642666666666665 C-LOSS : 0.9909031987190247 AVG-LOSS :1.4019539856141614

Confusion Matrix : 
[[370  17  19]
 [390  53  25]
 [186  26  21]]
F-Measure : 0.309860260067073

-=-=-=-=-=-=-=-=-=-=-=-=-=-=-=-- Test iteration 341 on DEV -- LR :0.00045120000000000045 C-LOSS : 1.0330021381378174 AVG-LOSS :1.400875179042593

Confusion Matrix : 
[[362  31  13]
 [378  70  20]
 [184  31  18]]
F-Measure : 0.3249735660193271

-=-=-=-=-=-=-=-=-=-=-=-=-=-=-=-- Test iteration 342 on DEV -- LR :0.00043813333333333343 C-LOSS : 0.9996722340583801 AVG-LOSS :1.3997054911563418

Confusion Matrix : 
[[357  41   8]
 [359  94  15]
 [184  34  15]]
F-Measure : 0.348580897441315

-=-=-=-=-=-=-=-=-=-=-=-=-=-=-=-- Test iteration 343 on DEV -- LR :0.0004250666666666665 C-LOSS : 0.9771641492843628 AVG-LOSS :1.3984771733020627

Confusion Matrix : 
[[360  38   8]
 [365  88  15]
 [190  29  14]]
F-Measure : 0.34115785441129665

-=-=-=-=-=-=-=-=-=-=-=-=-=-=-=-- Test iteration 344 on DEV -- LR :0.00041200000000000037 C-LOSS : 1.0423837900161743 AVG-LOSS :1.3974450185679008

Confusion Matrix : 
[[369  27  10]
 [388  63  17]
 [193  25  15]]
F-Measure : 0.31393729104491525

-=-=-=-=-=-=-=-=-=-=-=-=-=-=-=-- Test iteration 345 on DEV -- LR :0.00039893333333333345 C-LOSS : 0.9542254209518433 AVG-LOSS :1.3961640370719006

Confusion Matrix : 
[[349  21  36]
 [370  56  42]
 [174  25  34]]
F-Measure : 0.32162702433946755

-=-=-=-=-=-=-=-=-=-=-=-=-=-=-=-- Test iteration 346 on DEV -- LR :0.00038586666666666643 C-LOSS : 0.9692206382751465 AVG-LOSS :1.3949336526373277

Confusion Matrix : 
[[325  29  52]
 [329  75  64]
 [148  27  58]]
F-Measure : 0.3632009510850005

-=-=-=-=-=-=-=-=-=-=-=-=-=-=-=-- Test iteration 347 on DEV -- LR :0.0003728000000000004 C-LOSS : 0.9783583879470825 AVG-LOSS :1.3937365972790225

Confusion Matrix : 
[[314  36  56]
 [316  84  68]
 [143  30  60]]
F-Measure : 0.3708505025429046

-=-=-=-=-=-=-=-=-=-=-=-=-=-=-=-- Test iteration 348 on DEV -- LR :0.00035973333333333337 C-LOSS : 0.9911292195320129 AVG-LOSS :1.392582994477455

Confusion Matrix : 
[[312  31  63]
 [322  75  71]
 [138  29  66]]
F-Measure : 0.36360501524716565

-=-=-=-=-=-=-=-=-=-=-=-=-=-=-=-- Test iteration 349 on DEV -- LR :0.00034666666666666646 C-LOSS : 1.0160560607910156 AVG-LOSS :1.391507203238351

Confusion Matrix : 
[[328  22  56]
 [341  59  68]
 [146  27  60]]
F-Measure : 0.34422291042604547

-=-=-=-=-=-=-=-=-=-=-=-=-=-=-=-- Test iteration 350 on DEV -- LR :0.0003336000000000003 C-LOSS : 0.9573724865913391 AVG-LOSS :1.3902703521937727

Confusion Matrix : 
[[328  22  56]
 [348  58  62]
 [152  23  58]]
F-Measure : 0.3405509291126877

-=-=-=-=-=-=-=-=-=-=-=-=-=-=-=-- Test iteration 351 on DEV -- LR :0.0003205333333333334 C-LOSS : 0.936901330947876 AVG-LOSS :1.3889823720197787

Confusion Matrix : 
[[325  25  56]
 [350  59  59]
 [151  25  57]]
F-Measure : 0.33920376645096756

-=-=-=-=-=-=-=-=-=-=-=-=-=-=-=-- Test iteration 352 on DEV -- LR :0.00030746666666666637 C-LOSS : 0.974922776222229 AVG-LOSS :1.3878093986605788

Confusion Matrix : 
[[325  28  53]
 [342  69  57]
 [145  31  57]]
F-Measure : 0.3535989907624654

-=-=-=-=-=-=-=-=-=-=-=-=-=-=-=-- Test iteration 353 on DEV -- LR :0.0002944000000000003 C-LOSS : 0.9519554376602173 AVG-LOSS :1.3865781727820465

Confusion Matrix : 
[[319  37  50]
 [331  92  45]
 [147  35  51]]
F-Measure : 0.37423546459560364

-=-=-=-=-=-=-=-=-=-=-=-=-=-=-=-- Test iteration 354 on DEV -- LR :0.0002813333333333333 C-LOSS : 1.0426965951919556 AVG-LOSS :1.385609492281793

Confusion Matrix : 
[[319  47  40]
 [314 118  36]
 [148  44  41]]
F-Measure : 0.39381443099998026

-=-=-=-=-=-=-=-=-=-=-=-=-=-=-=-- Test iteration 355 on DEV -- LR :0.0002682666666666664 C-LOSS : 0.960223913192749 AVG-LOSS :1.384414588969745

Confusion Matrix : 
[[334  44  28]
 [334 110  24]
 [162  41  30]]
F-Measure : 0.37858989904975243

-=-=-=-=-=-=-=-=-=-=-=-=-=-=-=-- Test iteration 356 on DEV -- LR :0.00025520000000000024 C-LOSS : 1.0434606075286865 AVG-LOSS :1.3834595358004422

Confusion Matrix : 
[[350  34  22]
 [364  86  18]
 [177  32  24]]
F-Measure : 0.34924107705032814

-=-=-=-=-=-=-=-=-=-=-=-=-=-=-=-- Test iteration 357 on DEV -- LR :0.00024213333333333333 C-LOSS : 0.992019772529602 AVG-LOSS :1.3823661286404678

Confusion Matrix : 
[[361  27  18]
 [383  68  17]
 [187  27  19]]
F-Measure : 0.32337327336599103

-=-=-=-=-=-=-=-=-=-=-=-=-=-=-=-- Test iteration 358 on DEV -- LR :0.0002290666666666663 C-LOSS : 1.0438497066497803 AVG-LOSS :1.3814231859608281

Confusion Matrix : 
[[366  24  16]
 [393  58  17]
 [188  24  21]]
F-Measure : 0.31466130097896905

-=-=-=-=-=-=-=-=-=-=-=-=-=-=-=-- Test iteration 359 on DEV -- LR :0.00021600000000000026 C-LOSS : 1.1250633001327515 AVG-LOSS :1.3807110751668612

Confusion Matrix : 
[[372  19  15]
 [400  51  17]
 [193  19  21]]
F-Measure : 0.3073555639436624

-=-=-=-=-=-=-=-=-=-=-=-=-=-=-=-- Test iteration 360 on DEV -- LR :0.00020293333333333324 C-LOSS : 0.9522444009780884 AVG-LOSS :1.3795241868727095

Confusion Matrix : 
[[367  19  20]
 [398  51  19]
 [187  21  25]]
F-Measure : 0.3108078021968118

-=-=-=-=-=-=-=-=-=-=-=-=-=-=-=-- Test iteration 361 on DEV -- LR :0.00018986666666666633 C-LOSS : 1.019389271736145 AVG-LOSS :1.3785293390408406

Confusion Matrix : 
[[355  26  25]
 [379  65  24]
 [180  22  31]]
F-Measure : 0.33355749719607714

-=-=-=-=-=-=-=-=-=-=-=-=-=-=-=-- Test iteration 362 on DEV -- LR :0.00017680000000000018 C-LOSS : 0.9292593598365784 AVG-LOSS :1.3772916806959252

Confusion Matrix : 
[[348  30  28]
 [369  74  25]
 [172  28  33]]
F-Measure : 0.34494336220156235

-=-=-=-=-=-=-=-=-=-=-=-=-=-=-=-- Test iteration 363 on DEV -- LR :0.00016373333333333327 C-LOSS : 1.0069977045059204 AVG-LOSS :1.376274389552546

Confusion Matrix : 
[[342  33  31]
 [353  84  31]
 [164  33  36]]
F-Measure : 0.35901981407588784

-=-=-=-=-=-=-=-=-=-=-=-=-=-=-=-- Test iteration 364 on DEV -- LR :0.0001506666666666671 C-LOSS : 0.9922303557395935 AVG-LOSS :1.3752222141174422

Confusion Matrix : 
[[336  33  37]
 [346  87  35]
 [162  31  40]]
F-Measure : 0.36481364503604685

-=-=-=-=-=-=-=-=-=-=-=-=-=-=-=-- Test iteration 365 on DEV -- LR :0.0001376000000000002 C-LOSS : 1.0195444822311401 AVG-LOSS :1.3742504170357854

Confusion Matrix : 
[[335  33  38]
 [348  84  36]
 [165  31  37]]
F-Measure : 0.3565314424023164

-=-=-=-=-=-=-=-=-=-=-=-=-=-=-=-- Test iteration 366 on DEV -- LR :0.00012453333333333318 C-LOSS : 0.9864479899406433 AVG-LOSS :1.3731937346731284

Confusion Matrix : 
[[344  32  30]
 [361  80  27]
 [168  31  34]]
F-Measure : 0.3521680647123954

-=-=-=-=-=-=-=-=-=-=-=-=-=-=-=-- Test iteration 367 on DEV -- LR :0.00011146666666666714 C-LOSS : 0.9664345383644104 AVG-LOSS :1.3720884107701157

Confusion Matrix : 
[[349  32  25]
 [368  75  25]
 [172  28  33]]
F-Measure : 0.34680659425674704

-=-=-=-=-=-=-=-=-=-=-=-=-=-=-=-- Test iteration 368 on DEV -- LR :9.840000000000011e-05 C-LOSS : 0.9432352185249329 AVG-LOSS :1.3709262069970936

Confusion Matrix : 
[[354  29  23]
 [371  74  23]
 [177  27  29]]
F-Measure : 0.34278606885551344

-=-=-=-=-=-=-=-=-=-=-=-=-=-=-=-- Test iteration 369 on DEV -- LR :8.53333333333332e-05 C-LOSS : 0.9342102408409119 AVG-LOSS :1.3697458935750497

Confusion Matrix : 
[[352  32  22]
 [370  75  23]
 [177  27  29]]
F-Measure : 0.3429566954627161

-=-=-=-=-=-=-=-=-=-=-=-=-=-=-=-- Test iteration 370 on DEV -- LR :7.226666666666705e-05 C-LOSS : 0.9435148239135742 AVG-LOSS :1.368597022767337

Confusion Matrix : 
[[352  32  22]
 [370  75  23]
 [179  27  27]]
F-Measure : 0.340154312847834

-=-=-=-=-=-=-=-=-=-=-=-=-=-=-=-- Test iteration 371 on DEV -- LR :5.920000000000014e-05 C-LOSS : 1.0177626609802246 AVG-LOSS :1.3676539196442532

Confusion Matrix : 
[[352  32  22]
 [368  77  23]
 [175  30  28]]
F-Measure : 0.34423749119321095

-=-=-=-=-=-=-=-=-=-=-=-=-=-=-=-- Test iteration 372 on DEV -- LR :4.613333333333312e-05 C-LOSS : 0.9817367196083069 AVG-LOSS :1.3666192890811542

Confusion Matrix : 
[[349  34  23]
 [364  79  25]
 [173  31  29]]
F-Measure : 0.34666453032918093

-=-=-=-=-=-=-=-=-=-=-=-=-=-=-=-- Test iteration 373 on DEV -- LR :3.306666666666707e-05 C-LOSS : 0.9960208535194397 AVG-LOSS :1.365628384173235

Confusion Matrix : 
[[347  36  23]
 [358  85  25]
 [171  33  29]]
F-Measure : 0.3534672336234973

-=-=-=-=-=-=-=-=-=-=-=-=-=-=-=-- Test iteration 374 on DEV -- LR :2.0000000000000052e-05 C-LOSS : 0.9807640910148621 AVG-LOSS :1.3646020793914795

Confusion Matrix : 
[[347  36  23]
 [355  88  25]
 [170  33  30]]
F-Measure : 0.3588194958873306

-=-=-=-=-=-=-=-=-=-=-=-=-=-=-=-- Test Best Model pid-2814 on TEST --=-=-=-=-=-=-=-=-=-=-=-=-=-

> Best Model on DEV pid-2814 loaded
Confusion Matrix : 
[[468 230 134]
 [589 482 185]
 [236 128 157]]
F-Measure : 0.4247688425931385
