2021-10-29 02:31:17,892 - speechbrain.core - INFO - Beginning experiment!
2021-10-29 02:31:17,892 - speechbrain.core - INFO - Experiment folder: ./results/urban_sound/kaldi/fold_10
2021-10-29 02:31:19,146 - speechbrain.utils.superpowers - DEBUG - absl-py==0.13.0
appdirs==1.4.4
attrs==21.2.0
backports.entry-points-selectable==1.1.0
black==19.10b0
cachetools==4.2.2
certifi==2021.10.8
cfgv==3.3.1
charset-normalizer==2.0.4
click==8.0.1
cycler==0.10.0
distlib==0.3.2
entrypoints==0.3
filelock==3.0.12
flake8==3.7.9
google-auth==1.35.0
google-auth-oauthlib==0.4.6
grpcio==1.39.0
huggingface-hub==0.0.16
HyperPyYAML==1.0.0
identify==2.2.13
idna==3.2
joblib==1.0.1
kaldi-io==0.9.4
kiwisolver==1.3.2
Markdown==3.3.4
matplotlib==3.4.3
mccabe==0.6.1
mkl-fft==1.3.1
mkl-random @ file:///tmp/build/80754af9/mkl_random_1626186064646/work
mkl-service==2.4.0
more-itertools==8.8.0
nodeenv==1.6.0
numpy @ file:///tmp/build/80754af9/numpy_and_numpy_base_1634095647912/work
oauthlib==3.1.1
olefile @ file:///Users/ktietz/demo/mc3/conda-bld/olefile_1629805411829/work
packaging==21.0
pandas==1.3.2
pathspec==0.9.0
Pillow==8.4.0
platformdirs==2.3.0
pluggy==0.13.1
pre-commit==2.14.1
protobuf==3.17.3
py==1.10.0
pyasn1==0.4.8
pyasn1-modules==0.2.8
pybind11==2.8.0
pycodestyle==2.5.0
pyflakes==2.1.1
PyKaldi==0.0.1
pyparsing==2.4.7
pytest==5.4.1
python-dateutil==2.8.2
pytz==2021.1
PyYAML==5.4.1
regex==2021.8.28
requests==2.26.0
requests-oauthlib==1.3.0
rsa==4.7.2
ruamel.yaml==0.17.16
ruamel.yaml.clib==0.2.6
scikit-learn==0.24.2
scipy==1.7.1
sentencepiece==0.1.96
six @ file:///tmp/build/80754af9/six_1623709665295/work
sklearn==0.0
-e git+https://github.com/speechbrain/speechbrain.git@98f90f82acc327a8180f3591135a18e278d3e0e2#egg=speechbrain
tensorboard==2.6.0
tensorboard-data-server==0.6.1
tensorboard-plugin-wit==1.8.0
threadpoolctl==2.2.0
toml==0.10.2
torch==1.10.0
torchaudio==0.10.0
torchvision==0.11.1
tqdm==4.62.2
typed-ast==1.4.3
typing-extensions @ file:///tmp/build/80754af9/typing_extensions_1631814937681/work
urllib3==1.26.6
virtualenv==20.7.2
wcwidth==0.2.5
Werkzeug==2.0.1
yamllint==1.23.0


2021-10-29 02:31:19,197 - speechbrain.utils.superpowers - DEBUG - 98f90f82


2021-10-29 02:31:19,696 - urbansound8k_prepare - INFO - Creating /data/coros1/qraymondaud/UrbanSound8K/manifest/train.json, /data/coros1/qraymondaud/UrbanSound8K/manifest/valid.json, and /data/coros1/qraymondaud/UrbanSound8K/manifest/test.json
2021-10-29 02:42:23,243 - urbansound8k_prepare - INFO - /data/coros1/qraymondaud/UrbanSound8K/manifest/train.json successfully created!
2021-10-29 02:43:16,738 - urbansound8k_prepare - INFO - /data/coros1/qraymondaud/UrbanSound8K/manifest/valid.json successfully created!
2021-10-29 02:43:20,907 - urbansound8k_prepare - INFO - /data/coros1/qraymondaud/UrbanSound8K/manifest/test.json successfully created!
2021-10-29 02:43:20,996 - speechbrain.dataio.encoder - DEBUG - Would load categorical encoding from ./results/urban_sound/kaldi/fold_10/save/label_encoder.txt, but file doesn't exist yet.
2021-10-29 02:43:21,039 - speechbrain.dataio.encoder - INFO - Load called, but CategoricalEncoder is not empty. Loaded data will overwrite everything. This is normal if there is e.g. an unk label defined at init.
2021-10-29 02:43:21,040 - speechbrain.dataio.encoder - DEBUG - Loaded categorical encoding from ./results/urban_sound/kaldi/fold_10/save/label_encoder.txt
2021-10-29 02:43:21,040 - speechbrain.core - INFO - Info: ckpt_interval_minutes arg from hparam file is used
2021-10-29 02:43:24,104 - speechbrain.core - INFO - 20.6M trainable parameters in UrbanSound8kBrain
2021-10-29 02:43:24,107 - speechbrain.utils.checkpoints - INFO - Would load a checkpoint here, but none found yet.
2021-10-29 02:43:24,107 - speechbrain.utils.epoch_loop - INFO - Going into epoch 1
2021-10-29 02:59:34,528 - speechbrain.nnet.schedulers - INFO - Changing lr from 4.2e-06 to 4.2e-06
2021-10-29 02:59:34,596 - matplotlib.font_manager - DEBUG - findfont: Matching sans\-serif:style=normal:variant=normal:weight=normal:stretch=normal:size=18.0.
2021-10-29 02:59:34,596 - matplotlib.font_manager - DEBUG - findfont: score(<Font 'DejaVu Sans' (DejaVuSans-Oblique.ttf) oblique normal 400 normal>) = 1.05
2021-10-29 02:59:34,596 - matplotlib.font_manager - DEBUG - findfont: score(<Font 'STIXGeneral' (STIXGeneralBolIta.ttf) italic normal 700 normal>) = 11.335
2021-10-29 02:59:34,596 - matplotlib.font_manager - DEBUG - findfont: score(<Font 'STIXNonUnicode' (STIXNonUniBolIta.ttf) italic normal 700 normal>) = 11.335
2021-10-29 02:59:34,596 - matplotlib.font_manager - DEBUG - findfont: score(<Font 'cmsy10' (cmsy10.ttf) normal normal 400 normal>) = 10.05
2021-10-29 02:59:34,596 - matplotlib.font_manager - DEBUG - findfont: score(<Font 'STIXNonUnicode' (STIXNonUni.ttf) normal normal 400 normal>) = 10.05
2021-10-29 02:59:34,596 - matplotlib.font_manager - DEBUG - findfont: score(<Font 'DejaVu Serif' (DejaVuSerif-Bold.ttf) normal normal 700 normal>) = 10.335
2021-10-29 02:59:34,596 - matplotlib.font_manager - DEBUG - findfont: score(<Font 'cmmi10' (cmmi10.ttf) normal normal 400 normal>) = 10.05
2021-10-29 02:59:34,596 - matplotlib.font_manager - DEBUG - findfont: score(<Font 'DejaVu Serif' (DejaVuSerif.ttf) normal normal 400 normal>) = 10.05
2021-10-29 02:59:34,596 - matplotlib.font_manager - DEBUG - findfont: score(<Font 'STIXGeneral' (STIXGeneralItalic.ttf) italic normal 400 normal>) = 11.05
2021-10-29 02:59:34,596 - matplotlib.font_manager - DEBUG - findfont: score(<Font 'STIXSizeFiveSym' (STIXSizFiveSymReg.ttf) normal normal 400 normal>) = 10.05
2021-10-29 02:59:34,596 - matplotlib.font_manager - DEBUG - findfont: score(<Font 'STIXSizeTwoSym' (STIXSizTwoSymReg.ttf) normal normal 400 normal>) = 10.05
2021-10-29 02:59:34,596 - matplotlib.font_manager - DEBUG - findfont: score(<Font 'DejaVu Sans Display' (DejaVuSansDisplay.ttf) normal normal 400 normal>) = 10.05
2021-10-29 02:59:34,596 - matplotlib.font_manager - DEBUG - findfont: score(<Font 'DejaVu Sans' (DejaVuSans.ttf) normal normal 400 normal>) = 0.05
2021-10-29 02:59:34,597 - matplotlib.font_manager - DEBUG - findfont: score(<Font 'cmss10' (cmss10.ttf) normal normal 400 normal>) = 10.05
2021-10-29 02:59:34,597 - matplotlib.font_manager - DEBUG - findfont: score(<Font 'cmex10' (cmex10.ttf) normal normal 400 normal>) = 10.05
2021-10-29 02:59:34,597 - matplotlib.font_manager - DEBUG - findfont: score(<Font 'DejaVu Sans' (DejaVuSans-Bold.ttf) normal normal 700 normal>) = 0.33499999999999996
2021-10-29 02:59:34,597 - matplotlib.font_manager - DEBUG - findfont: score(<Font 'DejaVu Sans Mono' (DejaVuSansMono-BoldOblique.ttf) oblique normal 700 normal>) = 11.335
2021-10-29 02:59:34,597 - matplotlib.font_manager - DEBUG - findfont: score(<Font 'STIXSizeFourSym' (STIXSizFourSymBol.ttf) normal normal 700 normal>) = 10.335
2021-10-29 02:59:34,597 - matplotlib.font_manager - DEBUG - findfont: score(<Font 'DejaVu Sans Mono' (DejaVuSansMono-Bold.ttf) normal normal 700 normal>) = 10.335
2021-10-29 02:59:34,597 - matplotlib.font_manager - DEBUG - findfont: score(<Font 'STIXSizeFourSym' (STIXSizFourSymReg.ttf) normal normal 400 normal>) = 10.05
2021-10-29 02:59:34,597 - matplotlib.font_manager - DEBUG - findfont: score(<Font 'STIXSizeOneSym' (STIXSizOneSymBol.ttf) normal normal 700 normal>) = 10.335
2021-10-29 02:59:34,597 - matplotlib.font_manager - DEBUG - findfont: score(<Font 'cmr10' (cmr10.ttf) normal normal 400 normal>) = 10.05
2021-10-29 02:59:34,597 - matplotlib.font_manager - DEBUG - findfont: score(<Font 'cmtt10' (cmtt10.ttf) normal normal 400 normal>) = 10.05
2021-10-29 02:59:34,597 - matplotlib.font_manager - DEBUG - findfont: score(<Font 'DejaVu Sans Mono' (DejaVuSansMono.ttf) normal normal 400 normal>) = 10.05
2021-10-29 02:59:34,597 - matplotlib.font_manager - DEBUG - findfont: score(<Font 'STIXSizeThreeSym' (STIXSizThreeSymReg.ttf) normal normal 400 normal>) = 10.05
2021-10-29 02:59:34,597 - matplotlib.font_manager - DEBUG - findfont: score(<Font 'DejaVu Serif' (DejaVuSerif-Italic.ttf) italic normal 400 normal>) = 11.05
2021-10-29 02:59:34,597 - matplotlib.font_manager - DEBUG - findfont: score(<Font 'DejaVu Sans' (DejaVuSans-BoldOblique.ttf) oblique normal 700 normal>) = 1.335
2021-10-29 02:59:34,597 - matplotlib.font_manager - DEBUG - findfont: score(<Font 'STIXGeneral' (STIXGeneralBol.ttf) normal normal 700 normal>) = 10.335
2021-10-29 02:59:34,597 - matplotlib.font_manager - DEBUG - findfont: score(<Font 'cmb10' (cmb10.ttf) normal normal 400 normal>) = 10.05
2021-10-29 02:59:34,597 - matplotlib.font_manager - DEBUG - findfont: score(<Font 'STIXSizeThreeSym' (STIXSizThreeSymBol.ttf) normal normal 700 normal>) = 10.335
2021-10-29 02:59:34,597 - matplotlib.font_manager - DEBUG - findfont: score(<Font 'STIXSizeOneSym' (STIXSizOneSymReg.ttf) normal normal 400 normal>) = 10.05
2021-10-29 02:59:34,597 - matplotlib.font_manager - DEBUG - findfont: score(<Font 'STIXNonUnicode' (STIXNonUniIta.ttf) italic normal 400 normal>) = 11.05
2021-10-29 02:59:34,597 - matplotlib.font_manager - DEBUG - findfont: score(<Font 'STIXSizeTwoSym' (STIXSizTwoSymBol.ttf) normal normal 700 normal>) = 10.335
2021-10-29 02:59:34,597 - matplotlib.font_manager - DEBUG - findfont: score(<Font 'DejaVu Serif Display' (DejaVuSerifDisplay.ttf) normal normal 400 normal>) = 10.05
2021-10-29 02:59:34,597 - matplotlib.font_manager - DEBUG - findfont: score(<Font 'DejaVu Sans Mono' (DejaVuSansMono-Oblique.ttf) oblique normal 400 normal>) = 11.05
2021-10-29 02:59:34,597 - matplotlib.font_manager - DEBUG - findfont: score(<Font 'DejaVu Serif' (DejaVuSerif-BoldItalic.ttf) italic normal 700 normal>) = 11.335
2021-10-29 02:59:34,597 - matplotlib.font_manager - DEBUG - findfont: score(<Font 'STIXGeneral' (STIXGeneral.ttf) normal normal 400 normal>) = 10.05
2021-10-29 02:59:34,597 - matplotlib.font_manager - DEBUG - findfont: score(<Font 'STIXNonUnicode' (STIXNonUniBol.ttf) normal normal 700 normal>) = 10.335
2021-10-29 02:59:34,597 - matplotlib.font_manager - DEBUG - findfont: score(<Font 'Latin Modern Roman' (lmroman12-italic.otf) italic normal 400 normal>) = 11.05
2021-10-29 02:59:34,598 - matplotlib.font_manager - DEBUG - findfont: score(<Font 'Liberation Mono' (LiberationMono-Bold.ttf) normal normal 700 normal>) = 10.335
2021-10-29 02:59:34,598 - matplotlib.font_manager - DEBUG - findfont: score(<Font 'Latin Modern Roman' (lmroman8-bold.otf) normal normal 700 normal>) = 10.335
2021-10-29 02:59:34,598 - matplotlib.font_manager - DEBUG - findfont: score(<Font 'Latin Modern Roman' (lmroman10-italic.otf) italic normal 400 normal>) = 11.05
2021-10-29 02:59:34,598 - matplotlib.font_manager - DEBUG - findfont: score(<Font 'Latin Modern Sans Demi Cond' (lmsansdemicond10-regular.otf) normal normal 600 condensed>) = 10.44
2021-10-29 02:59:34,598 - matplotlib.font_manager - DEBUG - findfont: score(<Font 'Latin Modern Math' (latinmodern-math.otf) normal normal 400 normal>) = 10.05
2021-10-29 02:59:34,598 - matplotlib.font_manager - DEBUG - findfont: score(<Font 'Latin Modern Roman Slanted' (lmromanslant17-regular.otf) normal normal 400 normal>) = 10.05
2021-10-29 02:59:34,598 - matplotlib.font_manager - DEBUG - findfont: score(<Font 'Latin Modern Mono Light Cond' (lmmonoltcond10-oblique.otf) oblique normal 400 condensed>) = 11.25
2021-10-29 02:59:34,598 - matplotlib.font_manager - DEBUG - findfont: score(<Font 'Lato' (Lato-SemiboldItalic.ttf) italic normal 600 normal>) = 11.24
2021-10-29 02:59:34,598 - matplotlib.font_manager - DEBUG - findfont: score(<Font 'Lato' (Lato-BoldItalic.ttf) italic normal 700 normal>) = 11.335
2021-10-29 02:59:34,598 - matplotlib.font_manager - DEBUG - findfont: score(<Font 'Liberation Sans' (LiberationSans-Italic.ttf) italic normal 400 normal>) = 11.05
2021-10-29 02:59:34,598 - matplotlib.font_manager - DEBUG - findfont: score(<Font 'DejaVu Sans Mono' (DejaVuSansMono-Bold.ttf) normal normal 700 normal>) = 10.335
2021-10-29 02:59:34,598 - matplotlib.font_manager - DEBUG - findfont: score(<Font 'Lato' (Lato-Italic.ttf) italic normal 400 normal>) = 11.05
2021-10-29 02:59:34,598 - matplotlib.font_manager - DEBUG - findfont: score(<Font 'Latin Modern Sans' (lmsans12-regular.otf) normal normal 400 normal>) = 10.05
2021-10-29 02:59:34,598 - matplotlib.font_manager - DEBUG - findfont: score(<Font 'Latin Modern Sans' (lmsans17-oblique.otf) oblique normal 400 normal>) = 11.05
2021-10-29 02:59:34,598 - matplotlib.font_manager - DEBUG - findfont: score(<Font 'Latin Modern Mono Light' (lmmonolt10-oblique.otf) oblique normal 400 normal>) = 11.05
2021-10-29 02:59:34,598 - matplotlib.font_manager - DEBUG - findfont: score(<Font 'Latin Modern Roman Slanted' (lmromanslant8-regular.otf) normal normal 400 normal>) = 10.05
2021-10-29 02:59:34,598 - matplotlib.font_manager - DEBUG - findfont: score(<Font 'Latin Modern Sans' (lmsans10-bold.otf) normal normal 700 normal>) = 10.335
2021-10-29 02:59:34,598 - matplotlib.font_manager - DEBUG - findfont: score(<Font 'Latin Modern Mono Prop' (lmmonoprop10-oblique.otf) oblique normal 400 normal>) = 11.05
2021-10-29 02:59:34,598 - matplotlib.font_manager - DEBUG - findfont: score(<Font 'Latin Modern Sans' (lmsans10-regular.otf) normal normal 400 normal>) = 10.05
2021-10-29 02:59:34,598 - matplotlib.font_manager - DEBUG - findfont: score(<Font 'Latin Modern Mono Caps' (lmmonocaps10-oblique.otf) oblique normal 400 normal>) = 11.05
2021-10-29 02:59:34,598 - matplotlib.font_manager - DEBUG - findfont: score(<Font 'Lato' (Lato-Heavy.ttf) normal normal 800 normal>) = 10.43
2021-10-29 02:59:34,598 - matplotlib.font_manager - DEBUG - findfont: score(<Font 'Latin Modern Roman Dunhill' (lmromandunh10-oblique.otf) oblique normal 400 normal>) = 11.05
2021-10-29 02:59:34,598 - matplotlib.font_manager - DEBUG - findfont: score(<Font 'DejaVu Serif' (DejaVuSerif.ttf) normal normal 400 normal>) = 10.05
2021-10-29 02:59:34,598 - matplotlib.font_manager - DEBUG - findfont: score(<Font 'Liberation Sans' (LiberationSans-BoldItalic.ttf) italic normal 700 normal>) = 11.335
2021-10-29 02:59:34,598 - matplotlib.font_manager - DEBUG - findfont: score(<Font 'Latin Modern Roman' (lmroman10-regular.otf) normal normal 400 normal>) = 10.05
2021-10-29 02:59:34,598 - matplotlib.font_manager - DEBUG - findfont: score(<Font 'Latin Modern Sans' (lmsans12-oblique.otf) oblique normal 400 normal>) = 11.05
2021-10-29 02:59:34,599 - matplotlib.font_manager - DEBUG - findfont: score(<Font 'Latin Modern Mono' (lmmono9-regular.otf) normal normal 400 normal>) = 10.05
2021-10-29 02:59:34,599 - matplotlib.font_manager - DEBUG - findfont: score(<Font 'Liberation Mono' (LiberationMono-Regular.ttf) normal normal 400 normal>) = 10.05
2021-10-29 02:59:34,599 - matplotlib.font_manager - DEBUG - findfont: score(<Font 'Liberation Sans' (LiberationSans-Bold.ttf) normal normal 700 normal>) = 10.335
2021-10-29 02:59:34,599 - matplotlib.font_manager - DEBUG - findfont: score(<Font 'Latin Modern Sans Quotation' (lmsansquot8-bold.otf) normal normal 700 normal>) = 10.335
2021-10-29 02:59:34,599 - matplotlib.font_manager - DEBUG - findfont: score(<Font 'Latin Modern Sans Quotation' (lmsansquot8-oblique.otf) oblique normal 400 normal>) = 11.05
2021-10-29 02:59:34,599 - matplotlib.font_manager - DEBUG - findfont: score(<Font 'Latin Modern Roman' (lmroman7-italic.otf) italic normal 400 normal>) = 11.05
2021-10-29 02:59:34,599 - matplotlib.font_manager - DEBUG - findfont: score(<Font 'Latin Modern Sans' (lmsans17-regular.otf) normal normal 400 normal>) = 10.05
2021-10-29 02:59:34,599 - matplotlib.font_manager - DEBUG - findfont: score(<Font 'Liberation Sans Narrow' (LiberationSansNarrow-BoldItalic.ttf) italic normal 700 condensed>) = 11.535
2021-10-29 02:59:34,599 - matplotlib.font_manager - DEBUG - findfont: score(<Font 'Latin Modern Sans Demi Cond' (lmsansdemicond10-oblique.otf) oblique normal 600 condensed>) = 11.44
2021-10-29 02:59:34,599 - matplotlib.font_manager - DEBUG - findfont: score(<Font 'Latin Modern Sans' (lmsans8-oblique.otf) oblique normal 400 normal>) = 11.05
2021-10-29 02:59:34,599 - matplotlib.font_manager - DEBUG - findfont: score(<Font 'Lato' (Lato-BlackItalic.ttf) italic normal 900 normal>) = 11.525
2021-10-29 02:59:34,599 - matplotlib.font_manager - DEBUG - findfont: score(<Font 'Latin Modern Roman' (lmroman5-regular.otf) normal normal 400 normal>) = 10.05
2021-10-29 02:59:34,599 - matplotlib.font_manager - DEBUG - findfont: score(<Font 'Lato' (Lato-Hairline.ttf) normal normal 100 normal>) = 10.335
2021-10-29 02:59:34,599 - matplotlib.font_manager - DEBUG - findfont: score(<Font 'Latin Modern Roman' (lmroman12-regular.otf) normal normal 400 normal>) = 10.05
2021-10-29 02:59:34,599 - matplotlib.font_manager - DEBUG - findfont: score(<Font 'Latin Modern Roman' (lmroman5-bold.otf) normal normal 700 normal>) = 10.335
2021-10-29 02:59:34,599 - matplotlib.font_manager - DEBUG - findfont: score(<Font 'Latin Modern Sans' (lmsans9-oblique.otf) oblique normal 400 normal>) = 11.05
2021-10-29 02:59:34,599 - matplotlib.font_manager - DEBUG - findfont: score(<Font 'Latin Modern Sans Quotation' (lmsansquot8-boldoblique.otf) oblique normal 700 normal>) = 11.335
2021-10-29 02:59:34,599 - matplotlib.font_manager - DEBUG - findfont: score(<Font 'Latin Modern Mono Prop Light' (lmmonoproplt10-oblique.otf) oblique normal 400 normal>) = 11.05
2021-10-29 02:59:34,599 - matplotlib.font_manager - DEBUG - findfont: score(<Font 'Latin Modern Mono Slanted' (lmmonoslant10-regular.otf) normal normal 400 normal>) = 10.05
2021-10-29 02:59:34,599 - matplotlib.font_manager - DEBUG - findfont: score(<Font 'Liberation Serif' (LiberationSerif-Bold.ttf) normal normal 700 normal>) = 10.335
2021-10-29 02:59:34,599 - matplotlib.font_manager - DEBUG - findfont: score(<Font 'Liberation Sans' (LiberationSans-Regular.ttf) normal normal 400 normal>) = 10.05
2021-10-29 02:59:34,599 - matplotlib.font_manager - DEBUG - findfont: score(<Font 'Latin Modern Mono' (lmmono10-italic.otf) italic normal 400 normal>) = 11.05
2021-10-29 02:59:34,599 - matplotlib.font_manager - DEBUG - findfont: score(<Font 'Latin Modern Roman' (lmroman7-bold.otf) normal normal 700 normal>) = 10.335
2021-10-29 02:59:34,599 - matplotlib.font_manager - DEBUG - findfont: score(<Font 'Lato' (Lato-HeavyItalic.ttf) italic normal 800 normal>) = 11.43
2021-10-29 02:59:34,599 - matplotlib.font_manager - DEBUG - findfont: score(<Font 'DejaVu Sans' (DejaVuSans-Bold.ttf) normal normal 700 normal>) = 0.33499999999999996
2021-10-29 02:59:34,599 - matplotlib.font_manager - DEBUG - findfont: score(<Font 'Lato' (Lato-Regular.ttf) normal normal 400 normal>) = 10.05
2021-10-29 02:59:34,599 - matplotlib.font_manager - DEBUG - findfont: score(<Font 'Latin Modern Mono Prop Light' (lmmonoproplt10-regular.otf) normal normal 400 normal>) = 10.05
2021-10-29 02:59:34,600 - matplotlib.font_manager - DEBUG - findfont: score(<Font 'Latin Modern Roman' (lmroman17-regular.otf) normal normal 400 normal>) = 10.05
2021-10-29 02:59:34,600 - matplotlib.font_manager - DEBUG - findfont: score(<Font 'Latin Modern Mono Light Cond' (lmmonoltcond10-regular.otf) normal normal 400 condensed>) = 10.25
2021-10-29 02:59:34,600 - matplotlib.font_manager - DEBUG - findfont: score(<Font 'Latin Modern Mono Prop' (lmmonoprop10-regular.otf) normal normal 400 normal>) = 10.05
2021-10-29 02:59:34,600 - matplotlib.font_manager - DEBUG - findfont: score(<Font 'Liberation Sans Narrow' (LiberationSansNarrow-Bold.ttf) normal normal 700 condensed>) = 10.535
2021-10-29 02:59:34,600 - matplotlib.font_manager - DEBUG - findfont: score(<Font 'Lato' (Lato-Medium.ttf) normal normal 500 normal>) = 10.145
2021-10-29 02:59:34,600 - matplotlib.font_manager - DEBUG - findfont: score(<Font 'Latin Modern Mono Light' (lmmonolt10-bold.otf) normal normal 700 normal>) = 10.335
2021-10-29 02:59:34,600 - matplotlib.font_manager - DEBUG - findfont: score(<Font 'Liberation Serif' (LiberationSerif-Italic.ttf) italic normal 400 normal>) = 11.05
2021-10-29 02:59:34,600 - matplotlib.font_manager - DEBUG - findfont: score(<Font 'Latin Modern Mono' (lmmono8-regular.otf) normal normal 400 normal>) = 10.05
2021-10-29 02:59:34,600 - matplotlib.font_manager - DEBUG - findfont: score(<Font 'Lato' (Lato-Light.ttf) normal normal 300 normal>) = 10.145
2021-10-29 02:59:34,600 - matplotlib.font_manager - DEBUG - findfont: score(<Font 'Latin Modern Roman Caps' (lmromancaps10-oblique.otf) oblique normal 400 normal>) = 11.05
2021-10-29 02:59:34,600 - matplotlib.font_manager - DEBUG - findfont: score(<Font 'Latin Modern Roman Slanted' (lmromanslant10-bold.otf) normal normal 700 normal>) = 10.335
2021-10-29 02:59:34,600 - matplotlib.font_manager - DEBUG - findfont: score(<Font 'Noto Mono' (NotoMono-Regular.ttf) normal normal 400 normal>) = 10.05
2021-10-29 02:59:34,600 - matplotlib.font_manager - DEBUG - findfont: score(<Font 'Liberation Mono' (LiberationMono-BoldItalic.ttf) italic normal 700 normal>) = 11.335
2021-10-29 02:59:34,600 - matplotlib.font_manager - DEBUG - findfont: score(<Font 'Latin Modern Roman' (lmroman10-bold.otf) normal normal 700 normal>) = 10.335
2021-10-29 02:59:34,600 - matplotlib.font_manager - DEBUG - findfont: score(<Font 'Latin Modern Roman Dunhill' (lmromandunh10-regular.otf) normal normal 400 normal>) = 10.05
2021-10-29 02:59:34,600 - matplotlib.font_manager - DEBUG - findfont: score(<Font 'Latin Modern Sans' (lmsans10-oblique.otf) oblique normal 400 normal>) = 11.05
2021-10-29 02:59:34,600 - matplotlib.font_manager - DEBUG - findfont: score(<Font 'Latin Modern Sans' (lmsans10-boldoblique.otf) oblique normal 700 normal>) = 11.335
2021-10-29 02:59:34,600 - matplotlib.font_manager - DEBUG - findfont: score(<Font 'Lato' (Lato-LightItalic.ttf) italic normal 300 normal>) = 11.145
2021-10-29 02:59:34,600 - matplotlib.font_manager - DEBUG - findfont: score(<Font 'DejaVu Serif' (DejaVuSerif-Bold.ttf) normal normal 700 normal>) = 10.335
2021-10-29 02:59:34,600 - matplotlib.font_manager - DEBUG - findfont: score(<Font 'Lato' (Lato-ThinItalic.ttf) italic normal 200 normal>) = 11.24
2021-10-29 02:59:34,600 - matplotlib.font_manager - DEBUG - findfont: score(<Font 'Latin Modern Mono Prop Light' (lmmonoproplt10-boldoblique.otf) oblique normal 700 normal>) = 11.335
2021-10-29 02:59:34,600 - matplotlib.font_manager - DEBUG - findfont: score(<Font 'Lato' (Lato-Bold.ttf) normal normal 700 normal>) = 10.335
2021-10-29 02:59:34,600 - matplotlib.font_manager - DEBUG - findfont: score(<Font 'Latin Modern Roman' (lmroman6-bold.otf) normal normal 700 normal>) = 10.335
2021-10-29 02:59:34,600 - matplotlib.font_manager - DEBUG - findfont: score(<Font 'Latin Modern Roman Demi' (lmromandemi10-regular.otf) normal normal 600 normal>) = 10.24
2021-10-29 02:59:34,600 - matplotlib.font_manager - DEBUG - findfont: score(<Font 'DejaVu Sans Mono' (DejaVuSansMono.ttf) normal normal 400 normal>) = 10.05
2021-10-29 02:59:34,600 - matplotlib.font_manager - DEBUG - findfont: score(<Font 'Latin Modern Mono Light' (lmmonolt10-regular.otf) normal normal 400 normal>) = 10.05
2021-10-29 02:59:34,600 - matplotlib.font_manager - DEBUG - findfont: score(<Font 'Lato' (Lato-Black.ttf) normal normal 900 normal>) = 10.525
2021-10-29 02:59:34,600 - matplotlib.font_manager - DEBUG - findfont: score(<Font 'Latin Modern Mono Caps' (lmmonocaps10-regular.otf) normal normal 400 normal>) = 10.05
2021-10-29 02:59:34,601 - matplotlib.font_manager - DEBUG - findfont: score(<Font 'Latin Modern Roman Demi' (lmromandemi10-oblique.otf) oblique normal 600 normal>) = 11.24
2021-10-29 02:59:34,601 - matplotlib.font_manager - DEBUG - findfont: score(<Font 'Latin Modern Roman' (lmroman9-italic.otf) italic normal 400 normal>) = 11.05
2021-10-29 02:59:34,601 - matplotlib.font_manager - DEBUG - findfont: score(<Font 'Liberation Sans Narrow' (LiberationSansNarrow-Italic.ttf) italic normal 400 condensed>) = 11.25
2021-10-29 02:59:34,601 - matplotlib.font_manager - DEBUG - findfont: score(<Font 'Latin Modern Roman' (lmroman7-regular.otf) normal normal 400 normal>) = 10.05
2021-10-29 02:59:34,601 - matplotlib.font_manager - DEBUG - findfont: score(<Font 'Latin Modern Roman' (lmroman8-regular.otf) normal normal 400 normal>) = 10.05
2021-10-29 02:59:34,601 - matplotlib.font_manager - DEBUG - findfont: score(<Font 'Latin Modern Roman' (lmroman10-bolditalic.otf) italic normal 700 normal>) = 11.335
2021-10-29 02:59:34,601 - matplotlib.font_manager - DEBUG - findfont: score(<Font 'Lato' (Lato-MediumItalic.ttf) italic normal 500 normal>) = 11.145
2021-10-29 02:59:34,601 - matplotlib.font_manager - DEBUG - findfont: score(<Font 'Latin Modern Roman Slanted' (lmromanslant12-regular.otf) normal normal 400 normal>) = 10.05
2021-10-29 02:59:34,601 - matplotlib.font_manager - DEBUG - findfont: score(<Font 'Latin Modern Roman Slanted' (lmromanslant10-regular.otf) normal normal 400 normal>) = 10.05
2021-10-29 02:59:34,601 - matplotlib.font_manager - DEBUG - findfont: score(<Font 'Latin Modern Mono' (lmmono12-regular.otf) normal normal 400 normal>) = 10.05
2021-10-29 02:59:34,601 - matplotlib.font_manager - DEBUG - findfont: score(<Font 'Liberation Serif' (LiberationSerif-BoldItalic.ttf) italic normal 700 normal>) = 11.335
2021-10-29 02:59:34,601 - matplotlib.font_manager - DEBUG - findfont: score(<Font 'Latin Modern Roman' (lmroman8-italic.otf) italic normal 400 normal>) = 11.05
2021-10-29 02:59:34,601 - matplotlib.font_manager - DEBUG - findfont: score(<Font 'Lato' (Lato-HairlineItalic.ttf) italic normal 100 normal>) = 11.335
2021-10-29 02:59:34,601 - matplotlib.font_manager - DEBUG - findfont: score(<Font 'Latin Modern Roman Unslanted' (lmromanunsl10-regular.otf) normal normal 400 normal>) = 10.05
2021-10-29 02:59:34,601 - matplotlib.font_manager - DEBUG - findfont: score(<Font 'Latin Modern Mono' (lmmono10-regular.otf) normal normal 400 normal>) = 10.05
2021-10-29 02:59:34,601 - matplotlib.font_manager - DEBUG - findfont: score(<Font 'DejaVu Sans' (DejaVuSans.ttf) normal normal 400 normal>) = 0.05
2021-10-29 02:59:34,601 - matplotlib.font_manager - DEBUG - findfont: score(<Font 'Latin Modern Roman' (lmroman12-bold.otf) normal normal 700 normal>) = 10.335
2021-10-29 02:59:34,601 - matplotlib.font_manager - DEBUG - findfont: score(<Font 'Latin Modern Roman Caps' (lmromancaps10-regular.otf) normal normal 400 normal>) = 10.05
2021-10-29 02:59:34,601 - matplotlib.font_manager - DEBUG - findfont: score(<Font 'Lato' (Lato-Thin.ttf) normal normal 200 normal>) = 10.24
2021-10-29 02:59:34,601 - matplotlib.font_manager - DEBUG - findfont: score(<Font 'Latin Modern Sans' (lmsans9-regular.otf) normal normal 400 normal>) = 10.05
2021-10-29 02:59:34,601 - matplotlib.font_manager - DEBUG - findfont: score(<Font 'Latin Modern Mono Light' (lmmonolt10-boldoblique.otf) oblique normal 700 normal>) = 11.335
2021-10-29 02:59:34,601 - matplotlib.font_manager - DEBUG - findfont: score(<Font 'Latin Modern Mono Prop Light' (lmmonoproplt10-bold.otf) normal normal 700 normal>) = 10.335
2021-10-29 02:59:34,601 - matplotlib.font_manager - DEBUG - findfont: score(<Font 'Latin Modern Roman' (lmroman6-regular.otf) normal normal 400 normal>) = 10.05
2021-10-29 02:59:34,601 - matplotlib.font_manager - DEBUG - findfont: score(<Font 'Latin Modern Roman' (lmroman9-regular.otf) normal normal 400 normal>) = 10.05
2021-10-29 02:59:34,601 - matplotlib.font_manager - DEBUG - findfont: score(<Font 'Latin Modern Sans' (lmsans8-regular.otf) normal normal 400 normal>) = 10.05
2021-10-29 02:59:34,601 - matplotlib.font_manager - DEBUG - findfont: score(<Font 'Latin Modern Roman' (lmroman9-bold.otf) normal normal 700 normal>) = 10.335
2021-10-29 02:59:34,602 - matplotlib.font_manager - DEBUG - findfont: score(<Font 'Latin Modern Sans Quotation' (lmsansquot8-regular.otf) normal normal 400 normal>) = 10.05
2021-10-29 02:59:34,602 - matplotlib.font_manager - DEBUG - findfont: score(<Font 'Lato' (Lato-Semibold.ttf) normal normal 600 normal>) = 10.24
2021-10-29 02:59:34,602 - matplotlib.font_manager - DEBUG - findfont: score(<Font 'Liberation Sans Narrow' (LiberationSansNarrow-Regular.ttf) normal normal 400 condensed>) = 10.25
2021-10-29 02:59:34,602 - matplotlib.font_manager - DEBUG - findfont: score(<Font 'Liberation Mono' (LiberationMono-Italic.ttf) italic normal 400 normal>) = 11.05
2021-10-29 02:59:34,602 - matplotlib.font_manager - DEBUG - findfont: score(<Font 'Droid Sans Fallback' (DroidSansFallbackFull.ttf) normal normal 400 normal>) = 10.05
2021-10-29 02:59:34,602 - matplotlib.font_manager - DEBUG - findfont: score(<Font 'Latin Modern Roman Slanted' (lmromanslant9-regular.otf) normal normal 400 normal>) = 10.05
2021-10-29 02:59:34,602 - matplotlib.font_manager - DEBUG - findfont: score(<Font 'Liberation Serif' (LiberationSerif-Regular.ttf) normal normal 400 normal>) = 10.05
2021-10-29 02:59:34,602 - matplotlib.font_manager - DEBUG - findfont: Matching sans\-serif:style=normal:variant=normal:weight=normal:stretch=normal:size=18.0 to DejaVu Sans ('/users/qraymondaud/.conda/envs/env/lib/python3.8/site-packages/matplotlib/mpl-data/fonts/ttf/DejaVuSans.ttf') with score of 0.050000.
2021-10-29 02:59:34,798 - speechbrain.utils.train_logger - INFO - epoch: 1, lr: 4.21e-06 - train loss: 7.44, train acc: 3.56e-01 - valid loss: 6.24, valid acc: 5.47e-01, valid error: 4.48e-01
2021-10-29 02:59:37,442 - speechbrain.utils.checkpoints - INFO - Saved an end-of-epoch checkpoint in results/urban_sound/kaldi/fold_10/save/CKPT+2021-10-29+02-59-34+00
2021-10-29 02:59:37,457 - speechbrain.utils.epoch_loop - INFO - Going into epoch 2
2021-10-29 03:14:41,936 - speechbrain.utils.checkpoints - DEBUG - Saved an intra-epoch checkpoint in results/urban_sound/kaldi/fold_10/save/CKPT+2021-10-29+03-14-39+00
2021-10-29 03:16:40,393 - speechbrain.nnet.schedulers - INFO - Changing lr from 8.4e-06 to 8.5e-06
2021-10-29 03:16:40,613 - speechbrain.utils.train_logger - INFO - epoch: 2, lr: 8.43e-06 - train loss: 5.14, train acc: 6.17e-01 - valid loss: 5.46, valid acc: 6.59e-01, valid error: 3.39e-01
2021-10-29 03:16:43,319 - speechbrain.utils.checkpoints - INFO - Saved an end-of-epoch checkpoint in results/urban_sound/kaldi/fold_10/save/CKPT+2021-10-29+03-16-40+00
2021-10-29 03:16:43,469 - speechbrain.utils.checkpoints - INFO - Deleted checkpoint in results/urban_sound/kaldi/fold_10/save/CKPT+2021-10-29+03-14-39+00
2021-10-29 03:16:43,562 - speechbrain.utils.checkpoints - INFO - Deleted checkpoint in results/urban_sound/kaldi/fold_10/save/CKPT+2021-10-29+02-59-34+00
2021-10-29 03:16:43,562 - speechbrain.utils.epoch_loop - INFO - Going into epoch 3
2021-10-29 03:31:49,705 - speechbrain.utils.checkpoints - DEBUG - Saved an intra-epoch checkpoint in results/urban_sound/kaldi/fold_10/save/CKPT+2021-10-29+03-31-47+00
2021-10-29 03:33:47,978 - speechbrain.nnet.schedulers - INFO - Changing lr from 1.3e-05 to 1.3e-05
2021-10-29 03:33:48,197 - speechbrain.utils.train_logger - INFO - epoch: 3, lr: 1.26e-05 - train loss: 4.06, train acc: 7.18e-01 - valid loss: 5.68, valid acc: 6.50e-01, valid error: 3.49e-01
2021-10-29 03:33:50,810 - speechbrain.utils.checkpoints - INFO - Saved an end-of-epoch checkpoint in results/urban_sound/kaldi/fold_10/save/CKPT+2021-10-29+03-33-48+00
2021-10-29 03:33:50,973 - speechbrain.utils.checkpoints - INFO - Deleted checkpoint in results/urban_sound/kaldi/fold_10/save/CKPT+2021-10-29+03-31-47+00
2021-10-29 03:33:50,973 - speechbrain.utils.epoch_loop - INFO - Going into epoch 4
2021-10-29 03:48:54,677 - speechbrain.utils.checkpoints - DEBUG - Saved an intra-epoch checkpoint in results/urban_sound/kaldi/fold_10/save/CKPT+2021-10-29+03-48-52+00
2021-10-29 03:50:57,147 - speechbrain.nnet.schedulers - INFO - Changing lr from 1.7e-05 to 1.7e-05
2021-10-29 03:50:57,365 - speechbrain.utils.train_logger - INFO - epoch: 4, lr: 1.69e-05 - train loss: 3.40, train acc: 7.68e-01 - valid loss: 5.35, valid acc: 6.28e-01, valid error: 3.72e-01
2021-10-29 03:50:59,997 - speechbrain.utils.checkpoints - INFO - Saved an end-of-epoch checkpoint in results/urban_sound/kaldi/fold_10/save/CKPT+2021-10-29+03-50-57+00
2021-10-29 03:51:00,213 - speechbrain.utils.checkpoints - INFO - Deleted checkpoint in results/urban_sound/kaldi/fold_10/save/CKPT+2021-10-29+03-33-48+00
2021-10-29 03:51:00,305 - speechbrain.utils.checkpoints - INFO - Deleted checkpoint in results/urban_sound/kaldi/fold_10/save/CKPT+2021-10-29+03-48-52+00
2021-10-29 03:51:00,306 - speechbrain.utils.epoch_loop - INFO - Going into epoch 5
2021-10-29 04:06:04,351 - speechbrain.utils.checkpoints - DEBUG - Saved an intra-epoch checkpoint in results/urban_sound/kaldi/fold_10/save/CKPT+2021-10-29+04-06-01+00
2021-10-29 04:07:55,927 - speechbrain.nnet.schedulers - INFO - Changing lr from 2.1e-05 to 2.1e-05
2021-10-29 04:07:56,145 - speechbrain.utils.train_logger - INFO - epoch: 5, lr: 2.11e-05 - train loss: 2.76, train acc: 8.13e-01 - valid loss: 5.42, valid acc: 6.14e-01, valid error: 3.79e-01
2021-10-29 04:07:58,747 - speechbrain.utils.checkpoints - INFO - Saved an end-of-epoch checkpoint in results/urban_sound/kaldi/fold_10/save/CKPT+2021-10-29+04-07-56+00
2021-10-29 04:07:59,004 - speechbrain.utils.checkpoints - INFO - Deleted checkpoint in results/urban_sound/kaldi/fold_10/save/CKPT+2021-10-29+04-06-01+00
2021-10-29 04:07:59,097 - speechbrain.utils.checkpoints - INFO - Deleted checkpoint in results/urban_sound/kaldi/fold_10/save/CKPT+2021-10-29+03-50-57+00
2021-10-29 04:07:59,097 - speechbrain.utils.epoch_loop - INFO - Going into epoch 6
2021-10-29 04:23:03,948 - speechbrain.utils.checkpoints - DEBUG - Saved an intra-epoch checkpoint in results/urban_sound/kaldi/fold_10/save/CKPT+2021-10-29+04-23-01+00
2021-10-29 04:25:01,743 - speechbrain.nnet.schedulers - INFO - Changing lr from 2.5e-05 to 2.5e-05
2021-10-29 04:25:01,961 - speechbrain.utils.train_logger - INFO - epoch: 6, lr: 2.53e-05 - train loss: 2.16, train acc: 8.62e-01 - valid loss: 5.13, valid acc: 6.63e-01, valid error: 3.29e-01
2021-10-29 04:25:04,577 - speechbrain.utils.checkpoints - INFO - Saved an end-of-epoch checkpoint in results/urban_sound/kaldi/fold_10/save/CKPT+2021-10-29+04-25-01+00
2021-10-29 04:25:04,866 - speechbrain.utils.checkpoints - INFO - Deleted checkpoint in results/urban_sound/kaldi/fold_10/save/CKPT+2021-10-29+03-16-40+00
2021-10-29 04:25:04,960 - speechbrain.utils.checkpoints - INFO - Deleted checkpoint in results/urban_sound/kaldi/fold_10/save/CKPT+2021-10-29+04-07-56+00
2021-10-29 04:25:05,054 - speechbrain.utils.checkpoints - INFO - Deleted checkpoint in results/urban_sound/kaldi/fold_10/save/CKPT+2021-10-29+04-23-01+00
2021-10-29 04:25:05,054 - speechbrain.utils.epoch_loop - INFO - Going into epoch 7
2021-10-29 04:40:11,220 - speechbrain.utils.checkpoints - DEBUG - Saved an intra-epoch checkpoint in results/urban_sound/kaldi/fold_10/save/CKPT+2021-10-29+04-40-08+00
2021-10-29 04:42:03,340 - speechbrain.nnet.schedulers - INFO - Changing lr from 3e-05 to 3e-05
2021-10-29 04:42:03,558 - speechbrain.utils.train_logger - INFO - epoch: 7, lr: 2.95e-05 - train loss: 1.84, train acc: 8.83e-01 - valid loss: 4.77, valid acc: 6.94e-01, valid error: 2.96e-01
2021-10-29 04:42:06,174 - speechbrain.utils.checkpoints - INFO - Saved an end-of-epoch checkpoint in results/urban_sound/kaldi/fold_10/save/CKPT+2021-10-29+04-42-03+00
2021-10-29 04:42:06,436 - speechbrain.utils.checkpoints - INFO - Deleted checkpoint in results/urban_sound/kaldi/fold_10/save/CKPT+2021-10-29+04-25-01+00
2021-10-29 04:42:06,526 - speechbrain.utils.checkpoints - INFO - Deleted checkpoint in results/urban_sound/kaldi/fold_10/save/CKPT+2021-10-29+04-40-08+00
2021-10-29 04:42:06,527 - speechbrain.utils.epoch_loop - INFO - Going into epoch 8
2021-10-29 04:57:11,142 - speechbrain.utils.checkpoints - DEBUG - Saved an intra-epoch checkpoint in results/urban_sound/kaldi/fold_10/save/CKPT+2021-10-29+04-57-08+00
2021-10-29 04:59:03,536 - speechbrain.nnet.schedulers - INFO - Changing lr from 3.4e-05 to 3.4e-05
2021-10-29 04:59:03,753 - speechbrain.utils.train_logger - INFO - epoch: 8, lr: 3.37e-05 - train loss: 1.55, train acc: 9.04e-01 - valid loss: 6.00, valid acc: 6.48e-01, valid error: 3.44e-01
2021-10-29 04:59:06,372 - speechbrain.utils.checkpoints - INFO - Saved an end-of-epoch checkpoint in results/urban_sound/kaldi/fold_10/save/CKPT+2021-10-29+04-59-03+00
2021-10-29 04:59:06,649 - speechbrain.utils.checkpoints - INFO - Deleted checkpoint in results/urban_sound/kaldi/fold_10/save/CKPT+2021-10-29+04-57-08+00
2021-10-29 04:59:06,650 - speechbrain.utils.epoch_loop - INFO - Going into epoch 9
2021-10-29 05:14:10,613 - speechbrain.utils.checkpoints - DEBUG - Saved an intra-epoch checkpoint in results/urban_sound/kaldi/fold_10/save/CKPT+2021-10-29+05-14-07+00
2021-10-29 05:16:12,428 - speechbrain.nnet.schedulers - INFO - Changing lr from 3.8e-05 to 3.8e-05
2021-10-29 05:16:12,646 - speechbrain.utils.train_logger - INFO - epoch: 9, lr: 3.79e-05 - train loss: 1.36, train acc: 9.12e-01 - valid loss: 6.60, valid acc: 5.97e-01, valid error: 4.03e-01
2021-10-29 05:16:15,280 - speechbrain.utils.checkpoints - INFO - Saved an end-of-epoch checkpoint in results/urban_sound/kaldi/fold_10/save/CKPT+2021-10-29+05-16-12+00
2021-10-29 05:16:15,650 - speechbrain.utils.checkpoints - INFO - Deleted checkpoint in results/urban_sound/kaldi/fold_10/save/CKPT+2021-10-29+05-14-07+00
2021-10-29 05:16:15,743 - speechbrain.utils.checkpoints - INFO - Deleted checkpoint in results/urban_sound/kaldi/fold_10/save/CKPT+2021-10-29+04-59-03+00
2021-10-29 05:16:15,743 - speechbrain.utils.epoch_loop - INFO - Going into epoch 10
2021-10-29 05:31:20,097 - speechbrain.utils.checkpoints - DEBUG - Saved an intra-epoch checkpoint in results/urban_sound/kaldi/fold_10/save/CKPT+2021-10-29+05-31-17+00
2021-10-29 05:33:20,805 - speechbrain.nnet.schedulers - INFO - Changing lr from 4.2e-05 to 4.2e-05
2021-10-29 05:33:21,024 - speechbrain.utils.train_logger - INFO - epoch: 10, lr: 4.21e-05 - train loss: 1.20, train acc: 9.23e-01 - valid loss: 5.95, valid acc: 6.34e-01, valid error: 3.58e-01
2021-10-29 05:33:23,646 - speechbrain.utils.checkpoints - INFO - Saved an end-of-epoch checkpoint in results/urban_sound/kaldi/fold_10/save/CKPT+2021-10-29+05-33-21+00
2021-10-29 05:33:24,048 - speechbrain.utils.checkpoints - INFO - Deleted checkpoint in results/urban_sound/kaldi/fold_10/save/CKPT+2021-10-29+05-16-12+00
2021-10-29 05:33:24,139 - speechbrain.utils.checkpoints - INFO - Deleted checkpoint in results/urban_sound/kaldi/fold_10/save/CKPT+2021-10-29+05-31-17+00
2021-10-29 05:33:24,140 - speechbrain.utils.epoch_loop - INFO - Going into epoch 11
2021-10-29 05:48:27,355 - speechbrain.utils.checkpoints - DEBUG - Saved an intra-epoch checkpoint in results/urban_sound/kaldi/fold_10/save/CKPT+2021-10-29+05-48-24+00
2021-10-29 05:50:23,264 - speechbrain.nnet.schedulers - INFO - Changing lr from 4.6e-05 to 4.6e-05
2021-10-29 05:50:23,481 - speechbrain.utils.train_logger - INFO - epoch: 11, lr: 4.64e-05 - train loss: 1.18, train acc: 9.25e-01 - valid loss: 5.07, valid acc: 7.00e-01, valid error: 3.03e-01
2021-10-29 05:50:26,098 - speechbrain.utils.checkpoints - INFO - Saved an end-of-epoch checkpoint in results/urban_sound/kaldi/fold_10/save/CKPT+2021-10-29+05-50-23+00
2021-10-29 05:50:26,541 - speechbrain.utils.checkpoints - INFO - Deleted checkpoint in results/urban_sound/kaldi/fold_10/save/CKPT+2021-10-29+05-48-24+00
2021-10-29 05:50:26,636 - speechbrain.utils.checkpoints - INFO - Deleted checkpoint in results/urban_sound/kaldi/fold_10/save/CKPT+2021-10-29+05-33-21+00
2021-10-29 05:50:26,636 - speechbrain.utils.epoch_loop - INFO - Going into epoch 12
2021-10-29 06:05:31,152 - speechbrain.utils.checkpoints - DEBUG - Saved an intra-epoch checkpoint in results/urban_sound/kaldi/fold_10/save/CKPT+2021-10-29+06-05-28+00
2021-10-29 06:07:33,438 - speechbrain.nnet.schedulers - INFO - Changing lr from 5.1e-05 to 5.1e-05
2021-10-29 06:07:33,657 - speechbrain.utils.train_logger - INFO - epoch: 12, lr: 5.06e-05 - train loss: 9.09e-01, train acc: 9.41e-01 - valid loss: 5.71, valid acc: 6.58e-01, valid error: 3.33e-01
2021-10-29 06:07:36,275 - speechbrain.utils.checkpoints - INFO - Saved an end-of-epoch checkpoint in results/urban_sound/kaldi/fold_10/save/CKPT+2021-10-29+06-07-33+00
2021-10-29 06:07:36,748 - speechbrain.utils.checkpoints - INFO - Deleted checkpoint in results/urban_sound/kaldi/fold_10/save/CKPT+2021-10-29+06-05-28+00
2021-10-29 06:07:36,840 - speechbrain.utils.checkpoints - INFO - Deleted checkpoint in results/urban_sound/kaldi/fold_10/save/CKPT+2021-10-29+05-50-23+00
2021-10-29 06:07:36,841 - speechbrain.utils.epoch_loop - INFO - Going into epoch 13
2021-10-29 06:22:40,604 - speechbrain.utils.checkpoints - DEBUG - Saved an intra-epoch checkpoint in results/urban_sound/kaldi/fold_10/save/CKPT+2021-10-29+06-22-37+00
2021-10-29 06:24:48,191 - speechbrain.nnet.schedulers - INFO - Changing lr from 5.5e-05 to 5.5e-05
2021-10-29 06:24:48,407 - speechbrain.utils.train_logger - INFO - epoch: 13, lr: 5.48e-05 - train loss: 9.78e-01, train acc: 9.37e-01 - valid loss: 5.44, valid acc: 6.85e-01, valid error: 3.06e-01
2021-10-29 06:24:51,047 - speechbrain.utils.checkpoints - INFO - Saved an end-of-epoch checkpoint in results/urban_sound/kaldi/fold_10/save/CKPT+2021-10-29+06-24-48+00
2021-10-29 06:24:51,550 - speechbrain.utils.checkpoints - INFO - Deleted checkpoint in results/urban_sound/kaldi/fold_10/save/CKPT+2021-10-29+06-22-37+00
2021-10-29 06:24:51,643 - speechbrain.utils.checkpoints - INFO - Deleted checkpoint in results/urban_sound/kaldi/fold_10/save/CKPT+2021-10-29+06-07-33+00
2021-10-29 06:24:51,644 - speechbrain.utils.epoch_loop - INFO - Going into epoch 14
2021-10-29 06:39:57,988 - speechbrain.utils.checkpoints - DEBUG - Saved an intra-epoch checkpoint in results/urban_sound/kaldi/fold_10/save/CKPT+2021-10-29+06-39-55+00
2021-10-29 06:42:04,261 - speechbrain.nnet.schedulers - INFO - Changing lr from 5.9e-05 to 5.9e-05
2021-10-29 06:42:04,494 - speechbrain.utils.train_logger - INFO - epoch: 14, lr: 5.90e-05 - train loss: 7.68e-01, train acc: 9.51e-01 - valid loss: 5.69, valid acc: 6.68e-01, valid error: 3.24e-01
2021-10-29 06:42:07,129 - speechbrain.utils.checkpoints - INFO - Saved an end-of-epoch checkpoint in results/urban_sound/kaldi/fold_10/save/CKPT+2021-10-29+06-42-04+00
2021-10-29 06:42:07,640 - speechbrain.utils.checkpoints - INFO - Deleted checkpoint in results/urban_sound/kaldi/fold_10/save/CKPT+2021-10-29+06-39-55+00
2021-10-29 06:42:07,772 - speechbrain.utils.checkpoints - INFO - Deleted checkpoint in results/urban_sound/kaldi/fold_10/save/CKPT+2021-10-29+06-24-48+00
2021-10-29 06:42:07,772 - speechbrain.utils.epoch_loop - INFO - Going into epoch 15
2021-10-29 06:57:14,024 - speechbrain.utils.checkpoints - DEBUG - Saved an intra-epoch checkpoint in results/urban_sound/kaldi/fold_10/save/CKPT+2021-10-29+06-57-11+00
2021-10-29 06:59:12,796 - speechbrain.nnet.schedulers - INFO - Changing lr from 6.3e-05 to 6.3e-05
2021-10-29 06:59:13,031 - speechbrain.utils.train_logger - INFO - epoch: 15, lr: 6.32e-05 - train loss: 7.46e-01, train acc: 9.53e-01 - valid loss: 5.38, valid acc: 6.91e-01, valid error: 3.06e-01
2021-10-29 06:59:15,684 - speechbrain.utils.checkpoints - INFO - Saved an end-of-epoch checkpoint in results/urban_sound/kaldi/fold_10/save/CKPT+2021-10-29+06-59-13+00
2021-10-29 06:59:16,133 - speechbrain.utils.checkpoints - INFO - Deleted checkpoint in results/urban_sound/kaldi/fold_10/save/CKPT+2021-10-29+06-42-04+00
2021-10-29 06:59:16,226 - speechbrain.utils.checkpoints - INFO - Deleted checkpoint in results/urban_sound/kaldi/fold_10/save/CKPT+2021-10-29+06-57-11+00
2021-10-29 06:59:16,227 - speechbrain.utils.epoch_loop - INFO - Going into epoch 16
2021-10-29 07:14:21,719 - speechbrain.utils.checkpoints - DEBUG - Saved an intra-epoch checkpoint in results/urban_sound/kaldi/fold_10/save/CKPT+2021-10-29+07-14-19+00
2021-10-29 07:16:23,013 - speechbrain.nnet.schedulers - INFO - Changing lr from 6.7e-05 to 6.7e-05
2021-10-29 07:16:23,259 - speechbrain.utils.train_logger - INFO - epoch: 16, lr: 6.74e-05 - train loss: 7.06e-01, train acc: 9.54e-01 - valid loss: 5.91, valid acc: 6.79e-01, valid error: 3.12e-01
2021-10-29 07:16:25,896 - speechbrain.utils.checkpoints - INFO - Saved an end-of-epoch checkpoint in results/urban_sound/kaldi/fold_10/save/CKPT+2021-10-29+07-16-23+00
2021-10-29 07:16:26,467 - speechbrain.utils.checkpoints - INFO - Deleted checkpoint in results/urban_sound/kaldi/fold_10/save/CKPT+2021-10-29+07-14-19+00
2021-10-29 07:16:26,514 - speechbrain.utils.checkpoints - INFO - Deleted checkpoint in results/urban_sound/kaldi/fold_10/save/CKPT+2021-10-29+06-59-13+00
2021-10-29 07:16:26,515 - speechbrain.utils.epoch_loop - INFO - Going into epoch 17
2021-10-29 07:31:31,887 - speechbrain.utils.checkpoints - DEBUG - Saved an intra-epoch checkpoint in results/urban_sound/kaldi/fold_10/save/CKPT+2021-10-29+07-31-29+00
2021-10-29 07:33:39,785 - speechbrain.nnet.schedulers - INFO - Changing lr from 7.2e-05 to 7.2e-05
2021-10-29 07:33:40,012 - speechbrain.utils.train_logger - INFO - epoch: 17, lr: 7.17e-05 - train loss: 6.43e-01, train acc: 9.58e-01 - valid loss: 5.43, valid acc: 6.97e-01, valid error: 2.94e-01
2021-10-29 07:33:42,646 - speechbrain.utils.checkpoints - INFO - Saved an end-of-epoch checkpoint in results/urban_sound/kaldi/fold_10/save/CKPT+2021-10-29+07-33-40+00
2021-10-29 07:33:43,210 - speechbrain.utils.checkpoints - INFO - Deleted checkpoint in results/urban_sound/kaldi/fold_10/save/CKPT+2021-10-29+04-42-03+00
2021-10-29 07:33:43,305 - speechbrain.utils.checkpoints - INFO - Deleted checkpoint in results/urban_sound/kaldi/fold_10/save/CKPT+2021-10-29+07-31-29+00
2021-10-29 07:33:43,358 - speechbrain.utils.checkpoints - INFO - Deleted checkpoint in results/urban_sound/kaldi/fold_10/save/CKPT+2021-10-29+07-16-23+00
2021-10-29 07:33:43,359 - speechbrain.utils.epoch_loop - INFO - Going into epoch 18
2021-10-29 07:48:49,094 - speechbrain.utils.checkpoints - DEBUG - Saved an intra-epoch checkpoint in results/urban_sound/kaldi/fold_10/save/CKPT+2021-10-29+07-48-46+00
2021-10-29 07:50:52,421 - speechbrain.nnet.schedulers - INFO - Changing lr from 7.6e-05 to 7.6e-05
2021-10-29 07:50:52,638 - speechbrain.utils.train_logger - INFO - epoch: 18, lr: 7.59e-05 - train loss: 6.20e-01, train acc: 9.61e-01 - valid loss: 5.50, valid acc: 6.87e-01, valid error: 3.03e-01
2021-10-29 07:50:55,268 - speechbrain.utils.checkpoints - INFO - Saved an end-of-epoch checkpoint in results/urban_sound/kaldi/fold_10/save/CKPT+2021-10-29+07-50-52+00
2021-10-29 07:50:55,756 - speechbrain.utils.checkpoints - INFO - Deleted checkpoint in results/urban_sound/kaldi/fold_10/save/CKPT+2021-10-29+07-48-46+00
2021-10-29 07:50:55,756 - speechbrain.utils.epoch_loop - INFO - Going into epoch 19
2021-10-29 08:06:00,360 - speechbrain.utils.checkpoints - DEBUG - Saved an intra-epoch checkpoint in results/urban_sound/kaldi/fold_10/save/CKPT+2021-10-29+08-05-57+00
2021-10-29 08:07:59,791 - speechbrain.nnet.schedulers - INFO - Changing lr from 8e-05 to 8e-05
2021-10-29 08:08:00,009 - speechbrain.utils.train_logger - INFO - epoch: 19, lr: 8.01e-05 - train loss: 5.16e-01, train acc: 9.68e-01 - valid loss: 5.28, valid acc: 6.94e-01, valid error: 3.03e-01
2021-10-29 08:08:02,647 - speechbrain.utils.checkpoints - INFO - Saved an end-of-epoch checkpoint in results/urban_sound/kaldi/fold_10/save/CKPT+2021-10-29+08-08-00+00
2021-10-29 08:08:03,246 - speechbrain.utils.checkpoints - INFO - Deleted checkpoint in results/urban_sound/kaldi/fold_10/save/CKPT+2021-10-29+08-05-57+00
2021-10-29 08:08:03,344 - speechbrain.utils.checkpoints - INFO - Deleted checkpoint in results/urban_sound/kaldi/fold_10/save/CKPT+2021-10-29+07-50-52+00
2021-10-29 08:08:03,344 - speechbrain.utils.epoch_loop - INFO - Going into epoch 20
2021-10-29 08:23:09,431 - speechbrain.utils.checkpoints - DEBUG - Saved an intra-epoch checkpoint in results/urban_sound/kaldi/fold_10/save/CKPT+2021-10-29+08-23-06+00
2021-10-29 08:25:13,505 - speechbrain.nnet.schedulers - INFO - Changing lr from 8.4e-05 to 8.4e-05
2021-10-29 08:25:13,738 - speechbrain.utils.train_logger - INFO - epoch: 20, lr: 8.43e-05 - train loss: 5.16e-01, train acc: 9.66e-01 - valid loss: 5.65, valid acc: 6.98e-01, valid error: 2.93e-01
2021-10-29 08:25:16,377 - speechbrain.utils.checkpoints - INFO - Saved an end-of-epoch checkpoint in results/urban_sound/kaldi/fold_10/save/CKPT+2021-10-29+08-25-13+00
2021-10-29 08:25:17,066 - speechbrain.utils.checkpoints - INFO - Deleted checkpoint in results/urban_sound/kaldi/fold_10/save/CKPT+2021-10-29+08-08-00+00
2021-10-29 08:25:17,163 - speechbrain.utils.checkpoints - INFO - Deleted checkpoint in results/urban_sound/kaldi/fold_10/save/CKPT+2021-10-29+08-23-06+00
2021-10-29 08:25:17,216 - speechbrain.utils.checkpoints - INFO - Deleted checkpoint in results/urban_sound/kaldi/fold_10/save/CKPT+2021-10-29+07-33-40+00
2021-10-29 08:25:17,216 - speechbrain.utils.epoch_loop - INFO - Going into epoch 21
2021-10-29 08:40:20,948 - speechbrain.utils.checkpoints - DEBUG - Saved an intra-epoch checkpoint in results/urban_sound/kaldi/fold_10/save/CKPT+2021-10-29+08-40-18+00
2021-10-29 08:42:13,852 - speechbrain.nnet.schedulers - INFO - Changing lr from 8.9e-05 to 8.9e-05
2021-10-29 08:42:14,071 - speechbrain.utils.train_logger - INFO - epoch: 21, lr: 8.85e-05 - train loss: 4.73e-01, train acc: 9.70e-01 - valid loss: 6.26, valid acc: 6.48e-01, valid error: 3.44e-01
2021-10-29 08:42:16,695 - speechbrain.utils.checkpoints - INFO - Saved an end-of-epoch checkpoint in results/urban_sound/kaldi/fold_10/save/CKPT+2021-10-29+08-42-14+00
2021-10-29 08:42:17,263 - speechbrain.utils.checkpoints - INFO - Deleted checkpoint in results/urban_sound/kaldi/fold_10/save/CKPT+2021-10-29+08-40-18+00
2021-10-29 08:42:17,263 - speechbrain.utils.epoch_loop - INFO - Going into epoch 22
2021-10-29 08:57:23,353 - speechbrain.utils.checkpoints - DEBUG - Saved an intra-epoch checkpoint in results/urban_sound/kaldi/fold_10/save/CKPT+2021-10-29+08-57-20+00
2021-10-29 08:59:24,458 - speechbrain.nnet.schedulers - INFO - Changing lr from 9.3e-05 to 9.3e-05
2021-10-29 08:59:24,677 - speechbrain.utils.train_logger - INFO - epoch: 22, lr: 9.27e-05 - train loss: 4.83e-01, train acc: 9.68e-01 - valid loss: 5.38, valid acc: 7.06e-01, valid error: 2.84e-01
2021-10-29 08:59:27,346 - speechbrain.utils.checkpoints - INFO - Saved an end-of-epoch checkpoint in results/urban_sound/kaldi/fold_10/save/CKPT+2021-10-29+08-59-24+00
2021-10-29 08:59:28,046 - speechbrain.utils.checkpoints - INFO - Deleted checkpoint in results/urban_sound/kaldi/fold_10/save/CKPT+2021-10-29+08-25-13+00
2021-10-29 08:59:28,144 - speechbrain.utils.checkpoints - INFO - Deleted checkpoint in results/urban_sound/kaldi/fold_10/save/CKPT+2021-10-29+08-57-20+00
2021-10-29 08:59:28,238 - speechbrain.utils.checkpoints - INFO - Deleted checkpoint in results/urban_sound/kaldi/fold_10/save/CKPT+2021-10-29+08-42-14+00
2021-10-29 08:59:28,238 - speechbrain.utils.epoch_loop - INFO - Going into epoch 23
2021-10-29 09:14:31,594 - speechbrain.utils.checkpoints - DEBUG - Saved an intra-epoch checkpoint in results/urban_sound/kaldi/fold_10/save/CKPT+2021-10-29+09-14-28+00
2021-10-29 09:16:38,289 - speechbrain.nnet.schedulers - INFO - Changing lr from 9.7e-05 to 9.7e-05
2021-10-29 09:16:38,505 - speechbrain.utils.train_logger - INFO - epoch: 23, lr: 9.69e-05 - train loss: 4.13e-01, train acc: 9.74e-01 - valid loss: 5.17, valid acc: 7.18e-01, valid error: 2.78e-01
2021-10-29 09:16:41,129 - speechbrain.utils.checkpoints - INFO - Saved an end-of-epoch checkpoint in results/urban_sound/kaldi/fold_10/save/CKPT+2021-10-29+09-16-38+00
2021-10-29 09:16:41,678 - speechbrain.utils.checkpoints - INFO - Deleted checkpoint in results/urban_sound/kaldi/fold_10/save/CKPT+2021-10-29+09-14-28+00
2021-10-29 09:16:41,775 - speechbrain.utils.checkpoints - INFO - Deleted checkpoint in results/urban_sound/kaldi/fold_10/save/CKPT+2021-10-29+08-59-24+00
2021-10-29 09:16:41,775 - speechbrain.utils.epoch_loop - INFO - Going into epoch 24
2021-10-29 09:31:47,211 - speechbrain.utils.checkpoints - DEBUG - Saved an intra-epoch checkpoint in results/urban_sound/kaldi/fold_10/save/CKPT+2021-10-29+09-31-44+00
2021-10-29 09:33:47,416 - speechbrain.nnet.schedulers - INFO - Changing lr from 0.0001 to 0.0001
2021-10-29 09:33:47,634 - speechbrain.utils.train_logger - INFO - epoch: 24, lr: 1.01e-04 - train loss: 4.23e-01, train acc: 9.72e-01 - valid loss: 5.37, valid acc: 7.13e-01, valid error: 2.83e-01
2021-10-29 09:33:50,275 - speechbrain.utils.checkpoints - INFO - Saved an end-of-epoch checkpoint in results/urban_sound/kaldi/fold_10/save/CKPT+2021-10-29+09-33-47+00
2021-10-29 09:33:50,919 - speechbrain.utils.checkpoints - INFO - Deleted checkpoint in results/urban_sound/kaldi/fold_10/save/CKPT+2021-10-29+09-31-44+00
2021-10-29 09:33:50,919 - speechbrain.utils.epoch_loop - INFO - Going into epoch 25
2021-10-29 09:49:42,271 - speechbrain.nnet.schedulers - INFO - Changing lr from 0.00011 to 0.00011
2021-10-29 09:49:42,508 - speechbrain.utils.train_logger - INFO - epoch: 25, lr: 1.05e-04 - train loss: 4.51e-01, train acc: 9.70e-01 - valid loss: 5.57, valid acc: 7.03e-01, valid error: 2.87e-01
2021-10-29 09:49:45,144 - speechbrain.utils.checkpoints - INFO - Saved an end-of-epoch checkpoint in results/urban_sound/kaldi/fold_10/save/CKPT+2021-10-29+09-49-42+00
2021-10-29 09:49:45,754 - speechbrain.utils.checkpoints - INFO - Deleted checkpoint in results/urban_sound/kaldi/fold_10/save/CKPT+2021-10-29+09-33-47+00
2021-10-29 09:49:45,761 - speechbrain.utils.checkpoints - INFO - Loading a checkpoint from results/urban_sound/kaldi/fold_10/save/CKPT+2021-10-29+09-16-38+00
2021-10-29 09:49:45,861 - root - DEBUG - SaveableDataLoader was requested to load a checkpoint, but the DataLoader has already been iterated. The DataLoader file will be ignored. This is normal in evaluation, when a checkpoint is loaded just to retrieve the best model.
2021-10-29 09:51:07,869 - speechbrain.utils.train_logger - INFO - Epoch loaded: 23, 
 Per Class Accuracy: 
0: 0.760
1: 0.690
2: 0.880
3: 0.820
4: 0.812
5: 0.578
6: 0.688
7: 0.802
8: 0.440
9: 0.909, 
 Confusion Matrix: 
[[76  3  1  1  1  8  3  1  4  2]
 [ 6 69  8 13  0  0  4  0  0  0]
 [ 2  1 88  0  0  1  7  0  0  1]
 [ 3  9  1 82  0  0  0  0  5  0]
 [ 0  0  0  0 26  1  0  0  4  1]
 [22  5  2  0  0 48  0  0  6  0]
 [ 0  4 23  1  0  0 64  1  0  0]
 [ 0  0  0  1  2  0 15 77  1  0]
 [ 6  1 19  8  2 14  3  2 44  1]
 [ 1  0  0  2  0  0  0  0  0 30]]
 - test loss: 5.17, test acc: 7.18e-01, test error: 2.78e-01
