{
  "language": "typescript",
  "app": "npx ts-node main.ts",
  "projectId": "8f47ff50-c449-4c20-8e39-55adc77510f2",
  "sendCrashReports": "false",
  "terraformProviders": [],
  "terraformModules": [],
  "context": {
    "excludeStackIdFromLogicalIds": "true",
    "allowSepCharsInLogicalIds": "true"
  }
}
