<?xml version="1.0" encoding="utf-8"?>
<!-- Generator: Adobe Illustrator 24.0.1, SVG Export Plug-In . SVG Version: 6.00 Build 0)  -->
<svg version="1.1" id="FR" xmlns="http://www.w3.org/2000/svg" xmlns:xlink="http://www.w3.org/1999/xlink" x="0px" y="0px"
	 viewBox="0 0 289.3 86" style="enable-background:new 0 0 289.3 86;" xml:space="preserve">
<style type="text/css">
	.st0{fill:#FF6666;}
	.st1{fill:#FFFFFF;}
	.st2{fill:url(#SVGID_1_);}
	.st3{fill:url(#SVGID_2_);}
	.st4{fill:url(#SVGID_3_);}
	.st5{fill:url(#SVGID_4_);}
	.st6{opacity:0.2;enable-background:new    ;}
	.st7{opacity:0.12;enable-background:new    ;}
	.st8{opacity:0.25;fill:#FFFFFF;enable-background:new    ;}
	.st9{fill:#FFFFFF;stroke:#FFFFFF;stroke-width:0.43;stroke-miterlimit:10;}
</style>
<title>fr</title>
<path class="st0" d="M18.4,0H271c10.2,0,18.4,8.2,18.4,18.4v49.2c0,10.2-8.2,18.4-18.4,18.4H18.4C8.2,86,0,77.8,0,67.6V18.4
	C0,8.2,8.2,0,18.4,0z"/>
<path class="st1" d="M146.3,46.9c-5,0-9.1,4.1-9.1,9.2s4.1,9.1,9.2,9.1c5,0,9.1-4.1,9.1-9.1c0.1-5-3.9-9.1-8.9-9.1
	C146.5,46.9,146.4,46.9,146.3,46.9z M146.3,61.5c-3.1,0.2-5.7-2.1-5.9-5.1c-0.2-3.1,2.1-5.7,5.1-5.9c3.1-0.2,5.7,2.1,5.9,5.1
	c0,0.1,0,0.3,0,0.4c0.1,2.9-2.1,5.4-5,5.5C146.4,61.5,146.3,61.5,146.3,61.5z M126.3,46.9c-5,0-9.1,4.1-9.1,9.2c0,5,4.1,9.1,9.2,9.1
	c5,0,9.1-4.1,9.1-9.1c0.1-5-3.9-9.1-8.9-9.1C126.5,46.9,126.4,46.9,126.3,46.9z M126.3,61.5c-3.1,0.2-5.7-2.1-5.9-5.1
	s2.1-5.7,5.1-5.9c3.1-0.2,5.7,2.1,5.9,5.1c0,0.1,0,0.3,0,0.4c0.1,2.9-2.1,5.4-5,5.5C126.4,61.5,126.3,61.5,126.3,61.5z M102.5,49.7
	v3.9h9.3c-0.1,1.8-0.9,3.5-2.1,4.9c-1.9,1.9-4.5,2.9-7.2,2.8c-5.7,0-10.3-4.6-10.3-10.3s4.6-10.3,10.3-10.3c2.6,0,5.1,1,7,2.8
	l2.7-2.7c-2.6-2.6-6.1-4-9.7-3.9c-7.8,0-14.2,6.4-14.2,14.2s6.4,14.2,14.2,14.2c3.7,0.1,7.3-1.3,9.9-4c2.3-2.5,3.5-5.7,3.3-9.1
	c0-0.8-0.1-1.6-0.2-2.4L102.5,49.7z M199.8,52.7c-0.8-2-3.1-5.8-7.8-5.8s-8.6,3.7-8.6,9.1c-0.1,4.9,3.8,9,8.7,9.1c0.1,0,0.2,0,0.3,0
	c3,0,5.9-1.5,7.6-4l-3.1-2.1c-0.9,1.6-2.7,2.5-4.5,2.5c-1.9,0.1-3.7-1-4.4-2.8l12.2-5L199.8,52.7z M187.3,55.7
	c-0.2-2.8,1.9-5.1,4.7-5.3c0,0,0.1,0,0.1,0c1.4-0.1,2.8,0.7,3.4,1.9L187.3,55.7z M177.4,64.5h4V37.7h-4V64.5z M170.8,48.9h-0.1
	c-1.2-1.3-3-2.1-4.8-2c-5,0.2-9,4.4-8.8,9.4c0.2,4.8,4,8.7,8.8,8.8c1.8,0,3.6-0.7,4.8-2.1h0.1v1.3c0,3.5-1.9,5.4-4.9,5.4
	c-2.1,0-3.9-1.3-4.6-3.2l-3.5,1.4c1.3,3.3,4.6,5.4,8.1,5.4c4.7,0,8.7-2.8,8.7-9.5V47.4h-3.8V48.9z M166.2,61.5
	c-3.1-0.2-5.4-2.9-5.1-5.9c0.2-2.7,2.4-4.9,5.1-5.1c2.7,0,4.9,2.3,4.9,5.6S169,61.5,166.2,61.5L166.2,61.5z M218.6,37.7H209v26.9h4
	V54.4h5.6c4.4,0,8.8-3.2,8.8-8.3S223.1,37.7,218.6,37.7L218.6,37.7z M218.7,50.7H213v-9.2h5.7c2.5,0,4.6,2.1,4.6,4.6
	C223.3,48.6,221.3,50.7,218.7,50.7L218.7,50.7z M243.5,46.8c-2.9,0-5.9,1.3-7.1,4.1l3.6,1.5c0.7-1.3,2.2-2.1,3.7-2
	c2.1,0,4.2,1.2,4.2,3.5v0.3c-1.3-0.7-2.7-1-4.2-1c-3.8,0-7.7,2.1-7.7,6c0,3.6,3.1,5.9,6.7,5.9c2.1,0.1,4-0.9,5.1-2.6h0.1v2.1h3.9
	V54.2C251.6,49.5,248.1,46.8,243.5,46.8L243.5,46.8z M243,61.5c-1.3,0-3.1-0.7-3.1-2.3c0-2.1,2.3-2.9,4.2-2.9c1.3,0,2.5,0.3,3.7,0.9
	C247.5,59.7,245.4,61.5,243,61.5z M265.7,47.4L261.1,59H261l-4.8-11.7h-4.3l7.1,16.3l-4.1,9h4.2l11-25.3L265.7,47.4z M229.6,64.6h4
	V37.7h-4V64.6z"/>
<linearGradient id="SVGID_1_" gradientUnits="userSpaceOnUse" x1="46.7475" y1="1012.8475" x2="10.6975" y2="1048.8975" gradientTransform="matrix(1 0 0 1 0 -994.01)">
	<stop  offset="0" style="stop-color:#00A0FF"/>
	<stop  offset="1.000000e-02" style="stop-color:#00A1FF"/>
	<stop  offset="0.26" style="stop-color:#00BEFF"/>
	<stop  offset="0.51" style="stop-color:#00D2FF"/>
	<stop  offset="0.76" style="stop-color:#00DFFF"/>
	<stop  offset="1" style="stop-color:#00E3FF"/>
</linearGradient>
<path class="st2" d="M22.3,16.3c-0.7,0.8-1.1,1.9-1,3v47.5c-0.1,1.1,0.3,2.2,1,3l0.2,0.2l26.6-26.6v-0.6L22.5,16.2L22.3,16.3z"/>
<linearGradient id="SVGID_2_" gradientUnits="userSpaceOnUse" x1="72.6345" y1="1036.9994" x2="19.5622" y2="1036.9994" gradientTransform="matrix(1 0 0 1 0 -994.01)">
	<stop  offset="0" style="stop-color:#FFE000"/>
	<stop  offset="0.41" style="stop-color:#FFBD00"/>
	<stop  offset="0.78" style="stop-color:#FFA500"/>
	<stop  offset="1" style="stop-color:#FF9C00"/>
</linearGradient>
<path class="st3" d="M57.7,52.3l-9.1-9v-0.6l9.1-9l0.2,0.1l10.7,6.1c3.1,1.7,3.1,4.5,0,6.3l-10.7,6.1L57.7,52.3z"/>
<linearGradient id="SVGID_3_" gradientUnits="userSpaceOnUse" x1="53.2525" y1="1042.0325" x2="4.3625" y2="1090.9225" gradientTransform="matrix(1 0 0 1 0 -994.01)">
	<stop  offset="0" style="stop-color:#FF3A44"/>
	<stop  offset="1" style="stop-color:#C31162"/>
</linearGradient>
<path class="st4" d="M58.2,52.2l-9.1-9.1L22.3,69.9c1,1,2.6,1.2,4.5,0.1L58.2,52.2"/>
<linearGradient id="SVGID_4_" gradientUnits="userSpaceOnUse" x1="15.5975" y1="994.5125" x2="37.4275" y2="1016.3425" gradientTransform="matrix(1 0 0 1 0 -994.01)">
	<stop  offset="0" style="stop-color:#32A071"/>
	<stop  offset="7.000000e-02" style="stop-color:#2DA771"/>
	<stop  offset="0.48" style="stop-color:#15CF74"/>
	<stop  offset="0.8" style="stop-color:#06E775"/>
	<stop  offset="1" style="stop-color:#00F076"/>
</linearGradient>
<path class="st5" d="M58.2,34L26.8,16.2c-1.8-1-3.5-0.9-4.5,0.1l26.8,26.8L58.2,34z"/>
<path class="st6" d="M58,52L26.8,69.7c-1.8,1-3.3,0.9-4.3,0l0,0l-0.2,0.2l0,0l0.2,0.2l0,0c1,0.9,2.6,1,4.3,0l31.4-17.8L58,52z"/>
<path class="st7" d="M22.3,69.6c-0.7-0.8-1.1-1.9-1-3v0.3c-0.1,1.1,0.3,2.2,1,3l0.2-0.2L22.3,69.6z"/>
<path class="st7" d="M68.7,45.9L58,52l0.2,0.2l10.5-6c1.3-0.5,2.1-1.7,2.2-3.1l0,0C70.7,44.3,69.8,45.4,68.7,45.9z"/>
<path class="st8" d="M26.8,16.5l41.9,23.8c1.1,0.5,2,1.6,2.2,2.8l0,0c-0.1-1.4-1-2.6-2.2-3.1L26.8,16.2c-3-1.7-5.5-0.3-5.5,3.1v0.3
	C21.3,16.2,23.8,14.8,26.8,16.5z"/>
<path class="st9" d="M88.6,28.1V15.2h3.9c1.8-0.1,3.5,0.6,4.8,1.8c1.2,1.2,1.9,2.9,1.8,4.6c0.1,1.7-0.6,3.4-1.8,4.7
	c-1.3,1.2-3,1.9-4.8,1.8L88.6,28.1z M90.2,26.5h2.3c1.3,0.1,2.6-0.4,3.5-1.3c0.9-1,1.4-2.3,1.3-3.6c0.1-1.3-0.4-2.6-1.3-3.6
	c-1-0.9-2.2-1.4-3.5-1.3h-2.3V26.5z"/>
<path class="st9" d="M101.4,28.1V15.2h1.7v12.9H101.4z"/>
<path class="st9" d="M109.6,28.3c-1,0-1.9-0.3-2.7-0.9c-0.9-0.6-1.5-1.5-1.8-2.6l1.5-0.6c0.2,0.7,0.6,1.3,1.1,1.8
	c0.5,0.5,1.2,0.7,1.9,0.7c0.7,0,1.3-0.2,1.8-0.6c0.5-0.4,0.8-0.9,0.8-1.5c0-0.6-0.3-1.3-0.8-1.7c-0.7-0.5-1.6-0.9-2.4-1.1
	c-1-0.3-1.9-0.7-2.6-1.4c-0.6-0.6-0.9-1.4-0.9-2.2c0-0.9,0.4-1.8,1.1-2.4c0.8-0.7,1.8-1.1,2.9-1c1,0,1.9,0.2,2.7,0.8
	c0.6,0.4,1.1,1.1,1.3,1.8l-1.5,0.6c-0.1-0.5-0.4-0.8-0.8-1.1c-1-0.7-2.3-0.7-3.2,0c-0.4,0.3-0.7,0.8-0.7,1.3c0,0.5,0.2,0.9,0.6,1.2
	c0.5,0.4,1.2,0.7,1.8,0.9c0.6,0.2,1.2,0.4,1.6,0.6c0.5,0.2,0.9,0.5,1.3,0.8c0.4,0.3,0.8,0.7,1,1.2c0.2,0.5,0.3,1.1,0.3,1.6
	c0,0.6-0.1,1.2-0.4,1.7c-0.2,0.5-0.6,0.9-1,1.2c-0.4,0.3-0.9,0.5-1.4,0.7C110.7,28.3,110.2,28.4,109.6,28.3z"/>
<path class="st9" d="M118,28.1h-1.7V15.2h4.4c1.1,0,2.1,0.4,2.8,1.1c1.5,1.4,1.6,3.8,0.2,5.3c-0.1,0.1-0.1,0.1-0.2,0.2
	c-0.8,0.7-1.8,1.1-2.8,1.1H118V28.1z M118,21.2h2.8c0.6,0,1.2-0.2,1.7-0.7c0.8-0.9,0.8-2.2,0-3.1c-0.4-0.5-1-0.7-1.7-0.7H118V21.2z"
	/>
<path class="st9" d="M137.4,26.4c-2.6,2.6-6.8,2.6-9.4,0c-1.3-1.3-1.9-3-1.9-4.8c0-1.8,0.7-3.5,1.9-4.8c2.6-2.6,6.8-2.6,9.4,0
	c1.3,1.3,1.9,3,1.9,4.8C139.3,23.4,138.6,25.1,137.4,26.4z M129.1,25.3c1.9,1.9,5.1,1.9,7,0c1-1,1.5-2.3,1.4-3.7
	c0-1.4-0.5-2.7-1.4-3.7c-1.9-1.9-5.1-1.9-7,0c-1,1-1.5,2.3-1.4,3.7C127.6,23,128.2,24.3,129.1,25.3z"/>
<path class="st9" d="M141.6,28.1V15.2h2l6.3,10h0.1l-0.1-2.5v-7.5h1.6v12.9h-1.7l-6.6-10.5h-0.1l0.1,2.5v8L141.6,28.1z"/>
<path class="st9" d="M154.5,28.1V15.2h1.7v12.9H154.5z"/>
<path class="st9" d="M159.1,28.1V15.2h4.7c1,0,1.9,0.3,2.6,1c0.7,0.6,1.1,1.5,1.1,2.5c0,0.6-0.2,1.1-0.5,1.6
	c-0.3,0.5-0.8,0.8-1.3,1.1v0.1c0.6,0.2,1.2,0.6,1.6,1.1c0.4,0.5,0.6,1.2,0.6,1.8c0,1-0.4,2-1.2,2.6c-0.8,0.7-1.7,1-2.8,1L159.1,28.1
	z M160.7,20.7h3c0.6,0,1.1-0.2,1.5-0.6c0.7-0.8,0.7-2,0-2.7c-0.4-0.4-0.9-0.6-1.4-0.6h-3.1L160.7,20.7z M160.7,26.5h3.3
	c0.6,0,1.2-0.2,1.6-0.7c0.4-0.4,0.6-0.9,0.6-1.5c0-1.2-1-2.1-2.2-2.1h-3.2L160.7,26.5z"/>
<path class="st9" d="M170.1,28.1V15.2h1.6v11.3h5.6v1.6L170.1,28.1z"/>
<path class="st9" d="M187,16.8h-5.9v4.1h5.3v1.5h-5.3v4.1h5.9v1.6h-7.5V15.2h7.5V16.8z"/>
<path class="st9" d="M197,28.3c-1,0-1.9-0.3-2.7-0.9c-0.9-0.6-1.5-1.5-1.8-2.6l1.5-0.6c0.2,0.7,0.6,1.3,1.1,1.8
	c0.5,0.5,1.2,0.7,1.9,0.7c0.7,0,1.3-0.2,1.9-0.6c0.5-0.4,0.8-0.9,0.8-1.5c0-0.6-0.3-1.3-0.8-1.7c-0.7-0.5-1.6-0.9-2.4-1.1
	c-1-0.3-1.8-0.7-2.6-1.4c-0.6-0.6-0.9-1.4-0.9-2.2c0-0.9,0.4-1.8,1.1-2.4c0.8-0.7,1.8-1.1,2.9-1c1,0,1.9,0.2,2.7,0.8
	c0.6,0.4,1.1,1.1,1.3,1.8l-1.5,0.6c-0.1-0.5-0.4-0.8-0.8-1.1c-1-0.7-2.3-0.7-3.3,0c-0.4,0.3-0.7,0.8-0.7,1.3c0,0.5,0.2,0.9,0.6,1.2
	c0.5,0.4,1.2,0.7,1.8,0.9c0.6,0.2,1.2,0.4,1.6,0.6c0.5,0.2,0.9,0.5,1.3,0.8c0.4,0.3,0.8,0.7,1,1.2c0.2,0.5,0.3,1.1,0.3,1.6
	c0,0.6-0.1,1.2-0.4,1.7c-0.2,0.5-0.6,0.9-1,1.2c-0.4,0.3-0.9,0.5-1.4,0.7C198.1,28.3,197.5,28.4,197,28.3z"/>
<path class="st9" d="M208.1,28.3c-1.3,0-2.6-0.5-3.4-1.4c-0.9-1-1.4-2.3-1.3-3.7v-8.1h1.6v8.2c0,0.9,0.2,1.8,0.8,2.5
	c0.6,0.7,1.4,1,2.3,0.9c0.9,0.1,1.7-0.3,2.3-0.9c0.6-0.7,0.8-1.6,0.8-2.5v-8.2h1.6v8.1c0.1,1.4-0.4,2.7-1.2,3.7
	C210.7,27.9,209.5,28.4,208.1,28.3z"/>
<path class="st9" d="M215.6,28.1V15.2h4.4c1.1,0,2.1,0.4,2.8,1.1c1.5,1.4,1.6,3.6,0.3,5.1c-0.6,0.7-1.3,1.1-2.2,1.3v0.1l3.6,5.3v0.1
	h-2l-3.5-5.2h-1.8v5.2L215.6,28.1z M217.2,21.3h2.7c0.6,0,1.2-0.2,1.7-0.6c0.5-0.4,0.7-1,0.7-1.6c0-0.6-0.2-1.1-0.6-1.5
	c-0.4-0.5-1-0.7-1.7-0.7h-2.8V21.3z"/>
</svg>
