[
    {
  "img":"https://gitlab.com/uploads/-/system/user/avatar/11889091/avatar.png?width=96",
  "completedName":"Makhan Diakho",
  "domaine":"Developpement web",
  "duree":"2ans",
  "coach":"Jesus christian Diatta",
  "mail":"makhandiakho95@gmail.com"
    },
    {
        "img":"https://secure.gravatar.com/avatar/a248ecae467b78c947c34eb0f0ef6365?s=192&d=identicon",
        "completedName":"Mahmoud Barry",
        "domaine":"Developpement web",
        "duree":"1ans",
        "coach":"Makhan Diakho",
        "mail":"mahmoud-barry@gmail.com"
          }

    ]