{
  "project_info": {
    "project_number": "552386227324",
    "firebase_url": "https://safeshop-bf774.firebaseio.com",
    "project_id": "safeshop-bf774",
    "storage_bucket": "safeshop-bf774.appspot.com"
  },
  "client": [
    {
      "client_info": {
        "mobilesdk_app_id": "1:552386227324:android:d7315f158684f4d4292df9",
        "android_client_info": {
          "package_name": "com.safeshop"
        }
      },
      "oauth_client": [
        {
          "client_id": "552386227324-t0l4h0bo4kqdqqk5gobi82osntk2ajd1.apps.googleusercontent.com",
          "client_type": 1,
          "android_info": {
            "package_name": "com.safeshop",
            "certificate_hash": "5e8f16062ea3cd2c4a0d547876baa6f38cabf625"
          }
        },
        {
          "client_id": "552386227324-466bgpj51n236q8p7ukdep23ns59jdn3.apps.googleusercontent.com",
          "client_type": 3
        }
      ],
      "api_key": [
        {
          "current_key": "AIzaSyCr6cktbHOY8FXz_T5HZJUnNuinK965gAU"
        }
      ],
      "services": {
        "appinvite_service": {
          "other_platform_oauth_client": [
            {
              "client_id": "552386227324-466bgpj51n236q8p7ukdep23ns59jdn3.apps.googleusercontent.com",
              "client_type": 3
            }
          ]
        }
      }
    }
  ],
  "configuration_version": "1"
}