PC     Output            Line Source
040000                   0001 ; $Id: p.hex8.asm,v 1.2 2023-08-04 15:46:22+02 radek Exp $
040000                   0002 ; $Source: /home/radek/st/repo/agonl2/src/playground/asmlib/p.hex8.asm,v $
040000                   0003 ;---------------------------------------------------------------
040000                   0004 ; P.HEX8 -- Print byte in A as two digit hexadecimal number
040000                   0005 ; IN:	A - byte to print
040000                   0006 ; OUT:	screen
040000                   0007 ; DESTROY: A,F
040000                   0008 ; DEPENDS: -
040000                   0009 ;
040000                   0010 P.HEX8:
040000 F5                0011 	PUSH	AF	; Remember A
040001 1F                0012 	RRA		; Put high nible to low nible
040002 1F                0013 	RRA		;+
040003 1F                0014 	RRA		;+
040004 1F                0015 	RRA		;+
040005 CD 0A 00 04       0016 	CALL	P.HEX4	; Print the high nible
040009 F1                0017 	POP	AF	; Recover A, we need low nible
04000A                   0018 	;pass through	; print low nible
04000A E6 0F             0019 P.HEX4:	AND	$0F	; Mask low bits
04000C C6 90             0020 	ADD	A,$90
04000E 27                0021 	DAA
04000F CE 40             0022 	ADC	A,$40
040011 27                0023 	DAA
040012 5B D7             0024 	RST.L	$10	;.VDU ; print char in A
040014 C9                0025 	RET
040015                   0026 
