PC     Output            Line Source
040000                   0001 ; $Id: p.nl.asm,v 1.3 2023-08-04 13:35:05+02 radek Exp $
040000                   0002 ; $Source: /home/radek/st/repo/agonl2/src/playground/asmlib/p.nl.asm,v $
040000                   0003 ;---------------------------------------------------------------
040000                   0004 ; P.NL - Print New Line (CRLF)
040000                   0005 ; IN:	-
040000                   0006 ; OUT:	screen
040000                   0007 ; DESTROY: AF
040000                   0008 ; DEPENDS: -
040000                   0009 ; NOTE:	Z80 safe
040000                   0010 ;
040000                   0011 P.NL:
040000                   0012 ;@ENTR: PUSH	AF		; Save used registers
040000 3E 0D             0013 	LD	A,'\r'		; Output CR using
040002 5B D7             0014 	RST.L	$10		;+VDU char call
040004 3E 0A             0015 	LD	A,'\n'		; Output LF using
040006 5B D7             0016 	RST.L	$10		;+VDU char call
040008                   0017 ;@LEAV: POP	AF		; Restore used registers
040008 C9                0018 	RET
