[comment encoding = UTF-8 /]
[module util('http://www.eclipse.org/uml2/5.0.0/UML')]
[import uml::to::abs::services::additional_services /]

[template public corePackageName(classifier: Classifier)]
[splName()/].[classifier.umlPkgName()/].core
[/template]


[template public interfaceClass(classifier: Classifier)]
[classifier.name.substitute('Impl', '')/]
[/template]

[template public resourceClass(classifier: Classifier)]
[classifier.name.substitute('Impl', 'ResourceImpl')/]
[/template]

[template public entityClass(classifier: Classifier)]
[classifier.name.substitute('Impl', 'EntityImpl')/]
[/template]

[template public serviceClass(classifier: Classifier)]
[classifier.name.substitute('Impl', 'ServiceImpl')/]
[/template]

[template public repositoryClass(classifier: Classifier)]
[classifier.name.substitute('Impl', 'DbImpl')/]
[/template]


[template public minMethodHeader(o: Operation)]
[o.type.name/] [o.name/]([o.arguments()/])
[/template]

[template public getterMethodHeader(p: Property)]
[p.type.name/] get[p.name.toUpperFirst()/]()
[/template]

[template public setterMethodHeader(p: Property)]
Unit set[p.name.toUpperFirst()/]([p.type.name/] [p.name/])
[/template]

[template public constructorArgs(cls : Class)]
[for (p : Property | cls.attribute->select(type.name <> cls.name)) separator(', ')][p.type.name/] [p.name/][/for]
[/template]

[template public constructorArgsNoType(cls : Class)]
[for (p : Property | cls.attribute->select(type.name <> cls.name)) separator(', ')][p.name/][/for]
[/template]

[template public deltaConstructorArgs(cls: Class)]
[for (prop : Property | cls.getNewAttributes())  separator(', ')][prop.type.standarizedName()/] [prop.name/][/for]
[/template]

[template public arguments(o : Operation)]
[for (param : Parameter | o.ownedParameter->excluding(o.getReturnResult())) separator(', ')][param.type.standarizedName()/] [param.name/][/for]
[/template]

[template public argumentsNoType(o : Operation)]
[for (param : Parameter | o.ownedParameter->excluding(o.getReturnResult())) separator(', ')][param.name/][/for]
[/template]

[template public standarizedName(t: Type)]
[if (t.name.equalsIgnoreCase('Integer'))]int[elseif (t.name.equalsIgnoreCase('Boolean'))]boolean[else][t.name/][/if]
[/template]

[template public standarizedReturnType(t: Type)]
[if (t.name.oclIsInvalid())]void[else][t.standarizedName()/][/if]
[/template]

[template public coreDirectory(classifier: Classifier)]
[classifier.corePackageName()/]/[splName()/]/[classifier.umlPkgName()/]/core/model/
[/template]


[template public modelABS(pkg: Package)]
abs/model/[pkg.coreClassFile() /]
[/template]

[template public resourceABS(pkg: Package)]
abs/resource/[pkg.coreClassFile() /]Resource
[/template]

[template public serviceABS(pkg: Package)]
abs/service/[pkg.coreClassFile() /]Service
[/template]

[template public entityABS(pkg: Package)]
abs/entity/[pkg.coreClassFile() /]Entity
[/template]

[template public repositoryABS(pkg: Package)]
abs/repository/[pkg.coreClassFile() /]Db
[/template]

[template public dModelABS(pkg: Package)]
abs/delta/model/[pkg.name /]Model
[/template]

[template public dResourceABS(pkg: Package)]
abs/delta/resource/[pkg.name /]Resource
[/template]

[template public dServiceABS(pkg: Package)]
abs/delta/service/[pkg.name /]Service
[/template]

[template public dEntityABS(pkg: Package)]
abs/delta/entity/[pkg.name /]Entity
[/template]

[template public coreDirectoryResource(classifier: Classifier)]
[splName()/]/[classifier.umlPkgName()/]/core/resource/
[/template]

[template public moduleName(classifier: Classifier)]
[classifier.umlPkgName()/]
[/template]

[template public corePackageName(pkg : Package)]
[splName()/].[pkg.umlPkgName()/].core
[/template]

[template public coreClassFile(pkg : Package)]
[name.replace('M', '') /]
[/template]

[template public deltaClassFile(pkg : Package)]
[name.replace('D', '') /]
[/template]

[template public routeDName(pkg : Package)]
[(name.replace('D', '').toLower()).replace(' ','-') /]
[/template]

[template public routeName(pkg : Package)]
[(name.replace('M', '').toLower()).replace(' ','-') /]
[/template]

[template public PackageFactory(classifier: Classifier)]
[splName()/].[classifier.umlPkgName()/].[classifier.name.substitute('Impl', 'Factory')/]
[/template]

[template public deltaPackageName(classifier: Classifier)]
[splName()/].[classifier.getDeltaFeatureName()/].[classifier.umlPkgName()/]
[/template]

[template public deltaPackageNameRes(classifier: Classifier)]
[splName()/].[classifier.getDeltaFeatureName()/].[classifier.umlPkgName()/]
[/template]


[template public deltaPackageName(pkg: Package)]
[splName()/].[pkg.getDeltaFeatureName()/].[pkg.umlPkgName()/]
[/template]

[template public splName(classifier: Classifier)]
[classifier.eContainer(Package).eContainer(Package).name/]
[/template]

[template public splName(pkg: Package)]
[pkg.eContainer(Package).name/]
[/template]

[template public splName(cmp : Component)]
[cmp.eContainer(Package).name/]
[/template]

[template public splName(type: Type)]
[type.eContainer(Package).name/]
[/template]


[template public umlPkgName(classifier: Classifier)]
[classifier._package.name.substring(2).toLower()/]
[/template]

[template public umlPkgName(pkg: Package)]
[pkg.name.substring(2).toLower()/]
[/template]

[template public getDeltaFeatureName(classifier: Classifier)]
[comment]can also get association by property[/comment]
[for (ass:Association | classifier.getAssociations()->select(hasStereotype('modifies'))) ][for (rel:Class | ass.relatedElement) ][if (rel <> classifier and classifier.getNearestPackage().hasStereotype('delta'))][rel.umlPkgName()/][/if][/for][/for]
[/template]

[template public getDeltaFeatureNameCamel(classifier: Classifier)]
[comment]can also get association by property[/comment]
[for (ass:Association | classifier.getAssociations()->select(hasStereotype('modifies'))) ][for (rel:Class | ass.relatedElement) ][if (rel <> classifier and classifier.getNearestPackage().hasStereotype('delta'))][rel._package.name.substring(2)/][/if][/for][/for]
[/template]

[template public getDeltaFeatureName(pkg: Package)]
[for (classifier : Classifier | pkg.ownedType->filter(Classifier)->select(hasStereotype('modifiedClass'))) separator('\n')][classifier.getDeltaFeatureName()/][/for]
[/template]

[template public getDeltaFeatureNameCamel(pkg: Package)]
[for (classifier : Classifier | pkg.ownedType->filter(Classifier)->select(hasStereotype('modifiedClass'))) separator('\n')][classifier.getDeltaFeatureNameCamel()/][/for]
[/template]

[template public getModifiedClassName(aClass: Class) post (trim())]
[if ( not (aClass._package.getRelatedPackage() -> at(2)).oclIsUndefined() )][aClass._package.name/][else][aClass.name/][/if]
[/template]

[template public getModifiedModule(aClass: Class)]
[for (ass:Association | aClass.getAssociations()->select(hasStereotype('modifies'))) ][for (rel:Class | ass.relatedElement) ][if (rel <> Class)][rel.eContainer(Package).name /][/if][/for][/for]
[/template]

[template public getPrimaryKey(cls : Class)]
[for (p : Property | cls.attribute)]
[if  (p.name.contains('id') or p.name.contains('Id') )]
[p.visibility/] [p.type.standarizedName()/] [p.name/]; [/if]
[/for]
[/template]

[template public getPrimaryKeyName(cls : Class)]
[for (p : Property | cls.attribute)]
[if  (p.name.contains('id') or p.name.contains('Id'))]
[p.name/][/if][/for]
[/template]

[template public getSelfAttributes(cls : Class)]
[for (p : Property | cls.attribute)]
[if  (p.type.name.equalsIgnoreCase('String') or p.type.name.equalsIgnoreCase('Integer') or p.type.name.equalsIgnoreCase('Boolean'))]
[p.name/][/if]
[/for]
[/template]

[template public getAssocAttributes(cls : Class)]
[for (p : Property | cls.attribute)]
[if  (not(p.type.name.equalsIgnoreCase('String') or p.type.name.equalsIgnoreCase('Integer') or p.type.name.equalsIgnoreCase('Boolean')))]
[p.name/][/if]
[/for]
[/template]

[template public getStereoDelta(cls : Classifier)]
[if (cls.hasStereotype('modifiedInterface') or cls.hasStereotype('modifiedClass'))]modifies[elseif (cls.hasStereotype('addedInterface') or cls.hasStereotype('addedClass'))]adds[else]removes
[/if]
[/template]


[template public getPropertyOperation(aClass: Class)]
	[for (p : Property | aClass.attribute)]
	[p.getAppliedStereotypes().name /] [p.visibility/] [p.type.name/] [p.name/];
	[/for]

	[for (p: Property | aClass.attribute)]
	[if ((p.visibility.toString() = 'private' or p.visibility.toString() = 'protected'))]
	[p.getAppliedStereotypes().name /] [p.getterMethodHeader()/] {	return this.[p.name/]; }
	[p.getAppliedStereotypes().name /] [p.setterMethodHeader()/] { this.[p.name/] = [p.name/]; }
	[/if]
	[/for]

	[for (o: Operation | aClass.ownedOperation ) separator('\n')]
	[o.getAppliedStereotypes().name /] [o.visibility/] [o.minMethodHeader()/] {
		// TODO: implement this method
	}
	[/for]
[/template]
