[comment encoding = Cp1252 /]
[module additional_services('http://www.eclipse.org/uml2/5.0.0/UML')/]

[query public hasStereotype(arg0 : Element, arg1 : String) : Boolean
	= invoke('uml.to.abs.services.AdditionalServices', 'hasStereotype(org.eclipse.uml2.uml.Element, java.lang.String)', Sequence{arg0, arg1})
/]

[query public attributeHasStereotype(arg0 : Class, arg1 : String) : Boolean
	= invoke('uml.to.abs.services.AdditionalServices', 'attributeHasStereotype(org.eclipse.uml2.uml.Class, java.lang.String)', Sequence{arg0, arg1})
/]

[query public getNewAttributes(arg0 : Class) : OrderedSet(Property)
	= invoke('uml.to.abs.services.AdditionalServices', 'getNewAttributes(org.eclipse.uml2.uml.Class)', Sequence{arg0})
/]

[query public getRelatedPackage(arg0 : Package) : OrderedSet(Package)
	= invoke('uml.to.abs.services.AdditionalServices', 'getRelatedPackage(org.eclipse.uml2.uml.Package)', Sequence{arg0})
/]

[query public getRelatedPackage(arg0 : Component) : OrderedSet(Package)
	= invoke('uml.to.abs.services.AdditionalServices', 'getRelatedPackage(org.eclipse.uml2.uml.Component)', Sequence{arg0})
/]

[query public getClientModifiedClass(arg0 : Component) : Class
	= invoke('uml.to.abs.services.AdditionalServices', 'getClientModifiedClass(org.eclipse.uml2.uml.Component)', Sequence{arg0})
/]

[query public getClientPackage(arg0 : Component) : Package
	= invoke('uml.to.abs.services.AdditionalServices', 'getClientPackage(org.eclipse.uml2.uml.Component)', Sequence{arg0})
/]

[query public deleteLastCurlyBracket(arg0 : String) : Boolean
	= invoke('uml.to.abs.services.AdditionalServices', 'deleteLastCurlyBracket(java.lang.String)', Sequence{arg0})
/]
