[comment encoding = UTF-8 /]
[module gendelta_nomodel('http://www.eclipse.org/uml2/5.0.0/UML')]
[import uml::to::abs::services::additional_services /]
[import uml::to::abs::util::util /]
[comment /]


[template public genresourcemethod(pkg : Package)]
[file (pkg.dResourceABS()+ '.abs', false)]
delta [pkg.name/]Resource;
uses M[pkg.deltaClassFile()/]Resource;

import ABSHttpRequest from ABS.Framework.Http;
import Utility, UtilityImpl from ABS.Framework.Utility;
//complete the import export if required

[for (aClass : Class | pkg.ownedType->filter(Class)) separator('\n')]
[aClass.getStereoDelta()/] interface [aClass.interfaceRealization.contract.name/]Resource{
	[for (o: Operation | aClass.ownedOperation ) separator('\n')]
	[o.visibility/] [o.minMethodHeader()/];
	[/for]
}

[aClass.getStereoDelta()/] class [aClass.resourceClass() /] implements [aClass.interfaceClass() /]Resource{
  	[for (o: Operation | aClass.ownedOperation ) separator('\n')]
	[o.visibility/] [o.minMethodHeader()/] {
		// TODO: implement this method
	}
	[/for]

}
[/for]
[/file]

[/template]

[template public genservicemethod(pkg : Package)]
[file (pkg.dServiceABS()+ '.abs', false)]
delta [pkg.name/]Service;
uses M[pkg.deltaClassFile()/]Service;

import ABSHttpRequest from ABS.Framework.Http;
import Utility, UtilityImpl from ABS.Framework.Utility;
//complete the import export if required

[for (aClass : Class | pkg.ownedType->filter(Class)) separator('\n')]
[aClass.getStereoDelta()/] interface [aClass.interfaceRealization.contract.name/]Service{
	[for (o: Operation | aClass.ownedOperation ) separator('\n')]
	[o.visibility/] [o.minMethodHeader()/];
	[/for]
}

[aClass.getStereoDelta()/] class [aClass.serviceClass() /] implements [aClass.interfaceClass() /]Service{
  	[for (o: Operation | aClass.ownedOperation ) separator('\n')]
	[o.visibility/] [o.minMethodHeader()/] {
		// TODO: implement this method
	}
	[/for]

}
[/for]
[/file]

[/template]







