{
	"info": {
		"_postman_id": "8338a41c-0620-4994-b032-6638cced7708",
		"name": "cart-abs-microservices",
		"schema": "https://schema.getpostman.com/json/collection/v2.1.0/collection.json"
	},
	"item": [
		{
			"name": "Create Cart",
			"request": {
				"method": "GET",
				"header": [],
				"url": {
					"raw": "http://localhost:8082/api/cart/create-cart.abs",
					"protocol": "http",
					"host": [
						"localhost"
					],
					"port": "8082",
					"path": [
						"api",
						"cart",
						"create-cart.abs"
					]
				}
			},
			"response": []
		},
		{
			"name": "Get Cart",
			"request": {
				"method": "GET",
				"header": [],
				"url": {
					"raw": "http://localhost:8082/api/cart/get-cart.abs?id=1",
					"protocol": "http",
					"host": [
						"localhost"
					],
					"port": "8082",
					"path": [
						"api",
						"cart",
						"get-cart.abs"
					],
					"query": [
						{
							"key": "id",
							"value": "1"
						}
					]
				}
			},
			"response": []
		},
		{
			"name": "Delete Cart",
			"request": {
				"method": "GET",
				"header": [],
				"url": {
					"raw": "http://localhost:8082/api/cart/delete-cart.abs?id=2",
					"protocol": "http",
					"host": [
						"localhost"
					],
					"port": "8082",
					"path": [
						"api",
						"cart",
						"delete-cart.abs"
					],
					"query": [
						{
							"key": "id",
							"value": "2"
						}
					]
				}
			},
			"response": []
		},
		{
			"name": "Create Cart Item",
			"request": {
				"method": "GET",
				"header": [],
				"url": {
					"raw": "http://localhost:8082/api/cart/create-item.abs?idCart=3&idCatalogItem=3&quantity=5",
					"protocol": "http",
					"host": [
						"localhost"
					],
					"port": "8082",
					"path": [
						"api",
						"cart",
						"create-item.abs"
					],
					"query": [
						{
							"key": "idCart",
							"value": "3"
						},
						{
							"key": "idCatalogItem",
							"value": "3"
						},
						{
							"key": "quantity",
							"value": "5"
						},
						{
							"key": "price",
							"value": "14000",
							"disabled": true
						}
					]
				}
			},
			"response": []
		},
		{
			"name": "Update Cart Item",
			"request": {
				"method": "GET",
				"header": [],
				"url": {
					"raw": "http://localhost:8082/api/cart/update-item.abs?id=5&idCart=3&idCatalogItem=3&quantity=6",
					"protocol": "http",
					"host": [
						"localhost"
					],
					"port": "8082",
					"path": [
						"api",
						"cart",
						"update-item.abs"
					],
					"query": [
						{
							"key": "id",
							"value": "5"
						},
						{
							"key": "idCart",
							"value": "3"
						},
						{
							"key": "idCatalogItem",
							"value": "3"
						},
						{
							"key": "quantity",
							"value": "6"
						},
						{
							"key": "price",
							"value": "14000",
							"disabled": true
						}
					]
				}
			},
			"response": []
		},
		{
			"name": "Delete Cart Item",
			"request": {
				"method": "GET",
				"header": [],
				"url": {
					"raw": "http://localhost:8082/api/cart/delete-item.abs?id=5&idCart=3",
					"protocol": "http",
					"host": [
						"localhost"
					],
					"port": "8082",
					"path": [
						"api",
						"cart",
						"delete-item.abs"
					],
					"query": [
						{
							"key": "id",
							"value": "5"
						},
						{
							"key": "idCart",
							"value": "3"
						}
					]
				}
			},
			"response": []
		},
		{
			"name": "Add Shipping Item",
			"request": {
				"method": "GET",
				"header": [],
				"url": {
					"raw": "http://localhost:8082/api/cart/add-shipping-item.abs?idCart=3&price=100000",
					"protocol": "http",
					"host": [
						"localhost"
					],
					"port": "8082",
					"path": [
						"api",
						"cart",
						"add-shipping-item.abs"
					],
					"query": [
						{
							"key": "idCart",
							"value": "3"
						},
						{
							"key": "price",
							"value": "100000"
						}
					]
				}
			},
			"response": []
		},
		{
			"name": "Checkout",
			"request": {
				"method": "GET",
				"header": [],
				"url": {
					"raw": "http://localhost:8082/api/cart/checkout.abs?id=3&cardNumber=1500392086912849&cardHolderName=IKHLAS AL-AFFAN&cardExpiration=03-2024&cardSecurityNumber=737&cardTypeId=3&street=Jl. Raya Nugroho Notosutanto&city=Depok&state=West Java&country=Indonesia&zipcode=16424",
					"protocol": "http",
					"host": [
						"localhost"
					],
					"port": "8082",
					"path": [
						"api",
						"cart",
						"checkout.abs"
					],
					"query": [
						{
							"key": "id",
							"value": "3"
						},
						{
							"key": "idCreditCard",
							"value": "1",
							"disabled": true
						},
						{
							"key": "cardNumber",
							"value": "1500392086912849"
						},
						{
							"key": "cardHolderName",
							"value": "IKHLAS AL-AFFAN"
						},
						{
							"key": "cardExpiration",
							"value": "03-2024"
						},
						{
							"key": "cardSecurityNumber",
							"value": "737"
						},
						{
							"key": "cardTypeId",
							"value": "3"
						},
						{
							"key": "idAddress",
							"value": "2",
							"disabled": true
						},
						{
							"key": "street",
							"value": "Jl. Raya Nugroho Notosutanto"
						},
						{
							"key": "city",
							"value": "Depok"
						},
						{
							"key": "state",
							"value": "West Java"
						},
						{
							"key": "country",
							"value": "Indonesia"
						},
						{
							"key": "zipcode",
							"value": "16424"
						}
					]
				}
			},
			"response": []
		}
	],
	"protocolProfileBehavior": {}
}