{
	"info": {
		"_postman_id": "2bf7c4b3-ceb8-477b-b9a8-2ea97a6138a7",
		"name": "order-abs-microservices",
		"schema": "https://schema.getpostman.com/json/collection/v2.1.0/collection.json"
	},
	"item": [
		{
			"name": "Create Order",
			"request": {
				"method": "GET",
				"header": [],
				"url": {
					"raw": "http://localhost:8083/api/order/create-order.abs?idOrder=4&totalOrder=5&date=18-08-2020&idCreditCard=1&street=Jl. Raya Nugroho Notosutanto&city=Depok&state=West Java&country=Indonesia&zipcode=16424",
					"protocol": "http",
					"host": [
						"localhost"
					],
					"port": "8083",
					"path": [
						"api",
						"order",
						"create-order.abs"
					],
					"query": [
						{
							"key": "idOrder",
							"value": "4"
						},
						{
							"key": "totalOrder",
							"value": "5"
						},
						{
							"key": "date",
							"value": "18-08-2020"
						},
						{
							"key": "idCreditCard",
							"value": "1"
						},
						{
							"key": "cardNumber",
							"value": "1500392086912849",
							"disabled": true
						},
						{
							"key": "cardHolderName",
							"value": "IKHLAS AL-AFFAN",
							"disabled": true
						},
						{
							"key": "cardExpiration",
							"value": "03-2024",
							"disabled": true
						},
						{
							"key": "cardSecurityNumber",
							"value": "737",
							"disabled": true
						},
						{
							"key": "cardTypeId",
							"value": "3",
							"disabled": true
						},
						{
							"key": "idAddress",
							"value": "2",
							"disabled": true
						},
						{
							"key": "street",
							"value": "Jl. Raya Nugroho Notosutanto"
						},
						{
							"key": "city",
							"value": "Depok"
						},
						{
							"key": "state",
							"value": "West Java"
						},
						{
							"key": "country",
							"value": "Indonesia"
						},
						{
							"key": "zipcode",
							"value": "16424"
						}
					]
				}
			},
			"response": []
		},
		{
			"name": "Cancel Order",
			"request": {
				"method": "GET",
				"header": [],
				"url": {
					"raw": "http://localhost:8083/api/order/cancel-order.abs?id=3",
					"protocol": "http",
					"host": [
						"localhost"
					],
					"port": "8083",
					"path": [
						"api",
						"order",
						"cancel-order.abs"
					],
					"query": [
						{
							"key": "id",
							"value": "3"
						}
					]
				}
			},
			"response": []
		},
		{
			"name": "Get Order",
			"request": {
				"method": "GET",
				"header": [],
				"url": {
					"raw": "http://localhost:8083/api/order/get-order.abs?id=2",
					"protocol": "http",
					"host": [
						"localhost"
					],
					"port": "8083",
					"path": [
						"api",
						"order",
						"get-order.abs"
					],
					"query": [
						{
							"key": "id",
							"value": "2"
						}
					]
				}
			},
			"response": []
		},
		{
			"name": "Ship Order",
			"request": {
				"method": "GET",
				"header": [],
				"url": {
					"raw": "http://localhost:8083/api/order/ship-order.abs?id=2",
					"protocol": "http",
					"host": [
						"localhost"
					],
					"port": "8083",
					"path": [
						"api",
						"order",
						"ship-order.abs"
					],
					"query": [
						{
							"key": "id",
							"value": "2"
						}
					]
				}
			},
			"response": []
		},
		{
			"name": "Get Credit Card Type",
			"request": {
				"method": "GET",
				"header": [],
				"url": {
					"raw": "http://localhost:8083/api/order/get-credit-card-type.abs?id=1",
					"protocol": "http",
					"host": [
						"localhost"
					],
					"port": "8083",
					"path": [
						"api",
						"order",
						"get-credit-card-type.abs"
					],
					"query": [
						{
							"key": "id",
							"value": "1"
						}
					]
				}
			},
			"response": []
		}
	],
	"protocolProfileBehavior": {}
}